Hospital Service Area,Hospital County,Operating Certificate Number,Permanent Facility Id,Facility Name,Age Group,Zip Code - 3 digits,Gender,Race,Ethnicity,Length of Stay,Type of Admission,Patient Disposition,Discharge Year,CCS Diagnosis Code,CCS Diagnosis Description,CCS Procedure Code,CCS Procedure Description,APR DRG Code,APR DRG Description,APR MDC Code,APR MDC Description,APR Severity of Illness Code,APR Severity of Illness Description,APR Risk of Mortality,APR Medical Surgical Description,Payment Typology 1,Payment Typology 2,Payment Typology 3,Birth Weight,Abortion Edit Indicator,Emergency Department Indicator,Total Charges,Total Costs
Western NY,Erie,1401014,000208,John R. Oishei Children's Hospital,0 to 17,140,M,White,Not Span/Hispanic,7,Urgent,Home w/ Home Health Services,2018,PNL014,NEONATAL ABSTINENCE SYNDROME,MRS001,CIRCUMCISION,639,NEONATE BIRTHWT >2499G W OTHER SIGNIFICANT CONDITION,15,NEWBORNS AND OTHER NEONATES WITH CONDITIONS ORIGINATING IN THE PERINATAL PERIOD,2,Moderate,Minor,Medical,Medicaid,Self-Pay,,03400,,false,48212.32,11029.72
Western NY,Erie,1401014,000208,John R. Oishei Children's Hospital,0 to 17,147,F,Other Race,Not Span/Hispanic,5,Newborn,Home w/ Home Health Services,2018,PNL001,LIVEBORN,RES007,AIRWAY INTUBATION,639,NEONATE BIRTHWT >2499G W OTHER SIGNIFICANT CONDITION,15,NEWBORNS AND OTHER NEONATES WITH CONDITIONS ORIGINATING IN THE PERINATAL PERIOD,3,Major,Minor,Medical,Medicaid,Self-Pay,,02500,,false,45897.13,11071.27
New York City,Manhattan,7002054,001464,New York-Presbyterian Hospital - Columbia Presbyterian Center,0 to 17,104,M,White,Spanish/Hispanic,3,Newborn,Home or Self Care,2018,PNL001,LIVEBORN,ESA004,NON-INVASIVE VENTILATION,639,NEONATE BIRTHWT >2499G W OTHER SIGNIFICANT CONDITION,15,NEWBORNS AND OTHER NEONATES WITH CONDITIONS ORIGINATING IN THE PERINATAL PERIOD,1,Minor,Minor,Medical,Blue Cross/Blue Shield,Self-Pay,,03000,,false,32641.57,4494.38
Capital/Adirond,Albany,0101000,000001,Albany Medical Center Hospital,0 to 17,120,F,Other Race,Unknown,6,Urgent,Home or Self Care,2018,PNL004,NEONATAL CEREBRAL DISORDERS,CAR024,VENOUS AND ARTERIAL CATHETER PLACEMENT,639,NEONATE BIRTHWT >2499G W OTHER SIGNIFICANT CONDITION,15,NEWBORNS AND OTHER NEONATES WITH CONDITIONS ORIGINATING IN THE PERINATAL PERIOD,2,Moderate,Minor,Medical,Blue Cross/Blue Shield,,,02600,,false,56388.24,14174.03
New York City,Bronx,7000002,001165,Jacobi Medical Center,0 to 17,104,F,Other Race,Spanish/Hispanic,2,Newborn,Home or Self Care,2018,PNL001,LIVEBORN,ADM010,VACCINATIONS,639,NEONATE BIRTHWT >2499G W OTHER SIGNIFICANT CONDITION,15,NEWBORNS AND OTHER NEONATES WITH CONDITIONS ORIGINATING IN THE PERINATAL PERIOD,1,Minor,Minor,Medical,Medicaid,Medicaid,,03000,,false,4511.59,2669.28
Western NY,Erie,1401014,000208,John R. Oishei Children's Hospital,0 to 17,145,M,White,Not Span/Hispanic,2,Urgent,Home w/ Home Health Services,2018,PNL014,NEONATAL ABSTINENCE SYNDROME,,,639,NEONATE BIRTHWT >2499G W OTHER SIGNIFICANT CONDITION,15,NEWBORNS AND OTHER NEONATES WITH CONDITIONS ORIGINATING IN THE PERINATAL PERIOD,1,Minor,Minor,Medical,Medicaid,Self-Pay,,02600,,false,18719.46,4320.29
New York City,Kings,7001021,001306,New York - Presbyterian Brooklyn Methodist Hospital,0 to 17,112,F,Black/African American,Not Span/Hispanic,5,Newborn,Home or Self Care,2018,PNL001,LIVEBORN,EST002,PHOTOTHERAPY,639,NEONATE BIRTHWT >2499G W OTHER SIGNIFICANT CONDITION,15,NEWBORNS AND OTHER NEONATES WITH CONDITIONS ORIGINATING IN THE PERINATAL PERIOD,1,Minor,Minor,Medical,"Managed Care, Unspecified",Medicaid,Self-Pay,03500,,false,52893.03,11882.28
New York City,Kings,7001021,001306,New York - Presbyterian Brooklyn Methodist Hospital,0 to 17,112,M,Other Race,Not Span/Hispanic,3,Newborn,Home or Self Care,2018,PNL001,LIVEBORN,ESA004,NON-INVASIVE VENTILATION,639,NEONATE BIRTHWT >2499G W OTHER SIGNIFICANT CONDITION,15,NEWBORNS AND OTHER NEONATES WITH CONDITIONS ORIGINATING IN THE PERINATAL PERIOD,2,Moderate,Minor,Medical,"Managed Care, Unspecified",Medicaid,Self-Pay,03600,,false,34636.97,8177.46
New York City,Bronx,7000006,003058,Montefiore Med Center - Jack D Weiler Hosp of A Einstein College Div,0 to 17,104,M,Other Race,Unknown,4,Newborn,Home or Self Care,2018,PNL001,LIVEBORN,SKB008,SKIN EXCISION AND DEBRIDEMENT,639,NEONATE BIRTHWT >2499G W OTHER SIGNIFICANT CONDITION,15,NEWBORNS AND OTHER NEONATES WITH CONDITIONS ORIGINATING IN THE PERINATAL PERIOD,2,Moderate,Moderate,Medical,Blue Cross/Blue Shield,,,03900,,false,61937.73,7301.32
Long Island,Nassau,2908000,000511,NYU Langone Hospital-Long Island,0 to 17,117,M,White,Not Span/Hispanic,2,Newborn,Home or Self Care,2018,PNL001,LIVEBORN,MRS001,CIRCUMCISION,639,NEONATE BIRTHWT >2499G W OTHER SIGNIFICANT CONDITION,15,NEWBORNS AND OTHER NEONATES WITH CONDITIONS ORIGINATING IN THE PERINATAL PERIOD,1,Minor,Minor,Medical,Private Health Insurance,Private Health Insurance,,03400,,false,19865.53,2740.56
New York City,Kings,7001021,001306,New York - Presbyterian Brooklyn Methodist Hospital,0 to 17,112,F,White,Not Span/Hispanic,3,Newborn,Home or Self Care,2018,PNL001,LIVEBORN,ENT004,DIAGNOSTIC AUDIOLOGY,639,NEONATE BIRTHWT >2499G W OTHER SIGNIFICANT CONDITION,15,NEWBORNS AND OTHER NEONATES WITH CONDITIONS ORIGINATING IN THE PERINATAL PERIOD,2,Moderate,Minor,Medical,Private Health Insurance,Self-Pay,,02900,,false,30679.21,7000.75
New York City,Manhattan,7002054,001437,New York-Presbyterian/Lower Manhattan Hospital,0 to 17,100,M,Black/African American,Not Span/Hispanic,3,Newborn,Home or Self Care,2018,PNL001,LIVEBORN,MRS001,CIRCUMCISION,639,NEONATE BIRTHWT >2499G W OTHER SIGNIFICANT CONDITION,15,NEWBORNS AND OTHER NEONATES WITH CONDITIONS ORIGINATING IN THE PERINATAL PERIOD,2,Moderate,Minor,Medical,"Managed Care, Unspecified",Medicaid,Self-Pay,03100,,false,45818.13,8027.89
New York City,Manhattan,7002054,001464,New York-Presbyterian Hospital - Columbia Presbyterian Center,0 to 17,111,M,White,Not Span/Hispanic,4,Newborn,Home or Self Care,2018,PNL001,LIVEBORN,ADM010,VACCINATIONS,639,NEONATE BIRTHWT >2499G W OTHER SIGNIFICANT CONDITION,15,NEWBORNS AND OTHER NEONATES WITH CONDITIONS ORIGINATING IN THE PERINATAL PERIOD,1,Minor,Minor,Medical,Medicaid,Self-Pay,,02900,,false,24176.81,991.26
New York City,Queens,7003000,001626,Elmhurst Hospital Center,0 to 17,113,F,Other Race,Unknown,8,Newborn,Home or Self Care,2018,PNL001,LIVEBORN,ADM010,VACCINATIONS,639,NEONATE BIRTHWT >2499G W OTHER SIGNIFICANT CONDITION,15,NEWBORNS AND OTHER NEONATES WITH CONDITIONS ORIGINATING IN THE PERINATAL PERIOD,2,Moderate,Minor,Medical,Medicaid,Medicaid,,03200,,false,18106.73,10772.89
New York City,Bronx,7000002,001165,Jacobi Medical Center,0 to 17,104,M,Other Race,Unknown,13,Newborn,Home w/ Home Health Services,2018,PNL001,LIVEBORN,ESA004,NON-INVASIVE VENTILATION,639,NEONATE BIRTHWT >2499G W OTHER SIGNIFICANT CONDITION,15,NEWBORNS AND OTHER NEONATES WITH CONDITIONS ORIGINATING IN THE PERINATAL PERIOD,2,Moderate,Minor,Medical,Medicaid,Medicaid,,02700,,false,77749.11,46000.26
New York City,Manhattan,7002053,001463,NYU Langone Hospitals,0 to 17,100,F,White,Spanish/Hispanic,2,Newborn,Home or Self Care,2018,PNL001,LIVEBORN,ENT004,DIAGNOSTIC AUDIOLOGY,639,NEONATE BIRTHWT >2499G W OTHER SIGNIFICANT CONDITION,15,NEWBORNS AND OTHER NEONATES WITH CONDITIONS ORIGINATING IN THE PERINATAL PERIOD,1,Minor,Minor,Medical,Medicaid,,,02600,,false,17574.16,7129.86
Hudson Valley,Westchester,5907001,001097,SJRH - St Johns Division,0 to 17,104,F,White,Spanish/Hispanic,3,Emergency,Home or Self Care,2018,PNL001,LIVEBORN,ADM010,VACCINATIONS,639,NEONATE BIRTHWT >2499G W OTHER SIGNIFICANT CONDITION,15,NEWBORNS AND OTHER NEONATES WITH CONDITIONS ORIGINATING IN THE PERINATAL PERIOD,1,Minor,Minor,Medical,Self-Pay,,,02800,,false,14687.24,4509.96
Capital/Adirond,Albany,0101000,000001,Albany Medical Center Hospital,0 to 17,128,M,Other Race,Unknown,5,Urgent,Home or Self Care,2018,PNL004,NEONATAL CEREBRAL DISORDERS,MRS001,CIRCUMCISION,639,NEONATE BIRTHWT >2499G W OTHER SIGNIFICANT CONDITION,15,NEWBORNS AND OTHER NEONATES WITH CONDITIONS ORIGINATING IN THE PERINATAL PERIOD,2,Moderate,Minor,Medical,"Managed Care, Unspecified",,,03500,,false,50987.29,12224.1
Long Island,Nassau,2908000,000511,NYU Langone Hospital-Long Island,0 to 17,116,F,Black/African American,Not Span/Hispanic,4,Newborn,Home or Self Care,2018,PNL001,LIVEBORN,ESA004,NON-INVASIVE VENTILATION,639,NEONATE BIRTHWT >2499G W OTHER SIGNIFICANT CONDITION,15,NEWBORNS AND OTHER NEONATES WITH CONDITIONS ORIGINATING IN THE PERINATAL PERIOD,1,Minor,Minor,Medical,Medicaid,Medicaid,,03600,,false,58347.82,6907.57
Western NY,Erie,1401014,000208,John R. Oishei Children's Hospital,0 to 17,140,M,Other Race,Not Span/Hispanic,1,Urgent,Home or Self Care,2018,PNL012,NEONATAL DIGESTIVE AND FEEDING DISORDERS,,,639,NEONATE BIRTHWT >2499G W OTHER SIGNIFICANT CONDITION,15,NEWBORNS AND OTHER NEONATES WITH CONDITIONS ORIGINATING IN THE PERINATAL PERIOD,1,Minor,Minor,Medical,Medicaid,Self-Pay,,03900,,false,9980.66,2431.95
New York City,Bronx,7000006,003058,Montefiore Med Center - Jack D Weiler Hosp of A Einstein College Div,0 to 17,104,M,Other Race,Unknown,2,Newborn,Home or Self Care,2018,PNL001,LIVEBORN,MRS001,CIRCUMCISION,639,NEONATE BIRTHWT >2499G W OTHER SIGNIFICANT CONDITION,15,NEWBORNS AND OTHER NEONATES WITH CONDITIONS ORIGINATING IN THE PERINATAL PERIOD,1,Minor,Minor,Medical,Private Health Insurance,,,03400,,false,16267.48,2107
Hudson Valley,Westchester,5902001,001045,White Plains Hospital Center,0 to 17,106,M,Other Race,Not Span/Hispanic,4,Newborn,Home or Self Care,2018,PNL001,LIVEBORN,MRS001,CIRCUMCISION,639,NEONATE BIRTHWT >2499G W OTHER SIGNIFICANT CONDITION,15,NEWBORNS AND OTHER NEONATES WITH CONDITIONS ORIGINATING IN THE PERINATAL PERIOD,1,Minor,Minor,Medical,Private Health Insurance,,,02900,,false,16609,4011.71
Long Island,Suffolk,5153000,000913,Huntington Hospital,0 to 17,117,M,Other Race,Unknown,9,Newborn,Home or Self Care,2018,PNL001,LIVEBORN,EST002,PHOTOTHERAPY,639,NEONATE BIRTHWT >2499G W OTHER SIGNIFICANT CONDITION,15,NEWBORNS AND OTHER NEONATES WITH CONDITIONS ORIGINATING IN THE PERINATAL PERIOD,2,Moderate,Minor,Medical,Medicaid,,,02700,,false,84692.78,25962.08
New York City,Kings,7001020,001305,Maimonides Medical Center,0 to 17,112,F,White,Not Span/Hispanic,2,Newborn,Home or Self Care,2018,PNL001,LIVEBORN,ENT004,DIAGNOSTIC AUDIOLOGY,639,NEONATE BIRTHWT >2499G W OTHER SIGNIFICANT CONDITION,15,NEWBORNS AND OTHER NEONATES WITH CONDITIONS ORIGINATING IN THE PERINATAL PERIOD,1,Minor,Minor,Medical,Private Health Insurance,Self-Pay,,03900,,false,5827,824.88
New York City,Bronx,7000006,003058,Montefiore Med Center - Jack D Weiler Hosp of A Einstein College Div,0 to 17,104,M,Other Race,Unknown,3,Newborn,Home or Self Care,2018,PNL001,LIVEBORN,ESA004,NON-INVASIVE VENTILATION,639,NEONATE BIRTHWT >2499G W OTHER SIGNIFICANT CONDITION,15,NEWBORNS AND OTHER NEONATES WITH CONDITIONS ORIGINATING IN THE PERINATAL PERIOD,1,Minor,Minor,Medical,Medicaid,,,02900,,false,18795.38,2723.01
Central NY,Onondaga,3301008,000636,Crouse Hospital,0 to 17,130,M,White,Not Span/Hispanic,10,Newborn,Home w/ Home Health Services,2018,PNL001,LIVEBORN,ESA003,MECHANICAL VENTILATION,639,NEONATE BIRTHWT >2499G W OTHER SIGNIFICANT CONDITION,15,NEWBORNS AND OTHER NEONATES WITH CONDITIONS ORIGINATING IN THE PERINATAL PERIOD,4,Extreme,Major,Medical,Blue Cross/Blue Shield,,,03300,,false,47827.98,22235.58
New York City,Manhattan,7002054,001464,New York-Presbyterian Hospital - Columbia Presbyterian Center,0 to 17,100,M,Other Race,Not Span/Hispanic,2,Newborn,Home or Self Care,2018,PNL001,LIVEBORN,ENT004,DIAGNOSTIC AUDIOLOGY,639,NEONATE BIRTHWT >2499G W OTHER SIGNIFICANT CONDITION,15,NEWBORNS AND OTHER NEONATES WITH CONDITIONS ORIGINATING IN THE PERINATAL PERIOD,1,Minor,Minor,Medical,Private Health Insurance,Self-Pay,,03300,,false,15278.43,1054.38
New York City,Manhattan,7002054,001464,New York-Presbyterian Hospital - Columbia Presbyterian Center,0 to 17,104,M,White,Spanish/Hispanic,2,Newborn,Home or Self Care,2018,PNL001,LIVEBORN,MRS001,CIRCUMCISION,639,NEONATE BIRTHWT >2499G W OTHER SIGNIFICANT CONDITION,15,NEWBORNS AND OTHER NEONATES WITH CONDITIONS ORIGINATING IN THE PERINATAL PERIOD,1,Minor,Minor,Medical,Private Health Insurance,Self-Pay,,03300,,false,13198.4,874.25
New York City,Bronx,7000006,001168,Montefiore Medical Center-Wakefield Hospital,0 to 17,104,F,Other Race,Unknown,4,Newborn,Home or Self Care,2018,PNL001,LIVEBORN,ESA004,NON-INVASIVE VENTILATION,639,NEONATE BIRTHWT >2499G W OTHER SIGNIFICANT CONDITION,15,NEWBORNS AND OTHER NEONATES WITH CONDITIONS ORIGINATING IN THE PERINATAL PERIOD,1,Minor,Minor,Medical,Medicaid,,,03300,,false,52163.31,6713.68
Hudson Valley,Westchester,5902001,001045,White Plains Hospital Center,0 to 17,106,F,Other Race,Not Span/Hispanic,4,Newborn,Home or Self Care,2018,PNL001,LIVEBORN,ADM010,VACCINATIONS,639,NEONATE BIRTHWT >2499G W OTHER SIGNIFICANT CONDITION,15,NEWBORNS AND OTHER NEONATES WITH CONDITIONS ORIGINATING IN THE PERINATAL PERIOD,2,Moderate,Minor,Medical,Private Health Insurance,,,02700,,false,17869,4446.66
New York City,Kings,7001021,001306,New York - Presbyterian Brooklyn Methodist Hospital,0 to 17,112,M,White,Not Span/Hispanic,2,Newborn,Home or Self Care,2018,PNL001,LIVEBORN,ENT004,DIAGNOSTIC AUDIOLOGY,639,NEONATE BIRTHWT >2499G W OTHER SIGNIFICANT CONDITION,15,NEWBORNS AND OTHER NEONATES WITH CONDITIONS ORIGINATING IN THE PERINATAL PERIOD,1,Minor,Minor,Medical,Private Health Insurance,Self-Pay,,03100,,false,7810.85,894.34
Western NY,Erie,1401014,000208,John R. Oishei Children's Hospital,0 to 17,142,F,White,Not Span/Hispanic,3,Newborn,Home w/ Home Health Services,2018,PNL001,LIVEBORN,ESA004,NON-INVASIVE VENTILATION,639,NEONATE BIRTHWT >2499G W OTHER SIGNIFICANT CONDITION,15,NEWBORNS AND OTHER NEONATES WITH CONDITIONS ORIGINATING IN THE PERINATAL PERIOD,1,Minor,Minor,Medical,Medicaid,Self-Pay,,03200,,false,7115.99,2588.88
Capital/Adirond,Albany,0101000,000001,Albany Medical Center Hospital,0 to 17,121,F,White,Unknown,2,Urgent,Home or Self Care,2018,SYM016,OTHER GENERAL SIGNS AND SYMPTOMS,,,639,NEONATE BIRTHWT >2499G W OTHER SIGNIFICANT CONDITION,15,NEWBORNS AND OTHER NEONATES WITH CONDITIONS ORIGINATING IN THE PERINATAL PERIOD,1,Minor,Minor,Medical,"Managed Care, Unspecified",,,04300,,false,17277.33,4607.87
New York City,Manhattan,7002054,001458,New York-Presbyterian Hospital - New York Weill Cornell Center,0 to 17,111,M,White,Not Span/Hispanic,10,Newborn,Home or Self Care,2018,PNL001,LIVEBORN,MRS001,CIRCUMCISION,639,NEONATE BIRTHWT >2499G W OTHER SIGNIFICANT CONDITION,15,NEWBORNS AND OTHER NEONATES WITH CONDITIONS ORIGINATING IN THE PERINATAL PERIOD,1,Minor,Minor,Medical,Private Health Insurance,Self-Pay,,03100,,false,178904.58,34529.17
New York City,Manhattan,7002054,001458,New York-Presbyterian Hospital - New York Weill Cornell Center,0 to 17,OOS,M,White,Not Span/Hispanic,7,Newborn,Home or Self Care,2018,PNL001,LIVEBORN,ESA004,NON-INVASIVE VENTILATION,639,NEONATE BIRTHWT >2499G W OTHER SIGNIFICANT CONDITION,15,NEWBORNS AND OTHER NEONATES WITH CONDITIONS ORIGINATING IN THE PERINATAL PERIOD,1,Minor,Minor,Medical,Private Health Insurance,Self-Pay,,02900,,false,139452.36,27806.51
New York City,Kings,7001020,001305,Maimonides Medical Center,0 to 17,103,F,Black/African American,Not Span/Hispanic,3,Newborn,Home or Self Care,2018,PNL001,LIVEBORN,ESA004,NON-INVASIVE VENTILATION,639,NEONATE BIRTHWT >2499G W OTHER SIGNIFICANT CONDITION,15,NEWBORNS AND OTHER NEONATES WITH CONDITIONS ORIGINATING IN THE PERINATAL PERIOD,1,Minor,Minor,Medical,Medicaid,Medicaid,Self-Pay,03800,,false,27189.03,4165.07
Capital/Adirond,Schenectady,4601001,000848,Ellis Hospital - Bellevue Woman's Care Center Division,0 to 17,123,M,White,Not Span/Hispanic,2,Newborn,Home or Self Care,2018,PNL001,LIVEBORN,MRS001,CIRCUMCISION,639,NEONATE BIRTHWT >2499G W OTHER SIGNIFICANT CONDITION,15,NEWBORNS AND OTHER NEONATES WITH CONDITIONS ORIGINATING IN THE PERINATAL PERIOD,1,Minor,Minor,Medical,Blue Cross/Blue Shield,,,03500,,false,3195,4572.48
New York City,Manhattan,7002032,001466,Mount Sinai West,0 to 17,103,M,Other Race,Not Span/Hispanic,9,Newborn,Home or Self Care,2018,PNL001,LIVEBORN,CAR024,VENOUS AND ARTERIAL CATHETER PLACEMENT,639,NEONATE BIRTHWT >2499G W OTHER SIGNIFICANT CONDITION,15,NEWBORNS AND OTHER NEONATES WITH CONDITIONS ORIGINATING IN THE PERINATAL PERIOD,2,Moderate,Minor,Medical,Private Health Insurance,Self-Pay,,03500,,false,203712.71,53243.95
New York City,Bronx,7000024,001186,North Central Bronx Hospital,0 to 17,104,M,Other Race,Spanish/Hispanic,5,Newborn,Home or Self Care,2018,PNL001,LIVEBORN,EST002,PHOTOTHERAPY,639,NEONATE BIRTHWT >2499G W OTHER SIGNIFICANT CONDITION,15,NEWBORNS AND OTHER NEONATES WITH CONDITIONS ORIGINATING IN THE PERINATAL PERIOD,2,Moderate,Minor,Medical,Medicaid,Medicaid,,02700,,false,29791.59,17884.16
New York City,Queens,7003004,003376,Cohen Children's Medical Center,0 to 17,110,F,Other Race,Spanish/Hispanic,3,Newborn,Home or Self Care,2018,PNL001,LIVEBORN,ESA003,MECHANICAL VENTILATION,639,NEONATE BIRTHWT >2499G W OTHER SIGNIFICANT CONDITION,15,NEWBORNS AND OTHER NEONATES WITH CONDITIONS ORIGINATING IN THE PERINATAL PERIOD,2,Moderate,Minor,Medical,Blue Cross/Blue Shield,Self-Pay,,03400,,false,28190.65,5466.06
Hudson Valley,Westchester,5922000,001122,New York - Presbyterian Hospital,0 to 17,104,M,Other Race,Not Span/Hispanic,4,Newborn,Home or Self Care,2018,PNL001,LIVEBORN,MRS001,CIRCUMCISION,639,NEONATE BIRTHWT >2499G W OTHER SIGNIFICANT CONDITION,15,NEWBORNS AND OTHER NEONATES WITH CONDITIONS ORIGINATING IN THE PERINATAL PERIOD,2,Moderate,Minor,Medical,Medicaid,,,UNKN,,false,14788,16138.13
New York City,Queens,7003004,003376,Cohen Children's Medical Center,0 to 17,114,M,Other Race,Spanish/Hispanic,5,Newborn,Home or Self Care,2018,PNL001,LIVEBORN,ESA004,NON-INVASIVE VENTILATION,639,NEONATE BIRTHWT >2499G W OTHER SIGNIFICANT CONDITION,15,NEWBORNS AND OTHER NEONATES WITH CONDITIONS ORIGINATING IN THE PERINATAL PERIOD,2,Moderate,Moderate,Medical,Medicaid,Medicaid,Self-Pay,03600,,false,81610.99,15260.82
New York City,Queens,7003004,003376,Cohen Children's Medical Center,0 to 17,112,M,Other Race,Spanish/Hispanic,2,Newborn,Home or Self Care,2018,PNL001,LIVEBORN,MRS001,CIRCUMCISION,639,NEONATE BIRTHWT >2499G W OTHER SIGNIFICANT CONDITION,15,NEWBORNS AND OTHER NEONATES WITH CONDITIONS ORIGINATING IN THE PERINATAL PERIOD,1,Minor,Minor,Medical,Private Health Insurance,Self-Pay,,03300,,false,22772.18,4444.67
New York City,Manhattan,7002032,001466,Mount Sinai West,0 to 17,100,M,Other Race,Spanish/Hispanic,29,Newborn,Home or Self Care,2018,PNL001,LIVEBORN,CAR024,VENOUS AND ARTERIAL CATHETER PLACEMENT,639,NEONATE BIRTHWT >2499G W OTHER SIGNIFICANT CONDITION,15,NEWBORNS AND OTHER NEONATES WITH CONDITIONS ORIGINATING IN THE PERINATAL PERIOD,2,Moderate,Minor,Medical,Blue Cross/Blue Shield,Self-Pay,,03500,,false,395516.35,108652.28
Southern Tier,Chenango,0824000,000128,Chenango Memorial Hospital Inc,0 to 17,138,F,Other Race,Unknown,4,Newborn,Home or Self Care,2018,PNL001,LIVEBORN,ADM010,VACCINATIONS,639,NEONATE BIRTHWT >2499G W OTHER SIGNIFICANT CONDITION,15,NEWBORNS AND OTHER NEONATES WITH CONDITIONS ORIGINATING IN THE PERINATAL PERIOD,1,Minor,Minor,Medical,Medicaid,,,02500,,false,3207.7,5028.58
New York City,Manhattan,7002053,001463,NYU Langone Hospitals,0 to 17,100,M,Other Race,Unknown,6,Newborn,Home or Self Care,2018,PNL001,LIVEBORN,ADM010,VACCINATIONS,639,NEONATE BIRTHWT >2499G W OTHER SIGNIFICANT CONDITION,15,NEWBORNS AND OTHER NEONATES WITH CONDITIONS ORIGINATING IN THE PERINATAL PERIOD,1,Minor,Minor,Medical,Private Health Insurance,,,03800,,false,72830.57,29489.46
New York City,Manhattan,7002054,001437,New York-Presbyterian/Lower Manhattan Hospital,0 to 17,112,M,Other Race,Not Span/Hispanic,2,Newborn,Home or Self Care,2018,PNL001,LIVEBORN,ADM010,VACCINATIONS,639,NEONATE BIRTHWT >2499G W OTHER SIGNIFICANT CONDITION,15,NEWBORNS AND OTHER NEONATES WITH CONDITIONS ORIGINATING IN THE PERINATAL PERIOD,1,Minor,Minor,Medical,Private Health Insurance,Self-Pay,,03000,,false,19849.69,3218.29
Central NY,Onondaga,3301008,000636,Crouse Hospital,0 to 17,134,M,White,Not Span/Hispanic,5,Emergency,Home or Self Care,2018,PNL006,RESPIRATORY PERINATAL CONDITION,MRS001,CIRCUMCISION,639,NEONATE BIRTHWT >2499G W OTHER SIGNIFICANT CONDITION,15,NEWBORNS AND OTHER NEONATES WITH CONDITIONS ORIGINATING IN THE PERINATAL PERIOD,1,Minor,Minor,Medical,Blue Cross/Blue Shield,,,03400,,false,14565.5,7244.86
New York City,Queens,7003004,003376,Cohen Children's Medical Center,0 to 17,115,F,Other Race,Spanish/Hispanic,2,Emergency,Home or Self Care,2018,SYM016,OTHER GENERAL SIGNS AND SYMPTOMS,CNS002,LUMBAR PUNCTURE,639,NEONATE BIRTHWT >2499G W OTHER SIGNIFICANT CONDITION,15,NEWBORNS AND OTHER NEONATES WITH CONDITIONS ORIGINATING IN THE PERINATAL PERIOD,1,Minor,Minor,Medical,Medicaid,Medicaid,Self-Pay,02600,,true,42809.54,8086.23
Capital/Adirond,Albany,0101000,000001,Albany Medical Center Hospital,0 to 17,128,M,Other Race,Unknown,3,Newborn,Home or Self Care,2018,PNL001,LIVEBORN,MRS001,CIRCUMCISION,639,NEONATE BIRTHWT >2499G W OTHER SIGNIFICANT CONDITION,15,NEWBORNS AND OTHER NEONATES WITH CONDITIONS ORIGINATING IN THE PERINATAL PERIOD,1,Minor,Minor,Medical,Blue Cross/Blue Shield,,,02900,,false,6078.85,1680.78
Long Island,Nassau,2908000,000511,NYU Langone Hospital-Long Island,0 to 17,117,F,Black/African American,Not Span/Hispanic,3,Newborn,Home or Self Care,2018,PNL001,LIVEBORN,ENT017,"ENT PROCEDURES, NEC",639,NEONATE BIRTHWT >2499G W OTHER SIGNIFICANT CONDITION,15,NEWBORNS AND OTHER NEONATES WITH CONDITIONS ORIGINATING IN THE PERINATAL PERIOD,1,Minor,Minor,Medical,Private Health Insurance,Private Health Insurance,,03700,,false,29169.48,4010.18
New York City,Manhattan,7002032,001466,Mount Sinai West,0 to 17,112,M,Other Race,Unknown,7,Newborn,Home or Self Care,2018,PNL001,LIVEBORN,CAR024,VENOUS AND ARTERIAL CATHETER PLACEMENT,639,NEONATE BIRTHWT >2499G W OTHER SIGNIFICANT CONDITION,15,NEWBORNS AND OTHER NEONATES WITH CONDITIONS ORIGINATING IN THE PERINATAL PERIOD,2,Moderate,Moderate,Medical,Private Health Insurance,Self-Pay,,03100,,false,108637.2,29042.95
New York City,Manhattan,7002032,001466,Mount Sinai West,0 to 17,100,F,Other Race,Spanish/Hispanic,3,Newborn,Home or Self Care,2018,PNL001,LIVEBORN,ENT004,DIAGNOSTIC AUDIOLOGY,639,NEONATE BIRTHWT >2499G W OTHER SIGNIFICANT CONDITION,15,NEWBORNS AND OTHER NEONATES WITH CONDITIONS ORIGINATING IN THE PERINATAL PERIOD,1,Minor,Minor,Medical,Blue Cross/Blue Shield,Medicaid,Self-Pay,03000,,false,15459,3931.12
New York City,Manhattan,7002054,003975,New York Presbyterian Hospital - Allen Hospital,0 to 17,104,M,Multi-racial,Spanish/Hispanic,4,Newborn,Home or Self Care,2018,PNL001,LIVEBORN,ADM010,VACCINATIONS,639,NEONATE BIRTHWT >2499G W OTHER SIGNIFICANT CONDITION,15,NEWBORNS AND OTHER NEONATES WITH CONDITIONS ORIGINATING IN THE PERINATAL PERIOD,1,Minor,Minor,Medical,Medicaid,Medicaid,Self-Pay,03200,,false,48467.96,10272.84
New York City,Manhattan,7002054,003975,New York Presbyterian Hospital - Allen Hospital,0 to 17,104,M,Multi-racial,Not Span/Hispanic,2,Newborn,Home or Self Care,2018,PNL001,LIVEBORN,ADM010,VACCINATIONS,639,NEONATE BIRTHWT >2499G W OTHER SIGNIFICANT CONDITION,15,NEWBORNS AND OTHER NEONATES WITH CONDITIONS ORIGINATING IN THE PERINATAL PERIOD,1,Minor,Minor,Medical,Medicaid,Medicaid,Self-Pay,03800,,false,12639.93,660.26
Central NY,Onondaga,3301008,000636,Crouse Hospital,0 to 17,136,M,Other Race,Not Span/Hispanic,2,Urgent,Home or Self Care,2018,PNL004,NEONATAL CEREBRAL DISORDERS,ADM017,ADMINISTRATION OF NUTRITIONAL AND ELECTROLYTIC SUBSTANCES,639,NEONATE BIRTHWT >2499G W OTHER SIGNIFICANT CONDITION,15,NEWBORNS AND OTHER NEONATES WITH CONDITIONS ORIGINATING IN THE PERINATAL PERIOD,1,Minor,Minor,Medical,Federal/State/Local/VA,,,03000,,false,5389,2690.47