Hospital Service Area,Hospital County,Operating Certificate Number,Permanent Facility Id,Facility Name,Age Group,Zip Code - 3 digits,Gender,Race,Ethnicity,Length of Stay,Type of Admission,Patient Disposition,Discharge Year,CCS Diagnosis Code,CCS Diagnosis Description,CCS Procedure Code,CCS Procedure Description,APR DRG Code,APR DRG Description,APR MDC Code,APR MDC Description,APR Severity of Illness Code,APR Severity of Illness Description,APR Risk of Mortality,APR Medical Surgical Description,Payment Typology 1,Payment Typology 2,Payment Typology 3,Birth Weight,Abortion Edit Indicator,Emergency Department Indicator,Total Charges,Total Costs
New York City,Manhattan,7002054,001458,New York-Presbyterian Hospital - New York Weill Cornell Center,0 to 17,112,F,White,Not Span/Hispanic,2,Newborn,Home or Self Care,2019,PNL001,LIVEBORN,ENT004,DIAGNOSTIC AUDIOLOGY,639,NEONATE BIRTHWT >2499G W OTHER SIGNIFICANT CONDITION,15,NEWBORNS AND OTHER NEONATES WITH CONDITIONS ORIGINATING IN THE PERINATAL PERIOD,1,Minor,Minor,Medical,"Managed Care, Unspecified",Medicaid,Self-Pay,03200,,false,27771.31,4612.05
New York City,Manhattan,7002054,001458,New York-Presbyterian Hospital - New York Weill Cornell Center,0 to 17,,M,Other Race,Spanish/Hispanic,3,Newborn,Home or Self Care,2019,PNL001,LIVEBORN,ENT004,DIAGNOSTIC AUDIOLOGY,639,NEONATE BIRTHWT >2499G W OTHER SIGNIFICANT CONDITION,15,NEWBORNS AND OTHER NEONATES WITH CONDITIONS ORIGINATING IN THE PERINATAL PERIOD,1,Minor,Minor,Medical,Blue Cross/Blue Shield,Self-Pay,,02900,,false,22517.3,1414.53
New York City,Manhattan,7002054,001458,New York-Presbyterian Hospital - New York Weill Cornell Center,0 to 17,111,F,Other Race,Not Span/Hispanic,4,Newborn,Home or Self Care,2019,PNL001,LIVEBORN,ESA004,NON-INVASIVE VENTILATION,639,NEONATE BIRTHWT >2499G W OTHER SIGNIFICANT CONDITION,15,NEWBORNS AND OTHER NEONATES WITH CONDITIONS ORIGINATING IN THE PERINATAL PERIOD,2,Moderate,Minor,Medical,Private Health Insurance,,,03200,,false,89892.16,17973.28
Hudson Valley,Westchester,5902001,001045,White Plains Hospital Center,0 to 17,104,M,Other Race,Not Span/Hispanic,5,Newborn,Home or Self Care,2019,PNL001,LIVEBORN,ESA004,NON-INVASIVE VENTILATION,639,NEONATE BIRTHWT >2499G W OTHER SIGNIFICANT CONDITION,15,NEWBORNS AND OTHER NEONATES WITH CONDITIONS ORIGINATING IN THE PERINATAL PERIOD,1,Minor,Minor,Medical,Private Health Insurance,,,02600,,false,31288,8838.15
New York City,Kings,7001021,001306,New York - Presbyterian Brooklyn Methodist Hospital,0 to 17,104,M,Other Race,Not Span/Hispanic,3,Newborn,Home or Self Care,2019,PNL001,LIVEBORN,ENT004,DIAGNOSTIC AUDIOLOGY,639,NEONATE BIRTHWT >2499G W OTHER SIGNIFICANT CONDITION,15,NEWBORNS AND OTHER NEONATES WITH CONDITIONS ORIGINATING IN THE PERINATAL PERIOD,1,Minor,Minor,Medical,Blue Cross/Blue Shield,Self-Pay,,03100,,false,12895.35,1500.16
New York City,Kings,7001021,001306,New York - Presbyterian Brooklyn Methodist Hospital,0 to 17,112,M,Other Race,Spanish/Hispanic,3,Newborn,Home or Self Care,2019,PNL001,LIVEBORN,ENT004,DIAGNOSTIC AUDIOLOGY,639,NEONATE BIRTHWT >2499G W OTHER SIGNIFICANT CONDITION,15,NEWBORNS AND OTHER NEONATES WITH CONDITIONS ORIGINATING IN THE PERINATAL PERIOD,1,Minor,Minor,Medical,Private Health Insurance,Self-Pay,,02900,,false,12326.25,1397.57
Southern Tier,Broome,0303001,000058,United Health Services Hospitals Inc. - Wilson Medical Center,0 to 17,139,M,Black/African American,Spanish/Hispanic,5,Newborn,Home or Self Care,2019,PNL001,LIVEBORN,EST002,PHOTOTHERAPY,639,NEONATE BIRTHWT >2499G W OTHER SIGNIFICANT CONDITION,15,NEWBORNS AND OTHER NEONATES WITH CONDITIONS ORIGINATING IN THE PERINATAL PERIOD,2,Moderate,Minor,Medical,Medicaid,Medicaid,,03700,,false,11086.7,4006.9
Southern Tier,Broome,0303001,000058,United Health Services Hospitals Inc. - Wilson Medical Center,0 to 17,137,F,White,Not Span/Hispanic,3,Newborn,Home or Self Care,2019,PNL001,LIVEBORN,ESA004,NON-INVASIVE VENTILATION,639,NEONATE BIRTHWT >2499G W OTHER SIGNIFICANT CONDITION,15,NEWBORNS AND OTHER NEONATES WITH CONDITIONS ORIGINATING IN THE PERINATAL PERIOD,1,Minor,Minor,Medical,Medicaid,Medicaid,,03600,,false,9398.3,2651.85
Western NY,Erie,1401014,000208,John R. Oishei Children's Hospital,0 to 17,140,M,Other Race,Not Span/Hispanic,4,Newborn,Home w/ Home Health Services,2019,PNL001,LIVEBORN,MRS001,CIRCUMCISION,639,NEONATE BIRTHWT >2499G W OTHER SIGNIFICANT CONDITION,15,NEWBORNS AND OTHER NEONATES WITH CONDITIONS ORIGINATING IN THE PERINATAL PERIOD,2,Moderate,Minor,Medical,Medicaid,Self-Pay,,04000,,false,10190.06,3891.94
Western NY,Erie,1401014,000208,John R. Oishei Children's Hospital,0 to 17,140,M,White,Not Span/Hispanic,2,Urgent,Home or Self Care,2019,PNL004,NEONATAL CEREBRAL DISORDERS,MAM011,ELECTROENCEPHALOGRAM (EEG),639,NEONATE BIRTHWT >2499G W OTHER SIGNIFICANT CONDITION,15,NEWBORNS AND OTHER NEONATES WITH CONDITIONS ORIGINATING IN THE PERINATAL PERIOD,1,Minor,Minor,Medical,Blue Cross/Blue Shield,Self-Pay,,03200,,false,20545.41,4834.01
Western NY,Erie,1401014,000208,John R. Oishei Children's Hospital,0 to 17,142,M,Black/African American,Not Span/Hispanic,2,Newborn,Home or Self Care,2019,PNL001,LIVEBORN,MRS001,CIRCUMCISION,639,NEONATE BIRTHWT >2499G W OTHER SIGNIFICANT CONDITION,15,NEWBORNS AND OTHER NEONATES WITH CONDITIONS ORIGINATING IN THE PERINATAL PERIOD,1,Minor,Minor,Medical,Private Health Insurance,Self-Pay,,03200,,false,3958.07,1542.13
New York City,Manhattan,7002054,001458,New York-Presbyterian Hospital - New York Weill Cornell Center,0 to 17,100,M,Other Race,Not Span/Hispanic,7,Newborn,Home or Self Care,2019,PNL001,LIVEBORN,ENT001,LARYNGOSCOPY (DIAGNOSTIC),639,NEONATE BIRTHWT >2499G W OTHER SIGNIFICANT CONDITION,15,NEWBORNS AND OTHER NEONATES WITH CONDITIONS ORIGINATING IN THE PERINATAL PERIOD,2,Moderate,Minor,Medical,Private Health Insurance,Self-Pay,,03000,,false,133874.88,25834.1
New York City,Bronx,7000006,003058,Montefiore Med Center - Jack D Weiler Hosp of A Einstein College Div,0 to 17,104,F,Other Race,Unknown,2,Newborn,Home or Self Care,2019,PNL001,LIVEBORN,ADM010,VACCINATIONS,639,NEONATE BIRTHWT >2499G W OTHER SIGNIFICANT CONDITION,15,NEWBORNS AND OTHER NEONATES WITH CONDITIONS ORIGINATING IN THE PERINATAL PERIOD,1,Minor,Minor,Medical,Medicaid,,,02900,,false,15627.35,2217.18
New York City,Manhattan,7002054,001437,New York-Presbyterian/Lower Manhattan Hospital,0 to 17,100,F,Other Race,Not Span/Hispanic,2,Newborn,Home or Self Care,2019,PNL001,LIVEBORN,ADM015,ADMINISTRATION OF ANTIBIOTICS,639,NEONATE BIRTHWT >2499G W OTHER SIGNIFICANT CONDITION,15,NEWBORNS AND OTHER NEONATES WITH CONDITIONS ORIGINATING IN THE PERINATAL PERIOD,1,Minor,Minor,Medical,Private Health Insurance,Self-Pay,,03000,,false,26703.94,4252.71
Southern Tier,Broome,0303001,000058,United Health Services Hospitals Inc. - Wilson Medical Center,0 to 17,134,M,White,Not Span/Hispanic,3,Newborn,Home or Self Care,2019,PNL001,LIVEBORN,MRS001,CIRCUMCISION,639,NEONATE BIRTHWT >2499G W OTHER SIGNIFICANT CONDITION,15,NEWBORNS AND OTHER NEONATES WITH CONDITIONS ORIGINATING IN THE PERINATAL PERIOD,1,Minor,Minor,Medical,Blue Cross/Blue Shield,,,03900,,false,3009.2,1367.21
New York City,Manhattan,7002053,001463,NYU Langone Hospitals,0 to 17,112,M,White,Unknown,2,Newborn,Home or Self Care,2019,PNL001,LIVEBORN,ADM010,VACCINATIONS,639,NEONATE BIRTHWT >2499G W OTHER SIGNIFICANT CONDITION,15,NEWBORNS AND OTHER NEONATES WITH CONDITIONS ORIGINATING IN THE PERINATAL PERIOD,1,Minor,Minor,Medical,Private Health Insurance,,,03400,,false,22799.11,9076.89
New York City,Kings,7001021,001306,New York - Presbyterian Brooklyn Methodist Hospital,0 to 17,112,F,White,Not Span/Hispanic,2,Newborn,Home or Self Care,2019,PNL001,LIVEBORN,ENT004,DIAGNOSTIC AUDIOLOGY,639,NEONATE BIRTHWT >2499G W OTHER SIGNIFICANT CONDITION,15,NEWBORNS AND OTHER NEONATES WITH CONDITIONS ORIGINATING IN THE PERINATAL PERIOD,1,Minor,Minor,Medical,"Managed Care, Unspecified",Medicaid,Self-Pay,04400,,false,9851.7,1379.58
New York City,Kings,7001003,001288,Brooklyn Hospital Center - Downtown Campus,0 to 17,112,M,Black/African American,Not Span/Hispanic,7,Newborn,Home or Self Care,2019,PNL001,LIVEBORN,ESA004,NON-INVASIVE VENTILATION,639,NEONATE BIRTHWT >2499G W OTHER SIGNIFICANT CONDITION,15,NEWBORNS AND OTHER NEONATES WITH CONDITIONS ORIGINATING IN THE PERINATAL PERIOD,1,Minor,Minor,Medical,Medicaid,Medicaid,Self-Pay,03600,,false,50467.21,5921.1
Western NY,Erie,1401014,000208,John R. Oishei Children's Hospital,0 to 17,142,M,White,Not Span/Hispanic,5,Newborn,Home w/ Home Health Services,2019,PNL001,LIVEBORN,ESA004,NON-INVASIVE VENTILATION,639,NEONATE BIRTHWT >2499G W OTHER SIGNIFICANT CONDITION,15,NEWBORNS AND OTHER NEONATES WITH CONDITIONS ORIGINATING IN THE PERINATAL PERIOD,1,Minor,Minor,Medical,Blue Cross/Blue Shield,Self-Pay,,03000,,false,11877.11,4670.29
New York City,Queens,7003010,001637,New York - Presbyterian/Queens,0 to 17,113,F,Other Race,Not Span/Hispanic,3,Newborn,Home or Self Care,2019,PNL001,LIVEBORN,ESA004,NON-INVASIVE VENTILATION,639,NEONATE BIRTHWT >2499G W OTHER SIGNIFICANT CONDITION,15,NEWBORNS AND OTHER NEONATES WITH CONDITIONS ORIGINATING IN THE PERINATAL PERIOD,1,Minor,Minor,Medical,Private Health Insurance,,,02700,,false,34572.73,5691.16
New York City,Manhattan,7002054,001464,New York-Presbyterian Hospital - Columbia Presbyterian Center,0 to 17,104,M,Black/African American,Spanish/Hispanic,4,Newborn,Home or Self Care,2019,PNL001,LIVEBORN,ADM010,VACCINATIONS,639,NEONATE BIRTHWT >2499G W OTHER SIGNIFICANT CONDITION,15,NEWBORNS AND OTHER NEONATES WITH CONDITIONS ORIGINATING IN THE PERINATAL PERIOD,2,Moderate,Minor,Medical,Medicaid,Medicaid,Self-Pay,03400,,false,45483.27,6269.74
Long Island,Nassau,2908000,000511,NYU Langone Hospital-Long Island,0 to 17,117,F,White,Not Span/Hispanic,2,Newborn,Home or Self Care,2019,PNL001,LIVEBORN,,,639,NEONATE BIRTHWT >2499G W OTHER SIGNIFICANT CONDITION,15,NEWBORNS AND OTHER NEONATES WITH CONDITIONS ORIGINATING IN THE PERINATAL PERIOD,1,Minor,Minor,Medical,Blue Cross/Blue Shield,,,03600,,false,23124.75,3163.82
Western NY,Erie,1401014,003067,Millard Fillmore Suburban Hospital,0 to 17,141,M,White,Not Span/Hispanic,2,Newborn,Home or Self Care,2019,PNL001,LIVEBORN,MRS001,CIRCUMCISION,639,NEONATE BIRTHWT >2499G W OTHER SIGNIFICANT CONDITION,15,NEWBORNS AND OTHER NEONATES WITH CONDITIONS ORIGINATING IN THE PERINATAL PERIOD,1,Minor,Minor,Medical,Private Health Insurance,Self-Pay,,03700,,false,4343.59,1590.93
New York City,Manhattan,7002053,001463,NYU Langone Hospitals,0 to 17,112,M,White,Not Span/Hispanic,4,Newborn,Home or Self Care,2019,PNL001,LIVEBORN,EST002,PHOTOTHERAPY,639,NEONATE BIRTHWT >2499G W OTHER SIGNIFICANT CONDITION,15,NEWBORNS AND OTHER NEONATES WITH CONDITIONS ORIGINATING IN THE PERINATAL PERIOD,1,Minor,Minor,Medical,Private Health Insurance,,,03500,,false,52944.11,21080.91
Capital/Adirond,Schenectady,4601001,000848,Ellis Hospital - Bellevue Woman's Care Center Division,0 to 17,123,M,White,Not Span/Hispanic,2,Newborn,Home or Self Care,2019,PNL001,LIVEBORN,MRS001,CIRCUMCISION,639,NEONATE BIRTHWT >2499G W OTHER SIGNIFICANT CONDITION,15,NEWBORNS AND OTHER NEONATES WITH CONDITIONS ORIGINATING IN THE PERINATAL PERIOD,1,Minor,Minor,Medical,Private Health Insurance,Private Health Insurance,,03900,,false,3888.5,5610.53
New York City,Bronx,7000006,003058,Montefiore Med Center - Jack D Weiler Hosp of A Einstein College Div,0 to 17,100,M,Other Race,Unknown,2,Newborn,Home or Self Care,2019,PNL001,LIVEBORN,ADM010,VACCINATIONS,639,NEONATE BIRTHWT >2499G W OTHER SIGNIFICANT CONDITION,15,NEWBORNS AND OTHER NEONATES WITH CONDITIONS ORIGINATING IN THE PERINATAL PERIOD,1,Minor,Moderate,Medical,Medicaid,,,02900,,false,15798.36,2304.09
New York City,Kings,7001021,001306,New York - Presbyterian Brooklyn Methodist Hospital,0 to 17,113,M,White,Not Span/Hispanic,2,Newborn,Home or Self Care,2019,PNL001,LIVEBORN,ENT004,DIAGNOSTIC AUDIOLOGY,639,NEONATE BIRTHWT >2499G W OTHER SIGNIFICANT CONDITION,15,NEWBORNS AND OTHER NEONATES WITH CONDITIONS ORIGINATING IN THE PERINATAL PERIOD,1,Minor,Minor,Medical,Medicaid,Self-Pay,,03000,,false,8624.25,995.95
New York City,Queens,7003010,001637,New York - Presbyterian/Queens,0 to 17,113,F,Other Race,Not Span/Hispanic,11,Newborn,Home or Self Care,2019,PNL001,LIVEBORN,ADM015,ADMINISTRATION OF ANTIBIOTICS,639,NEONATE BIRTHWT >2499G W OTHER SIGNIFICANT CONDITION,15,NEWBORNS AND OTHER NEONATES WITH CONDITIONS ORIGINATING IN THE PERINATAL PERIOD,2,Moderate,Minor,Medical,"Managed Care, Unspecified",Medicaid,Self-Pay,02600,,false,135584.61,25048.52
Central NY,Onondaga,3301008,000636,Crouse Hospital,0 to 17,130,M,Other Race,Not Span/Hispanic,7,Newborn,Home w/ Home Health Services,2019,PNL001,LIVEBORN,RES007,AIRWAY INTUBATION,639,NEONATE BIRTHWT >2499G W OTHER SIGNIFICANT CONDITION,15,NEWBORNS AND OTHER NEONATES WITH CONDITIONS ORIGINATING IN THE PERINATAL PERIOD,3,Major,Minor,Medical,Blue Cross/Blue Shield,,,03300,,false,30071.42,14200.98
New York City,Manhattan,7002032,001466,Mount Sinai West,0 to 17,113,M,White,Not Span/Hispanic,3,Newborn,Home or Self Care,2019,PNL001,LIVEBORN,EST002,PHOTOTHERAPY,639,NEONATE BIRTHWT >2499G W OTHER SIGNIFICANT CONDITION,15,NEWBORNS AND OTHER NEONATES WITH CONDITIONS ORIGINATING IN THE PERINATAL PERIOD,1,Minor,Minor,Medical,Private Health Insurance,Self-Pay,,03800,,false,37836.17,10777.44
New York City,Manhattan,7002053,001463,NYU Langone Hospitals,0 to 17,100,F,Other Race,Unknown,4,Newborn,Home or Self Care,2019,PNL001,LIVEBORN,ENT004,DIAGNOSTIC AUDIOLOGY,639,NEONATE BIRTHWT >2499G W OTHER SIGNIFICANT CONDITION,15,NEWBORNS AND OTHER NEONATES WITH CONDITIONS ORIGINATING IN THE PERINATAL PERIOD,1,Minor,Moderate,Medical,Private Health Insurance,,,03100,,false,47740.02,19288.05
New York City,Kings,7001003,001288,Brooklyn Hospital Center - Downtown Campus,0 to 17,112,M,Other Race,Not Span/Hispanic,3,Newborn,Home or Self Care,2019,PNL001,LIVEBORN,MRS001,CIRCUMCISION,639,NEONATE BIRTHWT >2499G W OTHER SIGNIFICANT CONDITION,15,NEWBORNS AND OTHER NEONATES WITH CONDITIONS ORIGINATING IN THE PERINATAL PERIOD,1,Minor,Minor,Medical,Medicaid,Medicaid,Self-Pay,03700,,false,24730.61,2993.22
New York City,Bronx,7000001,001178,BronxCare Hospital Center,0 to 17,104,M,Other Race,Spanish/Hispanic,3,Newborn,Home or Self Care,2019,PNL001,LIVEBORN,ADM010,VACCINATIONS,639,NEONATE BIRTHWT >2499G W OTHER SIGNIFICANT CONDITION,15,NEWBORNS AND OTHER NEONATES WITH CONDITIONS ORIGINATING IN THE PERINATAL PERIOD,1,Minor,Minor,Medical,Medicaid,Medicaid,,03500,,false,13526.49,16625.72
New York City,Manhattan,7002053,001463,NYU Langone Hospitals,0 to 17,112,F,White,Unknown,2,Newborn,Home or Self Care,2019,PNL001,LIVEBORN,,,639,NEONATE BIRTHWT >2499G W OTHER SIGNIFICANT CONDITION,15,NEWBORNS AND OTHER NEONATES WITH CONDITIONS ORIGINATING IN THE PERINATAL PERIOD,1,Minor,Minor,Medical,Blue Cross/Blue Shield,,,03200,,false,25580.76,9953.72
New York City,Kings,7001021,001306,New York - Presbyterian Brooklyn Methodist Hospital,0 to 17,OOS,M,Black/African American,Not Span/Hispanic,2,Newborn,Home or Self Care,2019,PNL001,LIVEBORN,MRS001,CIRCUMCISION,639,NEONATE BIRTHWT >2499G W OTHER SIGNIFICANT CONDITION,15,NEWBORNS AND OTHER NEONATES WITH CONDITIONS ORIGINATING IN THE PERINATAL PERIOD,1,Minor,Minor,Medical,"Managed Care, Unspecified",Medicaid,Self-Pay,02700,,false,22698.7,5248.6
New York City,Richmond,7004003,001740,Staten Island University Hosp-North,0 to 17,103,M,White,Not Span/Hispanic,14,Newborn,Home or Self Care,2019,PNL001,LIVEBORN,MRS001,CIRCUMCISION,639,NEONATE BIRTHWT >2499G W OTHER SIGNIFICANT CONDITION,15,NEWBORNS AND OTHER NEONATES WITH CONDITIONS ORIGINATING IN THE PERINATAL PERIOD,2,Moderate,Moderate,Medical,Medicaid,Medicaid,,04500,,false,52490.02,41144.75
New York City,Richmond,7004003,001740,Staten Island University Hosp-North,0 to 17,103,F,White,Not Span/Hispanic,2,Newborn,Home or Self Care,2019,PNL001,LIVEBORN,,,639,NEONATE BIRTHWT >2499G W OTHER SIGNIFICANT CONDITION,15,NEWBORNS AND OTHER NEONATES WITH CONDITIONS ORIGINATING IN THE PERINATAL PERIOD,1,Minor,Minor,Medical,Blue Cross/Blue Shield,,,02700,,false,6239.32,2538.46
Capital/Adirond,Columbia,1001000,000146,Columbia Memorial Hospital,0 to 17,124,F,White,Unknown,16,Elective,Home or Self Care,2019,PNL001,LIVEBORN,,,639,NEONATE BIRTHWT >2499G W OTHER SIGNIFICANT CONDITION,15,NEWBORNS AND OTHER NEONATES WITH CONDITIONS ORIGINATING IN THE PERINATAL PERIOD,1,Minor,Minor,Medical,Medicaid,,,03100,,false,32027.23,18590.53
Southern Tier,Broome,0303001,000058,United Health Services Hospitals Inc. - Wilson Medical Center,0 to 17,138,F,White,Not Span/Hispanic,5,Newborn,Home or Self Care,2019,PNL001,LIVEBORN,EST002,PHOTOTHERAPY,639,NEONATE BIRTHWT >2499G W OTHER SIGNIFICANT CONDITION,15,NEWBORNS AND OTHER NEONATES WITH CONDITIONS ORIGINATING IN THE PERINATAL PERIOD,1,Minor,Minor,Medical,Medicaid,,,02900,,false,6121.7,1690.02
Southern Tier,Broome,0303001,000058,United Health Services Hospitals Inc. - Wilson Medical Center,0 to 17,139,F,White,Not Span/Hispanic,5,Newborn,Home or Self Care,2019,PNL001,LIVEBORN,EST002,PHOTOTHERAPY,639,NEONATE BIRTHWT >2499G W OTHER SIGNIFICANT CONDITION,15,NEWBORNS AND OTHER NEONATES WITH CONDITIONS ORIGINATING IN THE PERINATAL PERIOD,1,Minor,Minor,Medical,Medicaid,Medicaid,,02700,,false,5683.7,1624.1
Southern Tier,Broome,0303001,000058,United Health Services Hospitals Inc. - Wilson Medical Center,0 to 17,137,F,Other Race,Unknown,4,Newborn,Home or Self Care,2019,PNL001,LIVEBORN,ADM021,"ADMINISTRATION OF THERAPEUTIC SUBSTANCES, NEC",639,NEONATE BIRTHWT >2499G W OTHER SIGNIFICANT CONDITION,15,NEWBORNS AND OTHER NEONATES WITH CONDITIONS ORIGINATING IN THE PERINATAL PERIOD,1,Minor,Minor,Medical,Medicaid,Medicaid,,03600,,false,12741.7,4703.8
New York City,Kings,7001021,001306,New York - Presbyterian Brooklyn Methodist Hospital,0 to 17,112,F,Other Race,Not Span/Hispanic,1,Emergency,Home or Self Care,2019,PNL013,OTHER SPECIFIED AND UNSPECIFIED PERINATAL CONDITIONS,,,639,NEONATE BIRTHWT >2499G W OTHER SIGNIFICANT CONDITION,15,NEWBORNS AND OTHER NEONATES WITH CONDITIONS ORIGINATING IN THE PERINATAL PERIOD,1,Minor,Minor,Medical,Blue Cross/Blue Shield,Self-Pay,,02700,,true,12787.8,5392.71
New York City,Kings,7001021,001306,New York - Presbyterian Brooklyn Methodist Hospital,0 to 17,112,F,White,Not Span/Hispanic,4,Newborn,Home or Self Care,2019,PNL001,LIVEBORN,ENT004,DIAGNOSTIC AUDIOLOGY,639,NEONATE BIRTHWT >2499G W OTHER SIGNIFICANT CONDITION,15,NEWBORNS AND OTHER NEONATES WITH CONDITIONS ORIGINATING IN THE PERINATAL PERIOD,1,Minor,Minor,Medical,Private Health Insurance,Self-Pay,,02700,,false,16270,1833.45
New York City,Manhattan,7002032,001466,Mount Sinai West,0 to 17,100,M,Other Race,Not Span/Hispanic,2,Newborn,Home or Self Care,2019,PNL001,LIVEBORN,ADM010,VACCINATIONS,639,NEONATE BIRTHWT >2499G W OTHER SIGNIFICANT CONDITION,15,NEWBORNS AND OTHER NEONATES WITH CONDITIONS ORIGINATING IN THE PERINATAL PERIOD,1,Minor,Minor,Medical,Medicaid,Medicaid,Self-Pay,03200,,false,41558.99,10368.22
New York City,Kings,7001020,001305,Maimonides Medical Center,0 to 17,112,M,White,Not Span/Hispanic,4,Newborn,Home or Self Care,2019,PNL001,LIVEBORN,ESA004,NON-INVASIVE VENTILATION,639,NEONATE BIRTHWT >2499G W OTHER SIGNIFICANT CONDITION,15,NEWBORNS AND OTHER NEONATES WITH CONDITIONS ORIGINATING IN THE PERINATAL PERIOD,1,Minor,Minor,Medical,Medicaid,Medicaid,Self-Pay,03300,,false,48733.01,7219.12
New York City,Kings,7001021,001306,New York - Presbyterian Brooklyn Methodist Hospital,0 to 17,103,M,White,Not Span/Hispanic,3,Newborn,Home or Self Care,2019,PNL001,LIVEBORN,MRS001,CIRCUMCISION,639,NEONATE BIRTHWT >2499G W OTHER SIGNIFICANT CONDITION,15,NEWBORNS AND OTHER NEONATES WITH CONDITIONS ORIGINATING IN THE PERINATAL PERIOD,2,Moderate,Minor,Medical,Blue Cross/Blue Shield,Self-Pay,,03400,,false,14216.56,1780.81
New York City,Manhattan,7002053,001463,NYU Langone Hospitals,0 to 17,112,M,White,Unknown,10,Newborn,Home or Self Care,2019,PNL001,LIVEBORN,EST002,PHOTOTHERAPY,639,NEONATE BIRTHWT >2499G W OTHER SIGNIFICANT CONDITION,15,NEWBORNS AND OTHER NEONATES WITH CONDITIONS ORIGINATING IN THE PERINATAL PERIOD,2,Moderate,Minor,Medical,Medicaid,,,02800,,false,131207.7,52141.78
Central NY,Onondaga,3301008,000636,Crouse Hospital,0 to 17,131,M,White,Not Span/Hispanic,5,Newborn,Home or Self Care,2019,PNL001,LIVEBORN,MRS001,CIRCUMCISION,639,NEONATE BIRTHWT >2499G W OTHER SIGNIFICANT CONDITION,15,NEWBORNS AND OTHER NEONATES WITH CONDITIONS ORIGINATING IN THE PERINATAL PERIOD,2,Moderate,Minor,Medical,Medicaid,,,02800,,false,11421.2,5353.77
New York City,Queens,7003001,001628,Flushing Hospital Medical Center,0 to 17,113,M,Other Race,Not Span/Hispanic,4,Emergency,Home or Self Care,2019,FAC016,"EXPOSURE, ENCOUNTERS, SCREENING OR CONTACT WITH INFECTIOUS DISEASE",,,639,NEONATE BIRTHWT >2499G W OTHER SIGNIFICANT CONDITION,15,NEWBORNS AND OTHER NEONATES WITH CONDITIONS ORIGINATING IN THE PERINATAL PERIOD,1,Minor,Minor,Medical,Federal/State/Local/VA,,,03400,,true,21661,7049.62
New York City,Manhattan,7002054,001458,New York-Presbyterian Hospital - New York Weill Cornell Center,0 to 17,OOS,M,White,Not Span/Hispanic,3,Newborn,Home or Self Care,2019,PNL001,LIVEBORN,ESA004,NON-INVASIVE VENTILATION,639,NEONATE BIRTHWT >2499G W OTHER SIGNIFICANT CONDITION,15,NEWBORNS AND OTHER NEONATES WITH CONDITIONS ORIGINATING IN THE PERINATAL PERIOD,1,Minor,Minor,Medical,Private Health Insurance,Self-Pay,,03700,,false,20612.89,1073.18
New York City,Kings,7001021,001306,New York - Presbyterian Brooklyn Methodist Hospital,0 to 17,112,F,White,Not Span/Hispanic,2,Newborn,Home or Self Care,2019,PNL001,LIVEBORN,ENT004,DIAGNOSTIC AUDIOLOGY,639,NEONATE BIRTHWT >2499G W OTHER SIGNIFICANT CONDITION,15,NEWBORNS AND OTHER NEONATES WITH CONDITIONS ORIGINATING IN THE PERINATAL PERIOD,1,Minor,Minor,Medical,"Managed Care, Unspecified",Medicaid,Self-Pay,03500,,false,9583.7,1154.48
Western NY,Erie,1401014,003067,Millard Fillmore Suburban Hospital,0 to 17,141,M,White,Not Span/Hispanic,3,Newborn,Home or Self Care,2019,PNL001,LIVEBORN,MRS001,CIRCUMCISION,639,NEONATE BIRTHWT >2499G W OTHER SIGNIFICANT CONDITION,15,NEWBORNS AND OTHER NEONATES WITH CONDITIONS ORIGINATING IN THE PERINATAL PERIOD,2,Moderate,Moderate,Medical,Private Health Insurance,Self-Pay,,03400,,false,23411.4,7857.79
New York City,Manhattan,7002053,001463,NYU Langone Hospitals,0 to 17,112,M,White,Unknown,2,Newborn,Home or Self Care,2019,PNL001,LIVEBORN,ESA004,NON-INVASIVE VENTILATION,639,NEONATE BIRTHWT >2499G W OTHER SIGNIFICANT CONDITION,15,NEWBORNS AND OTHER NEONATES WITH CONDITIONS ORIGINATING IN THE PERINATAL PERIOD,1,Minor,Minor,Medical,Private Health Insurance,,,03800,,false,21272.78,8422.61
New York City,Manhattan,7002053,001463,NYU Langone Hospitals,0 to 17,OOS,M,Other Race,Unknown,3,Newborn,Home or Self Care,2019,PNL001,LIVEBORN,ADM010,VACCINATIONS,639,NEONATE BIRTHWT >2499G W OTHER SIGNIFICANT CONDITION,15,NEWBORNS AND OTHER NEONATES WITH CONDITIONS ORIGINATING IN THE PERINATAL PERIOD,1,Minor,Minor,Medical,Private Health Insurance,,,03700,,false,29884.52,12535.78
New York City,Bronx,7000006,001168,Montefiore Medical Center-Wakefield Hospital,0 to 17,OOS,M,Other Race,Unknown,3,Newborn,Home or Self Care,2019,PNL001,LIVEBORN,MAM010,OTHER CARDIOVASCULAR SYSTEM MEASUREMENT AND MONITORING,639,NEONATE BIRTHWT >2499G W OTHER SIGNIFICANT CONDITION,15,NEWBORNS AND OTHER NEONATES WITH CONDITIONS ORIGINATING IN THE PERINATAL PERIOD,1,Minor,Minor,Medical,Medicaid,,,03600,,false,21623.81,3252.8
New York City,Richmond,7004003,001740,Staten Island University Hosp-North,0 to 17,112,F,White,Not Span/Hispanic,2,Newborn,Home or Self Care,2019,PNL001,LIVEBORN,,,639,NEONATE BIRTHWT >2499G W OTHER SIGNIFICANT CONDITION,15,NEWBORNS AND OTHER NEONATES WITH CONDITIONS ORIGINATING IN THE PERINATAL PERIOD,1,Minor,Minor,Medical,Medicaid,Medicaid,,02900,,false,5860.23,2479.6