Hospital Service Area,Hospital County,Operating Certificate Number,Permanent Facility Id,Facility Name,Age Group,Zip Code - 3 digits,Gender,Race,Ethnicity,Length of Stay,Type of Admission,Patient Disposition,Discharge Year,CCS Diagnosis Code,CCS Diagnosis Description,CCS Procedure Code,CCS Procedure Description,APR DRG Code,APR DRG Description,APR MDC Code,APR MDC Description,APR Severity of Illness Code,APR Severity of Illness Description,APR Risk of Mortality,APR Medical Surgical Description,Payment Typology 1,Payment Typology 2,Payment Typology 3,Birth Weight,Abortion Edit Indicator,Emergency Department Indicator,Total Charges,Total Costs
Long Island,Nassau,2908000,000511,NYU Langone Hospital-Long Island,0 to 17,117,F,White,Not Span/Hispanic,2,Newborn,Home or Self Care,2019,PNL001,LIVEBORN,,,639,NEONATE BIRTHWT >2499G W OTHER SIGNIFICANT CONDITION,15,NEWBORNS AND OTHER NEONATES WITH CONDITIONS ORIGINATING IN THE PERINATAL PERIOD,1,Minor,Minor,Medical,Blue Cross/Blue Shield,,,03600,,false,23124.75,3163.82
Long Island,Nassau,2908000,000511,NYU Langone Hospital-Long Island,0 to 17,115,F,White,Spanish/Hispanic,4,Emergency,Home or Self Care,2019,PNL007,HEMOLYTIC JAUNDICE AND PERINATAL JAUNDICE,EST002,PHOTOTHERAPY,639,NEONATE BIRTHWT >2499G W OTHER SIGNIFICANT CONDITION,15,NEWBORNS AND OTHER NEONATES WITH CONDITIONS ORIGINATING IN THE PERINATAL PERIOD,2,Moderate,Minor,Medical,Blue Cross/Blue Shield,,,03100,,true,56417.91,10413.04
Long Island,Nassau,2908000,000511,NYU Langone Hospital-Long Island,0 to 17,115,M,White,Not Span/Hispanic,6,Newborn,Home or Self Care,2019,PNL001,LIVEBORN,EST002,PHOTOTHERAPY,639,NEONATE BIRTHWT >2499G W OTHER SIGNIFICANT CONDITION,15,NEWBORNS AND OTHER NEONATES WITH CONDITIONS ORIGINATING IN THE PERINATAL PERIOD,2,Moderate,Minor,Medical,Blue Cross/Blue Shield,,,03400,,false,86715.65,11390.63
Long Island,Nassau,2908000,000511,NYU Langone Hospital-Long Island,0 to 17,115,M,White,Not Span/Hispanic,4,Newborn,Home or Self Care,2019,PNL001,LIVEBORN,MRS001,CIRCUMCISION,639,NEONATE BIRTHWT >2499G W OTHER SIGNIFICANT CONDITION,15,NEWBORNS AND OTHER NEONATES WITH CONDITIONS ORIGINATING IN THE PERINATAL PERIOD,1,Minor,Minor,Medical,Private Health Insurance,,,03300,,false,61547.39,7995.01
Long Island,Nassau,2908000,000511,NYU Langone Hospital-Long Island,0 to 17,115,M,White,Not Span/Hispanic,8,Newborn,Home or Self Care,2019,PNL001,LIVEBORN,RES005,CHEST TUBE PLACEMENT AND THERAPEUTIC THORACENTESIS,639,NEONATE BIRTHWT >2499G W OTHER SIGNIFICANT CONDITION,15,NEWBORNS AND OTHER NEONATES WITH CONDITIONS ORIGINATING IN THE PERINATAL PERIOD,3,Major,Minor,Medical,Private Health Insurance,,,03000,,false,120322.18,15891.54
Long Island,Nassau,2908000,000511,NYU Langone Hospital-Long Island,0 to 17,117,F,White,Not Span/Hispanic,7,Newborn,Home or Self Care,2019,PNL001,LIVEBORN,ESA004,NON-INVASIVE VENTILATION,639,NEONATE BIRTHWT >2499G W OTHER SIGNIFICANT CONDITION,15,NEWBORNS AND OTHER NEONATES WITH CONDITIONS ORIGINATING IN THE PERINATAL PERIOD,2,Moderate,Moderate,Medical,Medicaid,,,03200,,false,91118.36,12432.35
Long Island,Nassau,2908000,000511,NYU Langone Hospital-Long Island,0 to 17,104,F,White,Not Span/Hispanic,3,Newborn,Home or Self Care,2019,PNL001,LIVEBORN,,,639,NEONATE BIRTHWT >2499G W OTHER SIGNIFICANT CONDITION,15,NEWBORNS AND OTHER NEONATES WITH CONDITIONS ORIGINATING IN THE PERINATAL PERIOD,1,Minor,Minor,Medical,Blue Cross/Blue Shield,,,03500,,false,33250.52,4560.97
Long Island,Nassau,2908000,000511,NYU Langone Hospital-Long Island,0 to 17,117,M,White,Not Span/Hispanic,10,Newborn,Home w/ Home Health Services,2019,PNL001,LIVEBORN,CNS002,LUMBAR PUNCTURE,639,NEONATE BIRTHWT >2499G W OTHER SIGNIFICANT CONDITION,15,NEWBORNS AND OTHER NEONATES WITH CONDITIONS ORIGINATING IN THE PERINATAL PERIOD,3,Major,Major,Medical,Medicaid,Medicaid,,04000,,false,175521.5,20079.44
Long Island,Nassau,2908000,000511,NYU Langone Hospital-Long Island,0 to 17,115,M,Black/African American,Spanish/Hispanic,10,Newborn,Home or Self Care,2019,PNL001,LIVEBORN,EST003,ULTRAVIOLET LIGHT THERAPY,639,NEONATE BIRTHWT >2499G W OTHER SIGNIFICANT CONDITION,15,NEWBORNS AND OTHER NEONATES WITH CONDITIONS ORIGINATING IN THE PERINATAL PERIOD,1,Minor,Minor,Medical,Blue Cross/Blue Shield,Private Health Insurance,Medicaid,03000,,false,116234.39,15983.35
Long Island,Nassau,2908000,000511,NYU Langone Hospital-Long Island,0 to 17,115,M,White,Spanish/Hispanic,1,Emergency,Home or Self Care,2019,PNL006,RESPIRATORY PERINATAL CONDITION,,,639,NEONATE BIRTHWT >2499G W OTHER SIGNIFICANT CONDITION,15,NEWBORNS AND OTHER NEONATES WITH CONDITIONS ORIGINATING IN THE PERINATAL PERIOD,1,Minor,Minor,Medical,Medicaid,Medicaid,,03200,,true,12087.87,2438.47
Long Island,Nassau,2908000,000511,NYU Langone Hospital-Long Island,0 to 17,115,F,White,Not Span/Hispanic,2,Newborn,Home or Self Care,2019,PNL001,LIVEBORN,ENT017,"ENT PROCEDURES, NEC",639,NEONATE BIRTHWT >2499G W OTHER SIGNIFICANT CONDITION,15,NEWBORNS AND OTHER NEONATES WITH CONDITIONS ORIGINATING IN THE PERINATAL PERIOD,2,Moderate,Minor,Medical,Blue Cross/Blue Shield,,,03500,,false,18049.63,2576.86
Long Island,Nassau,2908000,000511,NYU Langone Hospital-Long Island,0 to 17,111,F,White,Not Span/Hispanic,2,Emergency,Home or Self Care,2019,PNL012,NEONATAL DIGESTIVE AND FEEDING DISORDERS,CNS002,LUMBAR PUNCTURE,639,NEONATE BIRTHWT >2499G W OTHER SIGNIFICANT CONDITION,15,NEWBORNS AND OTHER NEONATES WITH CONDITIONS ORIGINATING IN THE PERINATAL PERIOD,1,Minor,Minor,Medical,Blue Cross/Blue Shield,,,02600,,true,33166.25,5555.76
Long Island,Nassau,2908000,000511,NYU Langone Hospital-Long Island,0 to 17,114,F,Other Race,Not Span/Hispanic,5,Newborn,Home or Self Care,2019,PNL001,LIVEBORN,ESA004,NON-INVASIVE VENTILATION,639,NEONATE BIRTHWT >2499G W OTHER SIGNIFICANT CONDITION,15,NEWBORNS AND OTHER NEONATES WITH CONDITIONS ORIGINATING IN THE PERINATAL PERIOD,2,Moderate,Minor,Medical,Medicaid,Medicaid,,02600,,false,66935.67,8668.98
Long Island,Nassau,2908000,000511,NYU Langone Hospital-Long Island,0 to 17,117,F,White,Not Span/Hispanic,4,Newborn,Home or Self Care,2019,PNL001,LIVEBORN,IMG004,FLUOROSCOPY OF NON-CIRCULATORY ORGANS,639,NEONATE BIRTHWT >2499G W OTHER SIGNIFICANT CONDITION,15,NEWBORNS AND OTHER NEONATES WITH CONDITIONS ORIGINATING IN THE PERINATAL PERIOD,1,Minor,Minor,Medical,Blue Cross/Blue Shield,,,03800,,false,56231.92,7389.78
Long Island,Nassau,2908000,000511,NYU Langone Hospital-Long Island,0 to 17,115,F,Other Race,Not Span/Hispanic,4,Newborn,Home or Self Care,2019,PNL001,LIVEBORN,ENT014,FRENECTOMY,639,NEONATE BIRTHWT >2499G W OTHER SIGNIFICANT CONDITION,15,NEWBORNS AND OTHER NEONATES WITH CONDITIONS ORIGINATING IN THE PERINATAL PERIOD,2,Moderate,Minor,Medical,Blue Cross/Blue Shield,,,02800,,false,45836.47,5904.61
Long Island,Nassau,2908000,000511,NYU Langone Hospital-Long Island,0 to 17,110,F,White,Not Span/Hispanic,4,Newborn,Home or Self Care,2019,PNL001,LIVEBORN,ESA004,NON-INVASIVE VENTILATION,639,NEONATE BIRTHWT >2499G W OTHER SIGNIFICANT CONDITION,15,NEWBORNS AND OTHER NEONATES WITH CONDITIONS ORIGINATING IN THE PERINATAL PERIOD,1,Minor,Minor,Medical,Blue Cross/Blue Shield,,,03600,,false,51900.24,6884.13
Long Island,Nassau,2908000,000511,NYU Langone Hospital-Long Island,0 to 17,117,M,Other Race,Spanish/Hispanic,2,Newborn,Home or Self Care,2019,PNL001,LIVEBORN,MRS001,CIRCUMCISION,639,NEONATE BIRTHWT >2499G W OTHER SIGNIFICANT CONDITION,15,NEWBORNS AND OTHER NEONATES WITH CONDITIONS ORIGINATING IN THE PERINATAL PERIOD,1,Minor,Minor,Medical,Medicaid,Medicaid,,03000,,false,19060.08,2686.8
Long Island,Nassau,2908000,000511,NYU Langone Hospital-Long Island,0 to 17,,F,White,Spanish/Hispanic,52,Newborn,Home w/ Home Health Services,2019,PNL001,LIVEBORN,GIS017,GASTROSTOMY,639,NEONATE BIRTHWT >2499G W OTHER SIGNIFICANT CONDITION,15,NEWBORNS AND OTHER NEONATES WITH CONDITIONS ORIGINATING IN THE PERINATAL PERIOD,3,Major,Minor,Medical,Medicaid,,,04100,,false,633129.62,93412.2
Long Island,Nassau,2908000,000511,NYU Langone Hospital-Long Island,0 to 17,115,M,Black/African American,Spanish/Hispanic,2,Newborn,Home or Self Care,2019,PNL001,LIVEBORN,MRS001,CIRCUMCISION,639,NEONATE BIRTHWT >2499G W OTHER SIGNIFICANT CONDITION,15,NEWBORNS AND OTHER NEONATES WITH CONDITIONS ORIGINATING IN THE PERINATAL PERIOD,1,Minor,Minor,Medical,Blue Cross/Blue Shield,,,02900,,false,20116.21,2760.51
Long Island,Nassau,2908000,000511,NYU Langone Hospital-Long Island,0 to 17,117,F,White,Not Span/Hispanic,3,Newborn,Home or Self Care,2019,PNL001,LIVEBORN,ENT014,FRENECTOMY,639,NEONATE BIRTHWT >2499G W OTHER SIGNIFICANT CONDITION,15,NEWBORNS AND OTHER NEONATES WITH CONDITIONS ORIGINATING IN THE PERINATAL PERIOD,1,Minor,Minor,Medical,Private Health Insurance,,,03500,,false,27780.49,3913.24
Long Island,Nassau,2908000,000511,NYU Langone Hospital-Long Island,0 to 17,115,M,Black/African American,Not Span/Hispanic,1,Urgent,Home or Self Care,2019,PNL007,HEMOLYTIC JAUNDICE AND PERINATAL JAUNDICE,EST002,PHOTOTHERAPY,639,NEONATE BIRTHWT >2499G W OTHER SIGNIFICANT CONDITION,15,NEWBORNS AND OTHER NEONATES WITH CONDITIONS ORIGINATING IN THE PERINATAL PERIOD,1,Minor,Minor,Medical,Medicaid,Medicaid,,03400,,false,8262.09,1869.99
Long Island,Nassau,2908000,000511,NYU Langone Hospital-Long Island,0 to 17,115,M,Other Race,Spanish/Hispanic,7,Newborn,Home w/ Home Health Services,2019,PNL001,LIVEBORN,ESA004,NON-INVASIVE VENTILATION,639,NEONATE BIRTHWT >2499G W OTHER SIGNIFICANT CONDITION,15,NEWBORNS AND OTHER NEONATES WITH CONDITIONS ORIGINATING IN THE PERINATAL PERIOD,3,Major,Minor,Medical,Medicaid,,,02900,,false,87124.76,11896.9
Long Island,Nassau,2908000,000511,NYU Langone Hospital-Long Island,0 to 17,115,F,White,Not Span/Hispanic,4,Newborn,Home w/ Home Health Services,2019,PNL001,LIVEBORN,,,639,NEONATE BIRTHWT >2499G W OTHER SIGNIFICANT CONDITION,15,NEWBORNS AND OTHER NEONATES WITH CONDITIONS ORIGINATING IN THE PERINATAL PERIOD,2,Moderate,Minor,Medical,Medicaid,Medicaid,,02800,,false,37101.05,5220.99
Long Island,Nassau,2908000,000511,NYU Langone Hospital-Long Island,0 to 17,114,M,Other Race,Not Span/Hispanic,8,Newborn,Home or Self Care,2019,PNL001,LIVEBORN,MRS001,CIRCUMCISION,639,NEONATE BIRTHWT >2499G W OTHER SIGNIFICANT CONDITION,15,NEWBORNS AND OTHER NEONATES WITH CONDITIONS ORIGINATING IN THE PERINATAL PERIOD,2,Moderate,Minor,Medical,Private Health Insurance,,,03100,,false,107262.46,13803.56
Long Island,Nassau,2908000,000511,NYU Langone Hospital-Long Island,0 to 17,117,M,White,Not Span/Hispanic,2,Newborn,Home or Self Care,2019,PNL001,LIVEBORN,MRS001,CIRCUMCISION,639,NEONATE BIRTHWT >2499G W OTHER SIGNIFICANT CONDITION,15,NEWBORNS AND OTHER NEONATES WITH CONDITIONS ORIGINATING IN THE PERINATAL PERIOD,1,Minor,Minor,Medical,Blue Cross/Blue Shield,,,03500,,false,21843.29,2841.61
Long Island,Nassau,2908000,000511,NYU Langone Hospital-Long Island,0 to 17,115,M,Black/African American,Spanish/Hispanic,4,Newborn,Home or Self Care,2019,PNL001,LIVEBORN,MRS001,CIRCUMCISION,639,NEONATE BIRTHWT >2499G W OTHER SIGNIFICANT CONDITION,15,NEWBORNS AND OTHER NEONATES WITH CONDITIONS ORIGINATING IN THE PERINATAL PERIOD,1,Minor,Minor,Medical,Medicaid,Medicaid,,04900,,false,40411.15,5572.37
Long Island,Nassau,2908000,000511,NYU Langone Hospital-Long Island,0 to 17,115,F,White,Not Span/Hispanic,4,Newborn,Home or Self Care,2019,PNL001,LIVEBORN,IMG004,FLUOROSCOPY OF NON-CIRCULATORY ORGANS,639,NEONATE BIRTHWT >2499G W OTHER SIGNIFICANT CONDITION,15,NEWBORNS AND OTHER NEONATES WITH CONDITIONS ORIGINATING IN THE PERINATAL PERIOD,2,Moderate,Minor,Medical,Blue Cross/Blue Shield,,,03100,,false,54967.22,7416.17
Long Island,Nassau,2908000,000511,NYU Langone Hospital-Long Island,0 to 17,115,M,White,Spanish/Hispanic,5,Newborn,Home w/ Home Health Services,2019,PNL001,LIVEBORN,ADM017,ADMINISTRATION OF NUTRITIONAL AND ELECTROLYTIC SUBSTANCES,639,NEONATE BIRTHWT >2499G W OTHER SIGNIFICANT CONDITION,15,NEWBORNS AND OTHER NEONATES WITH CONDITIONS ORIGINATING IN THE PERINATAL PERIOD,2,Moderate,Minor,Medical,Medicaid,Medicaid,,02800,,false,63616.02,8527.02
Long Island,Nassau,2908000,000511,NYU Langone Hospital-Long Island,0 to 17,115,F,Other Race,Spanish/Hispanic,5,Newborn,Home or Self Care,2019,PNL001,LIVEBORN,ESA004,NON-INVASIVE VENTILATION,639,NEONATE BIRTHWT >2499G W OTHER SIGNIFICANT CONDITION,15,NEWBORNS AND OTHER NEONATES WITH CONDITIONS ORIGINATING IN THE PERINATAL PERIOD,2,Moderate,Major,Medical,Private Health Insurance,,,02900,,false,64346.16,8769.97
Long Island,Nassau,2908000,000511,NYU Langone Hospital-Long Island,0 to 17,115,M,Black/African American,Not Span/Hispanic,7,Newborn,Home w/ Home Health Services,2019,PNL001,LIVEBORN,,,639,NEONATE BIRTHWT >2499G W OTHER SIGNIFICANT CONDITION,15,NEWBORNS AND OTHER NEONATES WITH CONDITIONS ORIGINATING IN THE PERINATAL PERIOD,2,Moderate,Moderate,Medical,Medicaid,,,02500,,false,84473.45,11611.67
Long Island,Nassau,2908000,000511,NYU Langone Hospital-Long Island,0 to 17,112,M,Black/African American,Not Span/Hispanic,4,Newborn,Home or Self Care,2019,PNL001,LIVEBORN,MRS001,CIRCUMCISION,639,NEONATE BIRTHWT >2499G W OTHER SIGNIFICANT CONDITION,15,NEWBORNS AND OTHER NEONATES WITH CONDITIONS ORIGINATING IN THE PERINATAL PERIOD,1,Minor,Minor,Medical,Private Health Insurance,,,03600,,false,39683.93,5513.25
Long Island,Nassau,2908000,000511,NYU Langone Hospital-Long Island,0 to 17,117,F,White,Not Span/Hispanic,8,Newborn,Home w/ Home Health Services,2019,PNL001,LIVEBORN,EST003,ULTRAVIOLET LIGHT THERAPY,639,NEONATE BIRTHWT >2499G W OTHER SIGNIFICANT CONDITION,15,NEWBORNS AND OTHER NEONATES WITH CONDITIONS ORIGINATING IN THE PERINATAL PERIOD,2,Moderate,Minor,Medical,Blue Cross/Blue Shield,,,03300,,false,82905.67,11526.62
Long Island,Nassau,2908000,000511,NYU Langone Hospital-Long Island,0 to 17,113,M,Other Race,Unknown,2,Newborn,Home or Self Care,2019,PNL001,LIVEBORN,MRS001,CIRCUMCISION,639,NEONATE BIRTHWT >2499G W OTHER SIGNIFICANT CONDITION,15,NEWBORNS AND OTHER NEONATES WITH CONDITIONS ORIGINATING IN THE PERINATAL PERIOD,1,Minor,Minor,Medical,Medicaid,Medicaid,,02900,,false,19204.44,2696.88
Long Island,Nassau,2908000,000511,NYU Langone Hospital-Long Island,0 to 17,115,F,White,Unknown,3,Newborn,Home or Self Care,2019,PNL001,LIVEBORN,ENT014,FRENECTOMY,639,NEONATE BIRTHWT >2499G W OTHER SIGNIFICANT CONDITION,15,NEWBORNS AND OTHER NEONATES WITH CONDITIONS ORIGINATING IN THE PERINATAL PERIOD,1,Minor,Minor,Medical,Blue Cross/Blue Shield,,,03800,,false,27049.63,3862.24
Long Island,Nassau,2908000,000511,NYU Langone Hospital-Long Island,0 to 17,117,F,White,Not Span/Hispanic,2,Newborn,Home or Self Care,2019,PNL001,LIVEBORN,ENT001,LARYNGOSCOPY (DIAGNOSTIC),639,NEONATE BIRTHWT >2499G W OTHER SIGNIFICANT CONDITION,15,NEWBORNS AND OTHER NEONATES WITH CONDITIONS ORIGINATING IN THE PERINATAL PERIOD,2,Moderate,Minor,Medical,Medicaid,,,03300,,false,18049.63,2576.86
Long Island,Nassau,2908000,000511,NYU Langone Hospital-Long Island,0 to 17,117,M,White,Unknown,3,Newborn,Home or Self Care,2019,PNL001,LIVEBORN,MRS001,CIRCUMCISION,639,NEONATE BIRTHWT >2499G W OTHER SIGNIFICANT CONDITION,15,NEWBORNS AND OTHER NEONATES WITH CONDITIONS ORIGINATING IN THE PERINATAL PERIOD,2,Moderate,Major,Medical,Private Health Insurance,,,02900,,false,37786.91,5059.24
Long Island,Nassau,2908000,000511,NYU Langone Hospital-Long Island,0 to 17,115,M,Other Race,Spanish/Hispanic,12,Newborn,Home or Self Care,2019,PNL001,LIVEBORN,ESA004,NON-INVASIVE VENTILATION,639,NEONATE BIRTHWT >2499G W OTHER SIGNIFICANT CONDITION,15,NEWBORNS AND OTHER NEONATES WITH CONDITIONS ORIGINATING IN THE PERINATAL PERIOD,1,Minor,Minor,Medical,Medicaid,Medicaid,,03200,,false,149665.4,20310.66
Long Island,Nassau,2908000,000511,NYU Langone Hospital-Long Island,0 to 17,115,M,White,Spanish/Hispanic,2,Newborn,Home or Self Care,2019,PNL001,LIVEBORN,,,639,NEONATE BIRTHWT >2499G W OTHER SIGNIFICANT CONDITION,15,NEWBORNS AND OTHER NEONATES WITH CONDITIONS ORIGINATING IN THE PERINATAL PERIOD,1,Minor,Minor,Medical,Medicaid,Medicaid,,04000,,false,26397.02,3459.01
Long Island,Nassau,2908000,000511,NYU Langone Hospital-Long Island,0 to 17,117,M,White,Not Span/Hispanic,6,Newborn,Home or Self Care,2019,PNL001,LIVEBORN,ESA004,NON-INVASIVE VENTILATION,639,NEONATE BIRTHWT >2499G W OTHER SIGNIFICANT CONDITION,15,NEWBORNS AND OTHER NEONATES WITH CONDITIONS ORIGINATING IN THE PERINATAL PERIOD,1,Minor,Minor,Medical,Blue Cross/Blue Shield,,,04400,,false,104047.36,12066.56
Long Island,Nassau,2908000,000511,NYU Langone Hospital-Long Island,0 to 17,117,F,White,Not Span/Hispanic,3,Newborn,Home or Self Care,2019,PNL001,LIVEBORN,ENT001,LARYNGOSCOPY (DIAGNOSTIC),639,NEONATE BIRTHWT >2499G W OTHER SIGNIFICANT CONDITION,15,NEWBORNS AND OTHER NEONATES WITH CONDITIONS ORIGINATING IN THE PERINATAL PERIOD,1,Minor,Minor,Medical,Private Health Insurance,,,03800,,false,27862.11,3978.22
Long Island,Nassau,2908000,000511,NYU Langone Hospital-Long Island,0 to 17,115,F,Black/African American,Not Span/Hispanic,2,Newborn,Home or Self Care,2019,PNL001,LIVEBORN,,,639,NEONATE BIRTHWT >2499G W OTHER SIGNIFICANT CONDITION,15,NEWBORNS AND OTHER NEONATES WITH CONDITIONS ORIGINATING IN THE PERINATAL PERIOD,1,Minor,Minor,Medical,Blue Cross/Blue Shield,,,03200,,false,20184.14,2765.39
Long Island,Nassau,2908000,000511,NYU Langone Hospital-Long Island,0 to 17,115,M,Other Race,Spanish/Hispanic,3,Newborn,Home or Self Care,2019,PNL001,LIVEBORN,ENT017,"ENT PROCEDURES, NEC",639,NEONATE BIRTHWT >2499G W OTHER SIGNIFICANT CONDITION,15,NEWBORNS AND OTHER NEONATES WITH CONDITIONS ORIGINATING IN THE PERINATAL PERIOD,2,Moderate,Minor,Medical,Blue Cross/Blue Shield,,,02800,,false,29609.11,4122.05
Long Island,Nassau,2908000,000511,NYU Langone Hospital-Long Island,0 to 17,115,F,White,Not Span/Hispanic,2,Newborn,Home or Self Care,2019,PNL001,LIVEBORN,,,639,NEONATE BIRTHWT >2499G W OTHER SIGNIFICANT CONDITION,15,NEWBORNS AND OTHER NEONATES WITH CONDITIONS ORIGINATING IN THE PERINATAL PERIOD,1,Minor,Minor,Medical,Blue Cross/Blue Shield,,,04000,,false,18592.11,2654.29
Long Island,Nassau,2908000,000511,NYU Langone Hospital-Long Island,0 to 17,117,M,White,Not Span/Hispanic,2,Newborn,Home or Self Care,2019,PNL001,LIVEBORN,ENT017,"ENT PROCEDURES, NEC",639,NEONATE BIRTHWT >2499G W OTHER SIGNIFICANT CONDITION,15,NEWBORNS AND OTHER NEONATES WITH CONDITIONS ORIGINATING IN THE PERINATAL PERIOD,2,Moderate,Minor,Medical,Blue Cross/Blue Shield,,,03800,,false,19782.31,2778.71
Long Island,Nassau,2908000,000511,NYU Langone Hospital-Long Island,0 to 17,114,F,Other Race,Spanish/Hispanic,7,Newborn,Home or Self Care,2019,PNL001,LIVEBORN,EST002,PHOTOTHERAPY,639,NEONATE BIRTHWT >2499G W OTHER SIGNIFICANT CONDITION,15,NEWBORNS AND OTHER NEONATES WITH CONDITIONS ORIGINATING IN THE PERINATAL PERIOD,3,Major,Minor,Medical,Medicaid,Medicaid,,02800,,false,79395.08,11119.66
Long Island,Nassau,2908000,000511,NYU Langone Hospital-Long Island,0 to 17,115,M,Other Race,Not Span/Hispanic,2,Newborn,Home or Self Care,2019,PNL001,LIVEBORN,MRS001,CIRCUMCISION,639,NEONATE BIRTHWT >2499G W OTHER SIGNIFICANT CONDITION,15,NEWBORNS AND OTHER NEONATES WITH CONDITIONS ORIGINATING IN THE PERINATAL PERIOD,2,Moderate,Minor,Medical,Blue Cross/Blue Shield,,,02900,,false,19036.91,2726.69
Long Island,Nassau,2908000,000511,NYU Langone Hospital-Long Island,0 to 17,114,M,Other Race,Not Span/Hispanic,4,Newborn,Home or Self Care,2019,PNL013,OTHER SPECIFIED AND UNSPECIFIED PERINATAL CONDITIONS,EST003,ULTRAVIOLET LIGHT THERAPY,639,NEONATE BIRTHWT >2499G W OTHER SIGNIFICANT CONDITION,15,NEWBORNS AND OTHER NEONATES WITH CONDITIONS ORIGINATING IN THE PERINATAL PERIOD,1,Minor,Minor,Medical,Private Health Insurance,,,03400,,false,51350.15,6954.43
Long Island,Nassau,2908000,000511,NYU Langone Hospital-Long Island,0 to 17,117,M,White,Not Span/Hispanic,3,Newborn,Home or Self Care,2019,PNL001,LIVEBORN,MRS001,CIRCUMCISION,639,NEONATE BIRTHWT >2499G W OTHER SIGNIFICANT CONDITION,15,NEWBORNS AND OTHER NEONATES WITH CONDITIONS ORIGINATING IN THE PERINATAL PERIOD,1,Minor,Minor,Medical,Private Health Insurance,,,03500,,false,55563.43,6209.26
Long Island,Nassau,2908000,000511,NYU Langone Hospital-Long Island,0 to 17,115,M,White,Not Span/Hispanic,5,Newborn,Home or Self Care,2019,PNL001,LIVEBORN,ESA004,NON-INVASIVE VENTILATION,639,NEONATE BIRTHWT >2499G W OTHER SIGNIFICANT CONDITION,15,NEWBORNS AND OTHER NEONATES WITH CONDITIONS ORIGINATING IN THE PERINATAL PERIOD,2,Moderate,Minor,Medical,Private Health Insurance,,,02900,,false,68684.02,9140.05
Long Island,Nassau,2908000,000511,NYU Langone Hospital-Long Island,0 to 17,114,F,Other Race,Unknown,4,Newborn,Home or Self Care,2019,PNL001,LIVEBORN,CNS002,LUMBAR PUNCTURE,639,NEONATE BIRTHWT >2499G W OTHER SIGNIFICANT CONDITION,15,NEWBORNS AND OTHER NEONATES WITH CONDITIONS ORIGINATING IN THE PERINATAL PERIOD,2,Moderate,Moderate,Medical,Medicaid,Medicaid,,02500,,false,64258.19,8210.24
Long Island,Nassau,2908000,000511,NYU Langone Hospital-Long Island,0 to 17,117,F,White,Not Span/Hispanic,2,Newborn,Home or Self Care,2019,PNL001,LIVEBORN,ENT001,LARYNGOSCOPY (DIAGNOSTIC),639,NEONATE BIRTHWT >2499G W OTHER SIGNIFICANT CONDITION,15,NEWBORNS AND OTHER NEONATES WITH CONDITIONS ORIGINATING IN THE PERINATAL PERIOD,1,Minor,Minor,Medical,Private Health Insurance,,,03300,,false,18592.11,2654.29
Long Island,Nassau,2908000,000511,NYU Langone Hospital-Long Island,0 to 17,117,M,White,Not Span/Hispanic,27,Newborn,Home w/ Home Health Services,2019,PNL001,LIVEBORN,MRS001,CIRCUMCISION,639,NEONATE BIRTHWT >2499G W OTHER SIGNIFICANT CONDITION,15,NEWBORNS AND OTHER NEONATES WITH CONDITIONS ORIGINATING IN THE PERINATAL PERIOD,2,Moderate,Minor,Medical,Medicaid,,,02500,,false,258365.2,36970.19
Long Island,Nassau,2908000,000511,NYU Langone Hospital-Long Island,0 to 17,115,M,White,Not Span/Hispanic,2,Newborn,Home or Self Care,2019,PNL001,LIVEBORN,MRS001,CIRCUMCISION,639,NEONATE BIRTHWT >2499G W OTHER SIGNIFICANT CONDITION,15,NEWBORNS AND OTHER NEONATES WITH CONDITIONS ORIGINATING IN THE PERINATAL PERIOD,1,Minor,Minor,Medical,Blue Cross/Blue Shield,,,03500,,false,19782.31,2778.71
Long Island,Nassau,2908000,000511,NYU Langone Hospital-Long Island,0 to 17,117,M,White,Not Span/Hispanic,2,Newborn,Home or Self Care,2019,PNL001,LIVEBORN,MRS001,CIRCUMCISION,639,NEONATE BIRTHWT >2499G W OTHER SIGNIFICANT CONDITION,15,NEWBORNS AND OTHER NEONATES WITH CONDITIONS ORIGINATING IN THE PERINATAL PERIOD,2,Moderate,Minor,Medical,Private Health Insurance,,,04300,,false,30874.76,4010.18
Long Island,Nassau,2908000,000511,NYU Langone Hospital-Long Island,0 to 17,112,F,Other Race,Not Span/Hispanic,5,Newborn,Home or Self Care,2019,PNL001,LIVEBORN,EST002,PHOTOTHERAPY,639,NEONATE BIRTHWT >2499G W OTHER SIGNIFICANT CONDITION,15,NEWBORNS AND OTHER NEONATES WITH CONDITIONS ORIGINATING IN THE PERINATAL PERIOD,2,Moderate,Minor,Medical,Private Health Insurance,,,02500,,false,91449.25,9068.39
Long Island,Nassau,2908000,000511,NYU Langone Hospital-Long Island,0 to 17,117,M,White,Not Span/Hispanic,3,Newborn,Home or Self Care,2019,PNL001,LIVEBORN,MRS001,CIRCUMCISION,639,NEONATE BIRTHWT >2499G W OTHER SIGNIFICANT CONDITION,15,NEWBORNS AND OTHER NEONATES WITH CONDITIONS ORIGINATING IN THE PERINATAL PERIOD,1,Minor,Minor,Medical,Blue Cross/Blue Shield,,,04000,,false,28306.91,4050.63
Long Island,Nassau,2908000,000511,NYU Langone Hospital-Long Island,0 to 17,115,M,White,Not Span/Hispanic,2,Newborn,Home or Self Care,2019,PNL001,LIVEBORN,MRS001,CIRCUMCISION,639,NEONATE BIRTHWT >2499G W OTHER SIGNIFICANT CONDITION,15,NEWBORNS AND OTHER NEONATES WITH CONDITIONS ORIGINATING IN THE PERINATAL PERIOD,1,Minor,Minor,Medical,Blue Cross/Blue Shield,,,03200,,false,19782.31,2778.71
Long Island,Nassau,2908000,000511,NYU Langone Hospital-Long Island,0 to 17,117,M,White,Not Span/Hispanic,3,Newborn,Home or Self Care,2019,PNL001,LIVEBORN,MRS001,CIRCUMCISION,639,NEONATE BIRTHWT >2499G W OTHER SIGNIFICANT CONDITION,15,NEWBORNS AND OTHER NEONATES WITH CONDITIONS ORIGINATING IN THE PERINATAL PERIOD,1,Minor,Minor,Medical,Blue Cross/Blue Shield,,,03300,,false,31477.34,4271.89