Hospital Service Area,Hospital County,Operating Certificate Number,Permanent Facility Id,Facility Name,Age Group,Zip Code - 3 digits,Gender,Race,Ethnicity,Length of Stay,Type of Admission,Patient Disposition,Discharge Year,CCS Diagnosis Code,CCS Diagnosis Description,CCS Procedure Code,CCS Procedure Description,APR DRG Code,APR DRG Description,APR MDC Code,APR MDC Description,APR Severity of Illness Code,APR Severity of Illness Description,APR Risk of Mortality,APR Medical Surgical Description,Payment Typology 1,Payment Typology 2,Payment Typology 3,Birth Weight,Abortion Edit Indicator,Emergency Department Indicator,Total Charges,Total Costs
Long Island,Nassau,2908000,000511,NYU Langone Hospital-Long Island,0 to 17,115,F,White,Not Span/Hispanic,3,Newborn,Home or Self Care,2020,PNL001,LIVEBORN,ADM010,VACCINATIONS,639,NEONATE BIRTHWT >2499G W OTHER SIGNIFICANT CONDITION,15,NEWBORNS AND OTHER NEONATES WITH CONDITIONS ORIGINATING IN THE PERINATAL PERIOD,1,Minor,Minor,Medical,Blue Cross/Blue Shield,,,03800,,N,32388.63,11181.62
Long Island,Nassau,2908000,000511,NYU Langone Hospital-Long Island,0 to 17,117,M,Multi-racial,Not Span/Hispanic,4,Newborn,Home or Self Care,2020,PNL001,LIVEBORN,ADM010,VACCINATIONS,639,NEONATE BIRTHWT >2499G W OTHER SIGNIFICANT CONDITION,15,NEWBORNS AND OTHER NEONATES WITH CONDITIONS ORIGINATING IN THE PERINATAL PERIOD,1,Minor,Minor,Medical,Private Health Insurance,Federal/State/Local/VA,,03500,,N,54037.61,17069.79
Long Island,Nassau,2908000,000511,NYU Langone Hospital-Long Island,0 to 17,117,M,Multi-racial,Spanish/Hispanic,4,Newborn,Home or Self Care,2020,PNL001,LIVEBORN,MRS001,CIRCUMCISION,639,NEONATE BIRTHWT >2499G W OTHER SIGNIFICANT CONDITION,15,NEWBORNS AND OTHER NEONATES WITH CONDITIONS ORIGINATING IN THE PERINATAL PERIOD,2,Moderate,Minor,Medical,Private Health Insurance,Federal/State/Local/VA,,03700,,N,52818.6,17042.11
Long Island,Nassau,2908000,000511,NYU Langone Hospital-Long Island,0 to 17,114,M,Black/African American,Not Span/Hispanic,3,Newborn,Home or Self Care,2020,PNL001,LIVEBORN,,,639,NEONATE BIRTHWT >2499G W OTHER SIGNIFICANT CONDITION,15,NEWBORNS AND OTHER NEONATES WITH CONDITIONS ORIGINATING IN THE PERINATAL PERIOD,1,Minor,Minor,Medical,Private Health Insurance,,,03800,,N,32122.4,11105.88
Long Island,Nassau,2908000,000511,NYU Langone Hospital-Long Island,0 to 17,115,M,White,Not Span/Hispanic,2,Newborn,Home or Self Care,2020,PNL001,LIVEBORN,MRS001,CIRCUMCISION,639,NEONATE BIRTHWT >2499G W OTHER SIGNIFICANT CONDITION,15,NEWBORNS AND OTHER NEONATES WITH CONDITIONS ORIGINATING IN THE PERINATAL PERIOD,1,Minor,Minor,Medical,Private Health Insurance,,,03000,,N,26165.8,8101.19
Long Island,Nassau,2908000,000511,NYU Langone Hospital-Long Island,0 to 17,115,M,White,Not Span/Hispanic,17,Newborn,Home or Self Care,2020,PNL001,LIVEBORN,ADM017,ADMINISTRATION OF NUTRITIONAL AND ELECTROLYTIC SUBSTANCES,639,NEONATE BIRTHWT >2499G W OTHER SIGNIFICANT CONDITION,15,NEWBORNS AND OTHER NEONATES WITH CONDITIONS ORIGINATING IN THE PERINATAL PERIOD,2,Moderate,Minor,Medical,Medicaid,,,03100,,N,222604.47,75304.39
Long Island,Nassau,2908000,000511,NYU Langone Hospital-Long Island,0 to 17,117,M,White,Spanish/Hispanic,7,Newborn,Home or Self Care,2020,PNL001,LIVEBORN,ADM010,VACCINATIONS,639,NEONATE BIRTHWT >2499G W OTHER SIGNIFICANT CONDITION,15,NEWBORNS AND OTHER NEONATES WITH CONDITIONS ORIGINATING IN THE PERINATAL PERIOD,2,Moderate,Minor,Medical,Private Health Insurance,,,02700,,N,98072.97,34505.16
Long Island,Nassau,2908000,000511,NYU Langone Hospital-Long Island,0 to 17,117,M,White,Not Span/Hispanic,8,Newborn,Home or Self Care,2020,PNL001,LIVEBORN,MRS001,CIRCUMCISION,639,NEONATE BIRTHWT >2499G W OTHER SIGNIFICANT CONDITION,15,NEWBORNS AND OTHER NEONATES WITH CONDITIONS ORIGINATING IN THE PERINATAL PERIOD,2,Moderate,Minor,Medical,Blue Cross/Blue Shield,,,03500,,N,105636.36,35778.89
Long Island,Nassau,2908000,000511,NYU Langone Hospital-Long Island,0 to 17,117,F,White,Not Span/Hispanic,6,Newborn,Home or Self Care,2020,PNL001,LIVEBORN,,,639,NEONATE BIRTHWT >2499G W OTHER SIGNIFICANT CONDITION,15,NEWBORNS AND OTHER NEONATES WITH CONDITIONS ORIGINATING IN THE PERINATAL PERIOD,2,Moderate,Minor,Medical,Blue Cross/Blue Shield,,,03700,,N,70603.29,24788.08
Long Island,Nassau,2908000,000511,NYU Langone Hospital-Long Island,0 to 17,115,M,Black/African American,Not Span/Hispanic,4,Newborn,Home or Self Care,2020,PNL001,LIVEBORN,MRS001,CIRCUMCISION,639,NEONATE BIRTHWT >2499G W OTHER SIGNIFICANT CONDITION,15,NEWBORNS AND OTHER NEONATES WITH CONDITIONS ORIGINATING IN THE PERINATAL PERIOD,1,Minor,Minor,Medical,Blue Cross/Blue Shield,,,03400,,N,53130.63,20010.09
Long Island,Nassau,2908000,000511,NYU Langone Hospital-Long Island,0 to 17,117,F,White,Not Span/Hispanic,3,Emergency,Home or Self Care,2020,PNL013,OTHER SPECIFIED AND UNSPECIFIED PERINATAL CONDITIONS,,,639,NEONATE BIRTHWT >2499G W OTHER SIGNIFICANT CONDITION,15,NEWBORNS AND OTHER NEONATES WITH CONDITIONS ORIGINATING IN THE PERINATAL PERIOD,1,Minor,Minor,Medical,Private Health Insurance,,,03600,,Y,26641.83,7203.56
Long Island,Nassau,2908000,000511,NYU Langone Hospital-Long Island,0 to 17,115,M,Black/African American,Not Span/Hispanic,4,Newborn,Home or Self Care,2020,PNL001,LIVEBORN,MRS001,CIRCUMCISION,639,NEONATE BIRTHWT >2499G W OTHER SIGNIFICANT CONDITION,15,NEWBORNS AND OTHER NEONATES WITH CONDITIONS ORIGINATING IN THE PERINATAL PERIOD,1,Minor,Minor,Medical,Medicaid,,,03900,,N,57430.12,17530.93
Long Island,Nassau,2908000,000511,NYU Langone Hospital-Long Island,0 to 17,116,M,White,Not Span/Hispanic,6,Newborn,Home or Self Care,2020,PNL001,LIVEBORN,ADM017,ADMINISTRATION OF NUTRITIONAL AND ELECTROLYTIC SUBSTANCES,639,NEONATE BIRTHWT >2499G W OTHER SIGNIFICANT CONDITION,15,NEWBORNS AND OTHER NEONATES WITH CONDITIONS ORIGINATING IN THE PERINATAL PERIOD,1,Minor,Minor,Medical,Medicaid,,,02700,,N,80464.85,27029.37
Long Island,Nassau,2908000,000511,NYU Langone Hospital-Long Island,0 to 17,114,M,Black/African American,Not Span/Hispanic,1,Emergency,Home or Self Care,2020,PNL007,HEMOLYTIC JAUNDICE AND PERINATAL JAUNDICE,EST002,PHOTOTHERAPY,639,NEONATE BIRTHWT >2499G W OTHER SIGNIFICANT CONDITION,15,NEWBORNS AND OTHER NEONATES WITH CONDITIONS ORIGINATING IN THE PERINATAL PERIOD,1,Minor,Minor,Medical,Private Health Insurance,,,02800,,Y,12928.11,3082.6
Long Island,Nassau,2908000,000511,NYU Langone Hospital-Long Island,0 to 17,113,F,White,Not Span/Hispanic,3,Newborn,Home or Self Care,2020,PNL001,LIVEBORN,ADM010,VACCINATIONS,639,NEONATE BIRTHWT >2499G W OTHER SIGNIFICANT CONDITION,15,NEWBORNS AND OTHER NEONATES WITH CONDITIONS ORIGINATING IN THE PERINATAL PERIOD,1,Minor,Minor,Medical,Blue Cross/Blue Shield,,,04200,,N,39998.93,13120.93
Long Island,Nassau,2908000,000511,NYU Langone Hospital-Long Island,0 to 17,115,M,White,Not Span/Hispanic,3,Newborn,Home or Self Care,2020,PNL001,LIVEBORN,CNS002,LUMBAR PUNCTURE,639,NEONATE BIRTHWT >2499G W OTHER SIGNIFICANT CONDITION,15,NEWBORNS AND OTHER NEONATES WITH CONDITIONS ORIGINATING IN THE PERINATAL PERIOD,1,Minor,Minor,Medical,Medicaid,,,04000,,N,52483.34,13319.24
Long Island,Nassau,2908000,000511,NYU Langone Hospital-Long Island,0 to 17,115,M,White,Not Span/Hispanic,6,Newborn,Home or Self Care,2020,PNL001,LIVEBORN,,,639,NEONATE BIRTHWT >2499G W OTHER SIGNIFICANT CONDITION,15,NEWBORNS AND OTHER NEONATES WITH CONDITIONS ORIGINATING IN THE PERINATAL PERIOD,1,Minor,Minor,Medical,Private Health Insurance,,,03400,,N,84248.27,26345.66
Long Island,Nassau,2908000,000511,NYU Langone Hospital-Long Island,0 to 17,118,F,Other Race,Spanish/Hispanic,4,Newborn,Home or Self Care,2020,PNL001,LIVEBORN,ADM010,VACCINATIONS,639,NEONATE BIRTHWT >2499G W OTHER SIGNIFICANT CONDITION,15,NEWBORNS AND OTHER NEONATES WITH CONDITIONS ORIGINATING IN THE PERINATAL PERIOD,1,Minor,Minor,Medical,Medicaid,,,03400,,N,58250.74,17588.42
Long Island,Nassau,2908000,000511,NYU Langone Hospital-Long Island,0 to 17,115,F,Other Race,Spanish/Hispanic,2,Emergency,Another Type Not Listed,2020,PNL013,OTHER SPECIFIED AND UNSPECIFIED PERINATAL CONDITIONS,,,639,NEONATE BIRTHWT >2499G W OTHER SIGNIFICANT CONDITION,15,NEWBORNS AND OTHER NEONATES WITH CONDITIONS ORIGINATING IN THE PERINATAL PERIOD,1,Minor,Minor,Medical,Medicaid,,,04000,,Y,24394.73,5634.7
Long Island,Nassau,2908000,000511,NYU Langone Hospital-Long Island,0 to 17,110,M,White,Unknown,9,Newborn,Home or Self Care,2020,PNL001,LIVEBORN,MRS001,CIRCUMCISION,639,NEONATE BIRTHWT >2499G W OTHER SIGNIFICANT CONDITION,15,NEWBORNS AND OTHER NEONATES WITH CONDITIONS ORIGINATING IN THE PERINATAL PERIOD,2,Moderate,Minor,Medical,Medicaid,,,03000,,N,63026.74,22325.54
Long Island,Nassau,2908000,000511,NYU Langone Hospital-Long Island,0 to 17,115,F,White,Not Span/Hispanic,3,Newborn,Home or Self Care,2020,PNL001,LIVEBORN,ENT014,FRENECTOMY,639,NEONATE BIRTHWT >2499G W OTHER SIGNIFICANT CONDITION,15,NEWBORNS AND OTHER NEONATES WITH CONDITIONS ORIGINATING IN THE PERINATAL PERIOD,2,Moderate,Minor,Medical,Blue Cross/Blue Shield,,,03400,,N,30831.83,10990.93
Long Island,Nassau,2908000,000511,NYU Langone Hospital-Long Island,0 to 17,112,M,White,Not Span/Hispanic,6,Newborn,Home or Self Care,2020,PNL001,LIVEBORN,,,639,NEONATE BIRTHWT >2499G W OTHER SIGNIFICANT CONDITION,15,NEWBORNS AND OTHER NEONATES WITH CONDITIONS ORIGINATING IN THE PERINATAL PERIOD,2,Moderate,Minor,Medical,Medicaid,,,02500,,N,73083.98,25024.95
Long Island,Nassau,2908000,000511,NYU Langone Hospital-Long Island,0 to 17,110,M,White,Not Span/Hispanic,2,Newborn,Home or Self Care,2020,PNL001,LIVEBORN,MRS001,CIRCUMCISION,639,NEONATE BIRTHWT >2499G W OTHER SIGNIFICANT CONDITION,15,NEWBORNS AND OTHER NEONATES WITH CONDITIONS ORIGINATING IN THE PERINATAL PERIOD,1,Minor,Minor,Medical,Medicaid,,,03100,,N,23005.64,7936.44
Long Island,Nassau,2908000,000511,NYU Langone Hospital-Long Island,0 to 17,115,F,Black/African American,Not Span/Hispanic,3,Newborn,Home or Self Care,2020,PNL001,LIVEBORN,,,639,NEONATE BIRTHWT >2499G W OTHER SIGNIFICANT CONDITION,15,NEWBORNS AND OTHER NEONATES WITH CONDITIONS ORIGINATING IN THE PERINATAL PERIOD,3,Major,Minor,Medical,Medicaid,,,03900,,N,52886.04,14589.16
Long Island,Nassau,2908000,000511,NYU Langone Hospital-Long Island,0 to 17,117,F,White,Not Span/Hispanic,5,Newborn,Home or Self Care,2020,PNL001,LIVEBORN,ADM010,VACCINATIONS,639,NEONATE BIRTHWT >2499G W OTHER SIGNIFICANT CONDITION,15,NEWBORNS AND OTHER NEONATES WITH CONDITIONS ORIGINATING IN THE PERINATAL PERIOD,3,Major,Moderate,Medical,Private Health Insurance,,,03500,,N,86880.39,23468.34
Long Island,Nassau,2908000,000511,NYU Langone Hospital-Long Island,0 to 17,115,F,White,Spanish/Hispanic,2,Newborn,Home or Self Care,2020,PNL001,LIVEBORN,ADM010,VACCINATIONS,639,NEONATE BIRTHWT >2499G W OTHER SIGNIFICANT CONDITION,15,NEWBORNS AND OTHER NEONATES WITH CONDITIONS ORIGINATING IN THE PERINATAL PERIOD,1,Minor,Minor,Medical,Medicaid,,,02900,,N,25122.01,8001.08
Long Island,Nassau,2908000,000511,NYU Langone Hospital-Long Island,0 to 17,117,M,White,Not Span/Hispanic,16,Newborn,Home or Self Care,2020,PNL001,LIVEBORN,ESA004,NON-INVASIVE VENTILATION,639,NEONATE BIRTHWT >2499G W OTHER SIGNIFICANT CONDITION,15,NEWBORNS AND OTHER NEONATES WITH CONDITIONS ORIGINATING IN THE PERINATAL PERIOD,2,Moderate,Moderate,Medical,Private Health Insurance,,,03400,,N,222159.97,71851.25
Long Island,Nassau,2908000,000511,NYU Langone Hospital-Long Island,0 to 17,115,M,Black/African American,Not Span/Hispanic,5,Newborn,Home or Self Care,2020,PNL001,LIVEBORN,MRS001,CIRCUMCISION,639,NEONATE BIRTHWT >2499G W OTHER SIGNIFICANT CONDITION,15,NEWBORNS AND OTHER NEONATES WITH CONDITIONS ORIGINATING IN THE PERINATAL PERIOD,1,Minor,Minor,Medical,Blue Cross/Blue Shield,,,02500,,N,64394.24,21699.56
Long Island,Nassau,2908000,000511,NYU Langone Hospital-Long Island,0 to 17,115,F,White,Not Span/Hispanic,4,Newborn,Home or Self Care,2020,PNL001,LIVEBORN,ADM010,VACCINATIONS,639,NEONATE BIRTHWT >2499G W OTHER SIGNIFICANT CONDITION,15,NEWBORNS AND OTHER NEONATES WITH CONDITIONS ORIGINATING IN THE PERINATAL PERIOD,2,Moderate,Minor,Medical,Blue Cross/Blue Shield,,,03200,,N,49340.55,15392.3
Long Island,Nassau,2908000,000511,NYU Langone Hospital-Long Island,0 to 17,118,M,White,Not Span/Hispanic,3,Newborn,Home or Self Care,2020,PNL001,LIVEBORN,MRS001,CIRCUMCISION,639,NEONATE BIRTHWT >2499G W OTHER SIGNIFICANT CONDITION,15,NEWBORNS AND OTHER NEONATES WITH CONDITIONS ORIGINATING IN THE PERINATAL PERIOD,1,Minor,Minor,Medical,Private Health Insurance,,,03500,,N,30831.83,10990.93
Long Island,Nassau,2908000,000511,NYU Langone Hospital-Long Island,0 to 17,116,F,White,Not Span/Hispanic,3,Newborn,Home or Self Care,2020,PNL001,LIVEBORN,RES005,CHEST TUBE PLACEMENT AND THERAPEUTIC THORACENTESIS,639,NEONATE BIRTHWT >2499G W OTHER SIGNIFICANT CONDITION,15,NEWBORNS AND OTHER NEONATES WITH CONDITIONS ORIGINATING IN THE PERINATAL PERIOD,1,Minor,Minor,Medical,Private Health Insurance,,,03700,,N,49218.17,14884.86
Long Island,Nassau,2908000,000511,NYU Langone Hospital-Long Island,0 to 17,115,M,White,Spanish/Hispanic,2,Emergency,Home or Self Care,2020,PNL007,HEMOLYTIC JAUNDICE AND PERINATAL JAUNDICE,EST002,PHOTOTHERAPY,639,NEONATE BIRTHWT >2499G W OTHER SIGNIFICANT CONDITION,15,NEWBORNS AND OTHER NEONATES WITH CONDITIONS ORIGINATING IN THE PERINATAL PERIOD,1,Minor,Minor,Medical,Medicaid,,,03000,,Y,25922.87,5663.17
Long Island,Nassau,2908000,000511,NYU Langone Hospital-Long Island,0 to 17,115,F,White,Not Span/Hispanic,2,Newborn,Home or Self Care,2020,PNL001,LIVEBORN,EST002,PHOTOTHERAPY,639,NEONATE BIRTHWT >2499G W OTHER SIGNIFICANT CONDITION,15,NEWBORNS AND OTHER NEONATES WITH CONDITIONS ORIGINATING IN THE PERINATAL PERIOD,1,Minor,Minor,Medical,Blue Cross/Blue Shield,,,03500,,N,34469.61,9026.64
Long Island,Nassau,2908000,000511,NYU Langone Hospital-Long Island,0 to 17,115,F,White,Not Span/Hispanic,5,Newborn,Home or Self Care,2020,PNL001,LIVEBORN,ADM010,VACCINATIONS,639,NEONATE BIRTHWT >2499G W OTHER SIGNIFICANT CONDITION,15,NEWBORNS AND OTHER NEONATES WITH CONDITIONS ORIGINATING IN THE PERINATAL PERIOD,2,Moderate,Moderate,Medical,Private Health Insurance,,,03300,,N,77025.23,20111.45
Long Island,Nassau,2908000,000511,NYU Langone Hospital-Long Island,0 to 17,115,M,White,Not Span/Hispanic,4,Newborn,Home or Self Care,2020,PNL001,LIVEBORN,ADM010,VACCINATIONS,639,NEONATE BIRTHWT >2499G W OTHER SIGNIFICANT CONDITION,15,NEWBORNS AND OTHER NEONATES WITH CONDITIONS ORIGINATING IN THE PERINATAL PERIOD,2,Moderate,Minor,Medical,Medicaid,,,03500,,N,50820.72,15843.26
Long Island,Nassau,2908000,000511,NYU Langone Hospital-Long Island,0 to 17,117,M,Black/African American,Not Span/Hispanic,9,Newborn,Home or Self Care,2020,PNL001,LIVEBORN,ESA004,NON-INVASIVE VENTILATION,639,NEONATE BIRTHWT >2499G W OTHER SIGNIFICANT CONDITION,15,NEWBORNS AND OTHER NEONATES WITH CONDITIONS ORIGINATING IN THE PERINATAL PERIOD,3,Major,Minor,Medical,Blue Cross/Blue Shield,,,02600,,N,108317.03,34218.61
Long Island,Nassau,2908000,000511,NYU Langone Hospital-Long Island,0 to 17,112,M,White,Unknown,2,Newborn,Home or Self Care,2020,PNL001,LIVEBORN,,,639,NEONATE BIRTHWT >2499G W OTHER SIGNIFICANT CONDITION,15,NEWBORNS AND OTHER NEONATES WITH CONDITIONS ORIGINATING IN THE PERINATAL PERIOD,1,Minor,Minor,Medical,Medicaid,,,02900,,N,28172.22,7708.74
Long Island,Nassau,2908000,000511,NYU Langone Hospital-Long Island,0 to 17,117,M,White,Not Span/Hispanic,6,Newborn,Home or Self Care,2020,PNL001,LIVEBORN,ADM017,ADMINISTRATION OF NUTRITIONAL AND ELECTROLYTIC SUBSTANCES,639,NEONATE BIRTHWT >2499G W OTHER SIGNIFICANT CONDITION,15,NEWBORNS AND OTHER NEONATES WITH CONDITIONS ORIGINATING IN THE PERINATAL PERIOD,1,Minor,Minor,Medical,Blue Cross/Blue Shield,,,04200,,N,65971.02,21909.35
Long Island,Nassau,2908000,000511,NYU Langone Hospital-Long Island,0 to 17,115,M,Other Race,Not Span/Hispanic,4,Newborn,Home or Self Care,2020,PNL001,LIVEBORN,MRS001,CIRCUMCISION,639,NEONATE BIRTHWT >2499G W OTHER SIGNIFICANT CONDITION,15,NEWBORNS AND OTHER NEONATES WITH CONDITIONS ORIGINATING IN THE PERINATAL PERIOD,1,Minor,Minor,Medical,Medicaid,,,02800,,N,44576.59,14851.15
Long Island,Nassau,2908000,000511,NYU Langone Hospital-Long Island,0 to 17,117,F,White,Not Span/Hispanic,2,Newborn,Home or Self Care,2020,PNL001,LIVEBORN,ADM010,VACCINATIONS,639,NEONATE BIRTHWT >2499G W OTHER SIGNIFICANT CONDITION,15,NEWBORNS AND OTHER NEONATES WITH CONDITIONS ORIGINATING IN THE PERINATAL PERIOD,1,Minor,Minor,Medical,Blue Cross/Blue Shield,,,03800,,N,22353.39,7686.03
Long Island,Nassau,2908000,000511,NYU Langone Hospital-Long Island,0 to 17,115,M,Black/African American,Not Span/Hispanic,2,Newborn,Home or Self Care,2020,PNL001,LIVEBORN,MRS001,CIRCUMCISION,639,NEONATE BIRTHWT >2499G W OTHER SIGNIFICANT CONDITION,15,NEWBORNS AND OTHER NEONATES WITH CONDITIONS ORIGINATING IN THE PERINATAL PERIOD,1,Minor,Minor,Medical,Medicaid,,,03200,,N,25569.32,7997.6
Long Island,Nassau,2908000,000511,NYU Langone Hospital-Long Island,0 to 17,117,F,White,Not Span/Hispanic,13,Newborn,Home or Self Care,2020,PNL001,LIVEBORN,EST002,PHOTOTHERAPY,639,NEONATE BIRTHWT >2499G W OTHER SIGNIFICANT CONDITION,15,NEWBORNS AND OTHER NEONATES WITH CONDITIONS ORIGINATING IN THE PERINATAL PERIOD,1,Minor,Minor,Medical,Blue Cross/Blue Shield,,,02600,,N,166084.37,52980.57
Long Island,Nassau,2908000,000511,NYU Langone Hospital-Long Island,0 to 17,112,M,Other Race,Not Span/Hispanic,3,Newborn,Home or Self Care,2020,PNL001,LIVEBORN,MRS001,CIRCUMCISION,639,NEONATE BIRTHWT >2499G W OTHER SIGNIFICANT CONDITION,15,NEWBORNS AND OTHER NEONATES WITH CONDITIONS ORIGINATING IN THE PERINATAL PERIOD,1,Minor,Minor,Medical,Private Health Insurance,,,03000,,N,41945.83,12675.28
Long Island,Nassau,2908000,000511,NYU Langone Hospital-Long Island,0 to 17,114,F,Black/African American,Not Span/Hispanic,4,Newborn,Home or Self Care,2020,PNL001,LIVEBORN,ESA004,NON-INVASIVE VENTILATION,639,NEONATE BIRTHWT >2499G W OTHER SIGNIFICANT CONDITION,15,NEWBORNS AND OTHER NEONATES WITH CONDITIONS ORIGINATING IN THE PERINATAL PERIOD,2,Moderate,Minor,Medical,Medicaid,,,03400,,N,48411.4,15215.44
Long Island,Nassau,2908000,000511,NYU Langone Hospital-Long Island,0 to 17,117,M,White,Not Span/Hispanic,7,Newborn,Home or Self Care,2020,PNL001,LIVEBORN,MRS001,CIRCUMCISION,639,NEONATE BIRTHWT >2499G W OTHER SIGNIFICANT CONDITION,15,NEWBORNS AND OTHER NEONATES WITH CONDITIONS ORIGINATING IN THE PERINATAL PERIOD,2,Moderate,Minor,Medical,Blue Cross/Blue Shield,,,03100,,N,73935.69,25389.12
Long Island,Nassau,2908000,000511,NYU Langone Hospital-Long Island,0 to 17,115,F,White,Not Span/Hispanic,2,Newborn,Home or Self Care,2020,PNL001,LIVEBORN,,,639,NEONATE BIRTHWT >2499G W OTHER SIGNIFICANT CONDITION,15,NEWBORNS AND OTHER NEONATES WITH CONDITIONS ORIGINATING IN THE PERINATAL PERIOD,1,Minor,Minor,Medical,Blue Cross/Blue Shield,,,02700,,N,28995.71,12075.37
Long Island,Nassau,2908000,000511,NYU Langone Hospital-Long Island,0 to 17,118,M,Other Race,Not Span/Hispanic,9,Newborn,Home or Self Care,2020,PNL001,LIVEBORN,MRS001,CIRCUMCISION,639,NEONATE BIRTHWT >2499G W OTHER SIGNIFICANT CONDITION,15,NEWBORNS AND OTHER NEONATES WITH CONDITIONS ORIGINATING IN THE PERINATAL PERIOD,1,Minor,Minor,Medical,Private Health Insurance,,,02800,,N,102664.74,33217.64
Long Island,Nassau,2908000,000511,NYU Langone Hospital-Long Island,0 to 17,117,F,White,Not Span/Hispanic,2,Newborn,Home or Self Care,2020,PNL001,LIVEBORN,ADM010,VACCINATIONS,639,NEONATE BIRTHWT >2499G W OTHER SIGNIFICANT CONDITION,15,NEWBORNS AND OTHER NEONATES WITH CONDITIONS ORIGINATING IN THE PERINATAL PERIOD,1,Minor,Minor,Medical,Blue Cross/Blue Shield,,,02500,,N,22810.95,7733.9
Long Island,Nassau,2908000,000511,NYU Langone Hospital-Long Island,0 to 17,114,F,Other Race,Not Span/Hispanic,2,Newborn,Home or Self Care,2020,PNL001,LIVEBORN,ADM010,VACCINATIONS,639,NEONATE BIRTHWT >2499G W OTHER SIGNIFICANT CONDITION,15,NEWBORNS AND OTHER NEONATES WITH CONDITIONS ORIGINATING IN THE PERINATAL PERIOD,1,Minor,Minor,Medical,Medicaid,,,03200,,N,25283.07,7992.54
Long Island,Nassau,2908000,000511,NYU Langone Hospital-Long Island,0 to 17,114,F,Other Race,Not Span/Hispanic,2,Newborn,Home or Self Care,2020,PNL001,LIVEBORN,ADM010,VACCINATIONS,639,NEONATE BIRTHWT >2499G W OTHER SIGNIFICANT CONDITION,15,NEWBORNS AND OTHER NEONATES WITH CONDITIONS ORIGINATING IN THE PERINATAL PERIOD,1,Minor,Minor,Medical,Private Health Insurance,,,03300,,N,23809.12,7838.33
Long Island,Nassau,2908000,000511,NYU Langone Hospital-Long Island,0 to 17,115,F,White,Not Span/Hispanic,4,Newborn,Home or Self Care,2020,PNL001,LIVEBORN,,,639,NEONATE BIRTHWT >2499G W OTHER SIGNIFICANT CONDITION,15,NEWBORNS AND OTHER NEONATES WITH CONDITIONS ORIGINATING IN THE PERINATAL PERIOD,2,Moderate,Minor,Medical,Blue Cross/Blue Shield,,,02500,,N,49069.73,15271.56
Long Island,Nassau,2908000,000511,NYU Langone Hospital-Long Island,0 to 17,117,M,Other Race,Not Span/Hispanic,7,Newborn,Home or Self Care,2020,PNL001,LIVEBORN,ESA004,NON-INVASIVE VENTILATION,639,NEONATE BIRTHWT >2499G W OTHER SIGNIFICANT CONDITION,15,NEWBORNS AND OTHER NEONATES WITH CONDITIONS ORIGINATING IN THE PERINATAL PERIOD,2,Moderate,Minor,Medical,Private Health Insurance,,,02700,,N,89604.23,30451.9
Long Island,Nassau,2908000,000511,NYU Langone Hospital-Long Island,0 to 17,117,M,White,Not Span/Hispanic,1,Newborn,Home or Self Care,2020,PNL001,LIVEBORN,MRS001,CIRCUMCISION,639,NEONATE BIRTHWT >2499G W OTHER SIGNIFICANT CONDITION,15,NEWBORNS AND OTHER NEONATES WITH CONDITIONS ORIGINATING IN THE PERINATAL PERIOD,1,Minor,Minor,Medical,Blue Cross/Blue Shield,,,04100,,N,21634.47,5770.33
Long Island,Nassau,2908000,000511,NYU Langone Hospital-Long Island,0 to 17,117,M,White,Not Span/Hispanic,6,Newborn,Home or Self Care,2020,PNL001,LIVEBORN,ADM017,ADMINISTRATION OF NUTRITIONAL AND ELECTROLYTIC SUBSTANCES,639,NEONATE BIRTHWT >2499G W OTHER SIGNIFICANT CONDITION,15,NEWBORNS AND OTHER NEONATES WITH CONDITIONS ORIGINATING IN THE PERINATAL PERIOD,1,Minor,Minor,Medical,Blue Cross/Blue Shield,,,03100,,N,85947.81,26873.32
Long Island,Nassau,2908000,000511,NYU Langone Hospital-Long Island,0 to 17,117,M,White,Not Span/Hispanic,4,Newborn,Home or Self Care,2020,PNL001,LIVEBORN,MRS001,CIRCUMCISION,639,NEONATE BIRTHWT >2499G W OTHER SIGNIFICANT CONDITION,15,NEWBORNS AND OTHER NEONATES WITH CONDITIONS ORIGINATING IN THE PERINATAL PERIOD,2,Moderate,Minor,Medical,Medicaid,,,02700,,N,72727.5,22506.55
Long Island,Nassau,2908000,000511,NYU Langone Hospital-Long Island,0 to 17,117,F,White,Not Span/Hispanic,4,Newborn,Home or Self Care,2020,PNL001,LIVEBORN,ADM010,VACCINATIONS,639,NEONATE BIRTHWT >2499G W OTHER SIGNIFICANT CONDITION,15,NEWBORNS AND OTHER NEONATES WITH CONDITIONS ORIGINATING IN THE PERINATAL PERIOD,2,Moderate,Minor,Medical,Blue Cross/Blue Shield,,,02600,,N,54565.44,18244.99
Long Island,Nassau,2908000,000511,NYU Langone Hospital-Long Island,0 to 17,117,M,White,Not Span/Hispanic,6,Newborn,Home or Self Care,2020,PNL001,LIVEBORN,ADM017,ADMINISTRATION OF NUTRITIONAL AND ELECTROLYTIC SUBSTANCES,639,NEONATE BIRTHWT >2499G W OTHER SIGNIFICANT CONDITION,15,NEWBORNS AND OTHER NEONATES WITH CONDITIONS ORIGINATING IN THE PERINATAL PERIOD,2,Moderate,Minor,Medical,Blue Cross/Blue Shield,,,03500,,N,97624.17,31893.19
Long Island,Nassau,2908000,000511,NYU Langone Hospital-Long Island,0 to 17,117,F,White,Not Span/Hispanic,2,Newborn,Home or Self Care,2020,PNL001,LIVEBORN,,,639,NEONATE BIRTHWT >2499G W OTHER SIGNIFICANT CONDITION,15,NEWBORNS AND OTHER NEONATES WITH CONDITIONS ORIGINATING IN THE PERINATAL PERIOD,1,Minor,Minor,Medical,Blue Cross/Blue Shield,,,04400,,N,25352.02,8756.01
Long Island,Nassau,2908000,000511,NYU Langone Hospital-Long Island,0 to 17,114,M,White,Not Span/Hispanic,8,Newborn,Home or Self Care,2020,PNL001,LIVEBORN,MRS001,CIRCUMCISION,639,NEONATE BIRTHWT >2499G W OTHER SIGNIFICANT CONDITION,15,NEWBORNS AND OTHER NEONATES WITH CONDITIONS ORIGINATING IN THE PERINATAL PERIOD,2,Moderate,Minor,Medical,Blue Cross/Blue Shield,,,02800,,N,108857.12,37898.59