Hospital Service Area,Hospital County,Operating Certificate Number,Permanent Facility Id,Facility Name,Age Group,Zip Code - 3 digits,Gender,Race,Ethnicity,Length of Stay,Type of Admission,Patient Disposition,Discharge Year,CCS Diagnosis Code,CCS Diagnosis Description,CCS Procedure Code,CCS Procedure Description,APR DRG Code,APR DRG Description,APR MDC Code,APR MDC Description,APR Severity of Illness Code,APR Severity of Illness Description,APR Risk of Mortality,APR Medical Surgical Description,Payment Typology 1,Payment Typology 2,Payment Typology 3,Birth Weight,Abortion Edit Indicator,Emergency Department Indicator,Total Charges,Total Costs
Capital/Adirond,Schenectady,4601001,000829,Ellis Hospital,50 to 69,123,M,White,Not Span/Hispanic,12,Emergency,Home or Self Care,2018,INJ010,"INTERNAL ORGAN INJURY, INITIAL ENCOUNTER",LYM005,SPLENECTOMY,650,SPLENECTOMY,16,DISEASES AND DISORDERS OF THE BLOOD AND BLOOD FORMING ORGANS AND IMMUNOLOGICAL DISORDERS,4,Extreme,Moderate,Surgical,Medicaid,Medicaid,Medicaid,,,true,61778.35,17797.8
New York City,Manhattan,7002053,001463,NYU Langone Hospitals,50 to 69,,M,Other Race,Not Span/Hispanic,10,Elective,Home or Self Care,2018,BLD003,APLASTIC ANEMIA,LYM005,SPLENECTOMY,650,SPLENECTOMY,16,DISEASES AND DISORDERS OF THE BLOOD AND BLOOD FORMING ORGANS AND IMMUNOLOGICAL DISORDERS,4,Extreme,Major,Surgical,Private Health Insurance,,,,,false,307255.98,75972.49
New York City,Manhattan,7002054,001437,New York-Presbyterian/Lower Manhattan Hospital,18 to 29,,F,White,Not Span/Hispanic,3,Emergency,Home or Self Care,2018,BLD010,OTHER SPECIFIED AND UNSPECIFIED HEMATOLOGIC CONDITIONS,LYM005,SPLENECTOMY,650,SPLENECTOMY,16,DISEASES AND DISORDERS OF THE BLOOD AND BLOOD FORMING ORGANS AND IMMUNOLOGICAL DISORDERS,1,Minor,Minor,Surgical,Private Health Insurance,Self-Pay,,,,false,58546.6,15077.44
Long Island,Nassau,2953000,000563,St. Francis Hospital & Heart Center,50 to 69,OOS,F,White,Spanish/Hispanic,1,Elective,Home or Self Care,2018,BLD010,OTHER SPECIFIED AND UNSPECIFIED HEMATOLOGIC CONDITIONS,LYM005,SPLENECTOMY,650,SPLENECTOMY,16,DISEASES AND DISORDERS OF THE BLOOD AND BLOOD FORMING ORGANS AND IMMUNOLOGICAL DISORDERS,2,Moderate,Moderate,Surgical,Private Health Insurance,,,,,false,53326.92,9873.4
New York City,Manhattan,7002032,001469,Mount Sinai Morningside,70 or Older,104,M,Other Race,Spanish/Hispanic,1,Urgent,Home or Self Care,2018,BLD006,COAGULATION AND HEMORRHAGIC DISORDERS,LYM005,SPLENECTOMY,650,SPLENECTOMY,16,DISEASES AND DISORDERS OF THE BLOOD AND BLOOD FORMING ORGANS AND IMMUNOLOGICAL DISORDERS,2,Moderate,Minor,Surgical,Medicare,Self-Pay,,,,false,37593.42,11705.79
Western NY,Erie,1401010,000216,Roswell Park Cancer Institute,70 or Older,142,F,White,Not Span/Hispanic,3,Elective,Home or Self Care,2018,SYM006,ABDOMINAL PAIN AND OTHER DIGESTIVE/ABDOMEN SIGNS AND SYMPTOMS,LYM005,SPLENECTOMY,650,SPLENECTOMY,16,DISEASES AND DISORDERS OF THE BLOOD AND BLOOD FORMING ORGANS AND IMMUNOLOGICAL DISORDERS,2,Moderate,Minor,Surgical,"Managed Care, Unspecified",,,,,false,34348.35,12577.68
Hudson Valley,Dutchess,5957001,000180,Mid-Hudson Valley Division of Westchester Medical Center,50 to 69,125,M,White,Not Span/Hispanic,6,Emergency,Home or Self Care,2018,INJ010,"INTERNAL ORGAN INJURY, INITIAL ENCOUNTER",LYM005,SPLENECTOMY,650,SPLENECTOMY,16,DISEASES AND DISORDERS OF THE BLOOD AND BLOOD FORMING ORGANS AND IMMUNOLOGICAL DISORDERS,3,Major,Major,Surgical,Miscellaneous/Other,Blue Cross/Blue Shield,,,,true,167386.78,90414.39
Long Island,Nassau,2952005,000552,Plainview Hospital,50 to 69,115,M,White,Not Span/Hispanic,4,Urgent,Home or Self Care,2018,SYM006,ABDOMINAL PAIN AND OTHER DIGESTIVE/ABDOMEN SIGNS AND SYMPTOMS,LYM005,SPLENECTOMY,650,SPLENECTOMY,16,DISEASES AND DISORDERS OF THE BLOOD AND BLOOD FORMING ORGANS AND IMMUNOLOGICAL DISORDERS,2,Moderate,Minor,Surgical,Medicare,Medicare,,,,false,53243.42,25207.08
Long Island,Nassau,2951001,000541,North Shore University Hospital,30 to 49,117,M,White,Not Span/Hispanic,1,Elective,Home or Self Care,2018,BLD010,OTHER SPECIFIED AND UNSPECIFIED HEMATOLOGIC CONDITIONS,LYM005,SPLENECTOMY,650,SPLENECTOMY,16,DISEASES AND DISORDERS OF THE BLOOD AND BLOOD FORMING ORGANS AND IMMUNOLOGICAL DISORDERS,2,Moderate,Minor,Surgical,Blue Cross/Blue Shield,,,,,false,58528.86,12802.56
New York City,Bronx,7000006,003058,Montefiore Med Center - Jack D Weiler Hosp of A Einstein College Div,50 to 69,OOS,F,Other Race,Spanish/Hispanic,6,Elective,Home w/ Home Health Services,2018,BLD002,HEMOLYTIC ANEMIA,LYM005,SPLENECTOMY,650,SPLENECTOMY,16,DISEASES AND DISORDERS OF THE BLOOD AND BLOOD FORMING ORGANS AND IMMUNOLOGICAL DISORDERS,1,Minor,Minor,Surgical,Blue Cross/Blue Shield,Medicaid,,,,false,120401.55,24102.9
New York City,Bronx,7000006,003058,Montefiore Med Center - Jack D Weiler Hosp of A Einstein College Div,50 to 69,104,F,Other Race,Spanish/Hispanic,3,Emergency,Home or Self Care,2018,INJ010,"INTERNAL ORGAN INJURY, INITIAL ENCOUNTER",GIS022,GI SYSTEM LYSIS OF ADHESIONS,650,SPLENECTOMY,16,DISEASES AND DISORDERS OF THE BLOOD AND BLOOD FORMING ORGANS AND IMMUNOLOGICAL DISORDERS,2,Moderate,Minor,Surgical,Medicaid,,,,,true,67422.76,11305.34
New York City,Queens,7003004,001630,Long Island Jewish Medical Center,50 to 69,117,M,White,Not Span/Hispanic,2,Urgent,Home or Self Care,2018,SYM006,ABDOMINAL PAIN AND OTHER DIGESTIVE/ABDOMEN SIGNS AND SYMPTOMS,LYM005,SPLENECTOMY,650,SPLENECTOMY,16,DISEASES AND DISORDERS OF THE BLOOD AND BLOOD FORMING ORGANS AND IMMUNOLOGICAL DISORDERS,1,Minor,Minor,Surgical,Blue Cross/Blue Shield,Self-Pay,,,,false,78447.92,15566.92
New York City,Kings,7001021,001306,New York - Presbyterian Brooklyn Methodist Hospital,0 to 17,112,F,Black/African American,Not Span/Hispanic,4,Emergency,Home or Self Care,2018,BLD010,OTHER SPECIFIED AND UNSPECIFIED HEMATOLOGIC CONDITIONS,LYM006,SPLEEN PROCEDURES (EXCLUDING SPLENECTOMY),650,SPLENECTOMY,16,DISEASES AND DISORDERS OF THE BLOOD AND BLOOD FORMING ORGANS AND IMMUNOLOGICAL DISORDERS,2,Moderate,Moderate,Surgical,"Managed Care, Unspecified",Medicaid,Self-Pay,,,false,59753.08,31569.16
New York City,Manhattan,7002054,001458,New York-Presbyterian Hospital - New York Weill Cornell Center,30 to 49,OOS,M,White,Not Span/Hispanic,3,Elective,Home or Self Care,2018,BLD010,OTHER SPECIFIED AND UNSPECIFIED HEMATOLOGIC CONDITIONS,LYM005,SPLENECTOMY,650,SPLENECTOMY,16,DISEASES AND DISORDERS OF THE BLOOD AND BLOOD FORMING ORGANS AND IMMUNOLOGICAL DISORDERS,1,Minor,Minor,Surgical,Blue Cross/Blue Shield,Self-Pay,,,,false,78467.61,20935.4
Capital/Adirond,Franklin,1623001,000324,Adirondack Medical Center-Saranac Lake Site,70 or Older,129,M,White,Not Span/Hispanic,5,Elective,Home or Self Care,2018,BLD006,COAGULATION AND HEMORRHAGIC DISORDERS,LYM005,SPLENECTOMY,650,SPLENECTOMY,16,DISEASES AND DISORDERS OF THE BLOOD AND BLOOD FORMING ORGANS AND IMMUNOLOGICAL DISORDERS,3,Major,Major,Surgical,Medicare,Blue Cross/Blue Shield,,,,false,33338.24,17901.79
Capital/Adirond,Albany,0101000,000001,Albany Medical Center Hospital,0 to 17,122,M,Other Race,Not Span/Hispanic,4,Elective,Home or Self Care,2018,BLD002,HEMOLYTIC ANEMIA,LYM005,SPLENECTOMY,650,SPLENECTOMY,16,DISEASES AND DISORDERS OF THE BLOOD AND BLOOD FORMING ORGANS AND IMMUNOLOGICAL DISORDERS,2,Moderate,Minor,Surgical,"Managed Care, Unspecified",,,,,false,47276.75,19055.15
Hudson Valley,Dutchess,1302001,000181,Vassar Brothers Medical Center,50 to 69,105,F,White,Not Span/Hispanic,2,Elective,Home or Self Care,2018,BLD010,OTHER SPECIFIED AND UNSPECIFIED HEMATOLOGIC CONDITIONS,LYM005,SPLENECTOMY,650,SPLENECTOMY,16,DISEASES AND DISORDERS OF THE BLOOD AND BLOOD FORMING ORGANS AND IMMUNOLOGICAL DISORDERS,2,Moderate,Moderate,Surgical,Blue Cross/Blue Shield,,,,,false,32005.86,11538.94
Long Island,Suffolk,5151001,000245,Stony Brook University Hospital,30 to 49,119,M,White,Not Span/Hispanic,5,Emergency,Home or Self Care,2018,INJ010,"INTERNAL ORGAN INJURY, INITIAL ENCOUNTER",LYM005,SPLENECTOMY,650,SPLENECTOMY,16,DISEASES AND DISORDERS OF THE BLOOD AND BLOOD FORMING ORGANS AND IMMUNOLOGICAL DISORDERS,2,Moderate,Moderate,Surgical,Medicaid,Medicaid,,,,true,60013.37,20403.01
Central NY,Onondaga,3301008,000636,Crouse Hospital,50 to 69,132,M,White,Not Span/Hispanic,6,Emergency,Home or Self Care,2018,BLD010,OTHER SPECIFIED AND UNSPECIFIED HEMATOLOGIC CONDITIONS,LYM005,SPLENECTOMY,650,SPLENECTOMY,16,DISEASES AND DISORDERS OF THE BLOOD AND BLOOD FORMING ORGANS AND IMMUNOLOGICAL DISORDERS,3,Major,Major,Surgical,Blue Cross/Blue Shield,,,,,true,39520.73,16629.81
Hudson Valley,Westchester,5902001,001045,White Plains Hospital Center,30 to 49,106,M,Other Race,Not Span/Hispanic,9,Emergency,Home or Self Care,2018,BLD006,COAGULATION AND HEMORRHAGIC DISORDERS,LYM005,SPLENECTOMY,650,SPLENECTOMY,16,DISEASES AND DISORDERS OF THE BLOOD AND BLOOD FORMING ORGANS AND IMMUNOLOGICAL DISORDERS,2,Moderate,Moderate,Surgical,Self-Pay,,,,,true,166390,38161.49
New York City,Manhattan,7002054,001464,New York-Presbyterian Hospital - Columbia Presbyterian Center,0 to 17,100,M,Multi-racial,Multi-ethnic,3,Elective,Home or Self Care,2018,BLD005,SICKLE CELL TRAIT/ANEMIA,LYM005,SPLENECTOMY,650,SPLENECTOMY,16,DISEASES AND DISORDERS OF THE BLOOD AND BLOOD FORMING ORGANS AND IMMUNOLOGICAL DISORDERS,1,Minor,Minor,Surgical,Medicaid,Medicaid,Self-Pay,,,false,71682.71,25372.39
Western NY,Erie,1401008,000213,Mercy Hospital of Buffalo,70 or Older,142,M,White,Not Span/Hispanic,2,Elective,Home or Self Care,2018,BLD006,COAGULATION AND HEMORRHAGIC DISORDERS,LYM005,SPLENECTOMY,650,SPLENECTOMY,16,DISEASES AND DISORDERS OF THE BLOOD AND BLOOD FORMING ORGANS AND IMMUNOLOGICAL DISORDERS,3,Major,Moderate,Surgical,Medicare,Private Health Insurance,,,,false,33629.55,15085.02
New York City,Kings,7001045,001692,Woodhull Medical & Mental Health Center,18 to 29,112,M,Other Race,Spanish/Hispanic,4,Elective,Home or Self Care,2018,BLD006,COAGULATION AND HEMORRHAGIC DISORDERS,LYM005,SPLENECTOMY,650,SPLENECTOMY,16,DISEASES AND DISORDERS OF THE BLOOD AND BLOOD FORMING ORGANS AND IMMUNOLOGICAL DISORDERS,1,Minor,Minor,Surgical,Medicaid,Medicaid,,,,false,23159.01,18082.16
Hudson Valley,Orange,3535001,000708,Bon Secours Community Hospital,50 to 69,127,M,White,Not Span/Hispanic,9,Emergency,Home w/ Home Health Services,2018,INJ010,"INTERNAL ORGAN INJURY, INITIAL ENCOUNTER",LYM005,SPLENECTOMY,650,SPLENECTOMY,16,DISEASES AND DISORDERS OF THE BLOOD AND BLOOD FORMING ORGANS AND IMMUNOLOGICAL DISORDERS,2,Moderate,Minor,Surgical,Medicare,Federal/State/Local/VA,,,,true,198921.71,38791.06
Long Island,Nassau,2908000,000511,NYU Langone Hospital-Long Island,0 to 17,115,F,White,Not Span/Hispanic,4,Emergency,Home or Self Care,2018,INJ010,"INTERNAL ORGAN INJURY, INITIAL ENCOUNTER",LYM005,SPLENECTOMY,650,SPLENECTOMY,16,DISEASES AND DISORDERS OF THE BLOOD AND BLOOD FORMING ORGANS AND IMMUNOLOGICAL DISORDERS,3,Major,Major,Surgical,Private Health Insurance,,,,,true,148035.71,17478.01
Hudson Valley,Dutchess,1302001,000181,Vassar Brothers Medical Center,30 to 49,125,M,White,Not Span/Hispanic,3,Elective,Home or Self Care,2018,SYM006,ABDOMINAL PAIN AND OTHER DIGESTIVE/ABDOMEN SIGNS AND SYMPTOMS,LYM005,SPLENECTOMY,650,SPLENECTOMY,16,DISEASES AND DISORDERS OF THE BLOOD AND BLOOD FORMING ORGANS AND IMMUNOLOGICAL DISORDERS,2,Moderate,Major,Surgical,Blue Cross/Blue Shield,,,,,false,49247.24,20134.48
Long Island,Suffolk,5151001,000245,Stony Brook University Hospital,30 to 49,117,M,White,Not Span/Hispanic,9,Elective,Home or Self Care,2018,BLD010,OTHER SPECIFIED AND UNSPECIFIED HEMATOLOGIC CONDITIONS,LYM005,SPLENECTOMY,650,SPLENECTOMY,16,DISEASES AND DISORDERS OF THE BLOOD AND BLOOD FORMING ORGANS AND IMMUNOLOGICAL DISORDERS,2,Moderate,Minor,Surgical,Private Health Insurance,,,,,false,112873.76,45918.17
New York City,Manhattan,7002024,001456,Mount Sinai Hospital,30 to 49,100,F,Other Race,Not Span/Hispanic,3,Emergency,Home or Self Care,2018,BLD010,OTHER SPECIFIED AND UNSPECIFIED HEMATOLOGIC CONDITIONS,LYM005,SPLENECTOMY,650,SPLENECTOMY,16,DISEASES AND DISORDERS OF THE BLOOD AND BLOOD FORMING ORGANS AND IMMUNOLOGICAL DISORDERS,2,Moderate,Moderate,Surgical,Self-Pay,Self-Pay,,,,true,66311.27,20300.58
Western NY,Erie,1401014,000208,John R. Oishei Children's Hospital,0 to 17,142,F,Black/African American,Not Span/Hispanic,5,Elective,Home or Self Care,2018,BLD005,SICKLE CELL TRAIT/ANEMIA,LYM005,SPLENECTOMY,650,SPLENECTOMY,16,DISEASES AND DISORDERS OF THE BLOOD AND BLOOD FORMING ORGANS AND IMMUNOLOGICAL DISORDERS,2,Moderate,Moderate,Surgical,Medicaid,Self-Pay,,,,false,44045.88,19793.67
New York City,Manhattan,7002054,001464,New York-Presbyterian Hospital - Columbia Presbyterian Center,30 to 49,104,F,Black/African American,Not Span/Hispanic,29,Emergency,Home or Self Care,2018,BLD010,OTHER SPECIFIED AND UNSPECIFIED HEMATOLOGIC CONDITIONS,LYM005,SPLENECTOMY,650,SPLENECTOMY,16,DISEASES AND DISORDERS OF THE BLOOD AND BLOOD FORMING ORGANS AND IMMUNOLOGICAL DISORDERS,4,Extreme,Extreme,Surgical,Medicaid,Medicaid,Self-Pay,,,false,473813.61,131995.12
New York City,Manhattan,7002001,001438,Bellevue Hospital Center,18 to 29,100,F,Other Race,Not Span/Hispanic,9,Emergency,Home or Self Care,2018,INJ010,"INTERNAL ORGAN INJURY, INITIAL ENCOUNTER",LYM005,SPLENECTOMY,650,SPLENECTOMY,16,DISEASES AND DISORDERS OF THE BLOOD AND BLOOD FORMING ORGANS AND IMMUNOLOGICAL DISORDERS,4,Extreme,Major,Surgical,Self-Pay,,,,,true,64659.91,42972.98
Western NY,Erie,1401014,000208,John R. Oishei Children's Hospital,0 to 17,142,F,Black/African American,Not Span/Hispanic,3,Elective,Home or Self Care,2018,BLD005,SICKLE CELL TRAIT/ANEMIA,LYM005,SPLENECTOMY,650,SPLENECTOMY,16,DISEASES AND DISORDERS OF THE BLOOD AND BLOOD FORMING ORGANS AND IMMUNOLOGICAL DISORDERS,2,Moderate,Moderate,Surgical,Medicaid,Self-Pay,,,,false,37744.38,16617.75
New York City,Queens,7003004,003376,Cohen Children's Medical Center,0 to 17,114,M,Other Race,Not Span/Hispanic,3,Elective,Home or Self Care,2018,MAL010,OTHER SPECIFIED AND UNSPECIFIED CONGENITAL ANOMALIES,LYM005,SPLENECTOMY,650,SPLENECTOMY,16,DISEASES AND DISORDERS OF THE BLOOD AND BLOOD FORMING ORGANS AND IMMUNOLOGICAL DISORDERS,2,Moderate,Minor,Surgical,Medicaid,Medicaid,Self-Pay,,,false,71088.62,19727.99
Hudson Valley,Westchester,5902001,001045,White Plains Hospital Center,50 to 69,105,M,Other Race,Not Span/Hispanic,6,Elective,Home or Self Care,2018,BLD002,HEMOLYTIC ANEMIA,LYM005,SPLENECTOMY,650,SPLENECTOMY,16,DISEASES AND DISORDERS OF THE BLOOD AND BLOOD FORMING ORGANS AND IMMUNOLOGICAL DISORDERS,1,Minor,Minor,Surgical,Private Health Insurance,Private Health Insurance,,,,false,97066,20528.32
Western NY,Erie,1401014,003067,Millard Fillmore Suburban Hospital,30 to 49,143,M,White,Not Span/Hispanic,1,Elective,Home or Self Care,2018,BLD006,COAGULATION AND HEMORRHAGIC DISORDERS,LYM005,SPLENECTOMY,650,SPLENECTOMY,16,DISEASES AND DISORDERS OF THE BLOOD AND BLOOD FORMING ORGANS AND IMMUNOLOGICAL DISORDERS,2,Moderate,Minor,Surgical,Blue Cross/Blue Shield,Self-Pay,,,,false,65998.18,17885.36
New York City,Kings,7001045,001692,Woodhull Medical & Mental Health Center,18 to 29,112,M,Other Race,Spanish/Hispanic,4,Emergency,Home or Self Care,2018,INJ010,"INTERNAL ORGAN INJURY, INITIAL ENCOUNTER",LYM005,SPLENECTOMY,650,SPLENECTOMY,16,DISEASES AND DISORDERS OF THE BLOOD AND BLOOD FORMING ORGANS AND IMMUNOLOGICAL DISORDERS,4,Extreme,Extreme,Surgical,Self-Pay,,,,,true,35126.2,27425.94
Long Island,Suffolk,5153000,000913,Huntington Hospital,18 to 29,117,M,White,Not Span/Hispanic,5,Elective,Home or Self Care,2018,SYM006,ABDOMINAL PAIN AND OTHER DIGESTIVE/ABDOMEN SIGNS AND SYMPTOMS,LYM006,SPLEEN PROCEDURES (EXCLUDING SPLENECTOMY),650,SPLENECTOMY,16,DISEASES AND DISORDERS OF THE BLOOD AND BLOOD FORMING ORGANS AND IMMUNOLOGICAL DISORDERS,2,Moderate,Minor,Surgical,Private Health Insurance,,,,,false,40387.89,13720.62
Southern Tier,Broome,0303001,000058,United Health Services Hospitals Inc. - Wilson Medical Center,50 to 69,137,F,White,Not Span/Hispanic,5,Urgent,Home or Self Care,2018,BLD006,COAGULATION AND HEMORRHAGIC DISORDERS,LYM005,SPLENECTOMY,650,SPLENECTOMY,16,DISEASES AND DISORDERS OF THE BLOOD AND BLOOD FORMING ORGANS AND IMMUNOLOGICAL DISORDERS,1,Minor,Minor,Surgical,Blue Cross/Blue Shield,,,,,false,91550.8,36158.27
Western NY,Erie,1404000,000267,Kenmore Mercy Hospital,18 to 29,,F,Other Race,Not Span/Hispanic,2,Elective,Home or Self Care,2018,BLD006,COAGULATION AND HEMORRHAGIC DISORDERS,LYM005,SPLENECTOMY,650,SPLENECTOMY,16,DISEASES AND DISORDERS OF THE BLOOD AND BLOOD FORMING ORGANS AND IMMUNOLOGICAL DISORDERS,2,Moderate,Minor,Surgical,Medicaid,,,,,false,22939.79,12340.97
New York City,Manhattan,7002053,001463,NYU Langone Hospitals,0 to 17,103,F,Black/African American,Not Span/Hispanic,4,Elective,Home or Self Care,2018,BLD005,SICKLE CELL TRAIT/ANEMIA,LYM005,SPLENECTOMY,650,SPLENECTOMY,16,DISEASES AND DISORDERS OF THE BLOOD AND BLOOD FORMING ORGANS AND IMMUNOLOGICAL DISORDERS,2,Moderate,Minor,Surgical,Private Health Insurance,,,,,false,136957.79,34413.68
New York City,Bronx,7000006,001169,Montefiore Medical Center - Henry & Lucy Moses Div,0 to 17,104,F,Other Race,Spanish/Hispanic,3,Emergency,Home or Self Care,2018,BLD005,SICKLE CELL TRAIT/ANEMIA,LYM005,SPLENECTOMY,650,SPLENECTOMY,16,DISEASES AND DISORDERS OF THE BLOOD AND BLOOD FORMING ORGANS AND IMMUNOLOGICAL DISORDERS,1,Minor,Minor,Surgical,Medicaid,,,,,false,53939.39,12820.67
New York City,Queens,7003007,001633,Queens Hospital Center,50 to 69,114,M,Black/African American,Unknown,6,Emergency,Home w/ Home Health Services,2018,INJ010,"INTERNAL ORGAN INJURY, INITIAL ENCOUNTER",LYM005,SPLENECTOMY,650,SPLENECTOMY,16,DISEASES AND DISORDERS OF THE BLOOD AND BLOOD FORMING ORGANS AND IMMUNOLOGICAL DISORDERS,2,Moderate,Major,Surgical,Medicare,Medicare,Medicaid,,,true,59861.83,31964.36
Long Island,Suffolk,5151001,000245,Stony Brook University Hospital,30 to 49,117,M,White,Not Span/Hispanic,4,Elective,Home or Self Care,2018,SYM006,ABDOMINAL PAIN AND OTHER DIGESTIVE/ABDOMEN SIGNS AND SYMPTOMS,LYM005,SPLENECTOMY,650,SPLENECTOMY,16,DISEASES AND DISORDERS OF THE BLOOD AND BLOOD FORMING ORGANS AND IMMUNOLOGICAL DISORDERS,2,Moderate,Minor,Surgical,Medicaid,,,,,false,48085.19,19660.33
Hudson Valley,Westchester,5957001,001139,Westchester Medical Center,50 to 69,105,F,White,Not Span/Hispanic,39,Emergency,Expired,2018,BLD010,OTHER SPECIFIED AND UNSPECIFIED HEMATOLOGIC CONDITIONS,LYM005,SPLENECTOMY,650,SPLENECTOMY,16,DISEASES AND DISORDERS OF THE BLOOD AND BLOOD FORMING ORGANS AND IMMUNOLOGICAL DISORDERS,4,Extreme,Extreme,Surgical,Private Health Insurance,,,,,true,1287334.19,272478.05
New York City,Manhattan,7002054,001464,New York-Presbyterian Hospital - Columbia Presbyterian Center,50 to 69,114,M,Other Race,Not Span/Hispanic,5,Elective,Home w/ Home Health Services,2018,BLD010,OTHER SPECIFIED AND UNSPECIFIED HEMATOLOGIC CONDITIONS,LYM005,SPLENECTOMY,650,SPLENECTOMY,16,DISEASES AND DISORDERS OF THE BLOOD AND BLOOD FORMING ORGANS AND IMMUNOLOGICAL DISORDERS,3,Major,Moderate,Surgical,Medicaid,Medicaid,Self-Pay,,,false,132771.7,51437.01
New York City,Kings,7001020,001305,Maimonides Medical Center,30 to 49,112,F,White,Not Span/Hispanic,3,Elective,Home or Self Care,2018,BLD006,COAGULATION AND HEMORRHAGIC DISORDERS,LYM005,SPLENECTOMY,650,SPLENECTOMY,16,DISEASES AND DISORDERS OF THE BLOOD AND BLOOD FORMING ORGANS AND IMMUNOLOGICAL DISORDERS,3,Major,Minor,Surgical,Blue Cross/Blue Shield,Self-Pay,,,,false,47538.05,15355.02
Finger Lakes,Monroe,2701005,000413,Strong Memorial Hospital,30 to 49,145,F,White,Not Span/Hispanic,1,Elective,Home or Self Care,2018,BLD010,OTHER SPECIFIED AND UNSPECIFIED HEMATOLOGIC CONDITIONS,LYM006,SPLEEN PROCEDURES (EXCLUDING SPLENECTOMY),650,SPLENECTOMY,16,DISEASES AND DISORDERS OF THE BLOOD AND BLOOD FORMING ORGANS AND IMMUNOLOGICAL DISORDERS,1,Minor,Minor,Surgical,Private Health Insurance,,,,,false,15144.94,7858.93
New York City,Kings,7001021,001306,New York - Presbyterian Brooklyn Methodist Hospital,0 to 17,112,M,Black/African American,Not Span/Hispanic,4,Elective,Home or Self Care,2018,BLD010,OTHER SPECIFIED AND UNSPECIFIED HEMATOLOGIC CONDITIONS,LYM005,SPLENECTOMY,650,SPLENECTOMY,16,DISEASES AND DISORDERS OF THE BLOOD AND BLOOD FORMING ORGANS AND IMMUNOLOGICAL DISORDERS,2,Moderate,Minor,Surgical,"Managed Care, Unspecified",Medicaid,Self-Pay,,,false,43370.61,22925.54
Western NY,Genesee,1801000,000339,United Memorial Medical Center North Street Campus,30 to 49,140,F,White,Not Span/Hispanic,5,Emergency,Home w/ Home Health Services,2018,INJ010,"INTERNAL ORGAN INJURY, INITIAL ENCOUNTER",LYM005,SPLENECTOMY,650,SPLENECTOMY,16,DISEASES AND DISORDERS OF THE BLOOD AND BLOOD FORMING ORGANS AND IMMUNOLOGICAL DISORDERS,4,Extreme,Extreme,Surgical,Medicaid,,,,,true,44528.71,15365.21
New York City,Manhattan,7002020,001453,Memorial Hospital for Cancer and Allied Diseases,30 to 49,113,M,White,Spanish/Hispanic,11,Elective,Home or Self Care,2018,BLD006,COAGULATION AND HEMORRHAGIC DISORDERS,LYM005,SPLENECTOMY,650,SPLENECTOMY,16,DISEASES AND DISORDERS OF THE BLOOD AND BLOOD FORMING ORGANS AND IMMUNOLOGICAL DISORDERS,3,Major,Minor,Surgical,Medicaid,Medicaid,,,,false,169763.3,59337.31
New York City,Manhattan,7002024,001456,Mount Sinai Hospital,50 to 69,OOS,M,White,Not Span/Hispanic,7,Elective,Home or Self Care,2018,BLD010,OTHER SPECIFIED AND UNSPECIFIED HEMATOLOGIC CONDITIONS,LYM005,SPLENECTOMY,650,SPLENECTOMY,16,DISEASES AND DISORDERS OF THE BLOOD AND BLOOD FORMING ORGANS AND IMMUNOLOGICAL DISORDERS,3,Major,Major,Surgical,Federal/State/Local/VA,Self-Pay,,,,false,154795.23,50399.7
New York City,Manhattan,7002053,001463,NYU Langone Hospitals,70 or Older,112,F,Other Race,Not Span/Hispanic,2,Elective,Home w/ Home Health Services,2018,SYM006,ABDOMINAL PAIN AND OTHER DIGESTIVE/ABDOMEN SIGNS AND SYMPTOMS,LYM005,SPLENECTOMY,650,SPLENECTOMY,16,DISEASES AND DISORDERS OF THE BLOOD AND BLOOD FORMING ORGANS AND IMMUNOLOGICAL DISORDERS,2,Moderate,Minor,Surgical,Medicare,Medicare,,,,false,168056.79,28494.59
Central NY,Jefferson,2201000,000367,Samaritan Medical Center,70 or Older,136,M,White,Not Span/Hispanic,2,Elective,Home or Self Care,2018,SYM006,ABDOMINAL PAIN AND OTHER DIGESTIVE/ABDOMEN SIGNS AND SYMPTOMS,LYM005,SPLENECTOMY,650,SPLENECTOMY,16,DISEASES AND DISORDERS OF THE BLOOD AND BLOOD FORMING ORGANS AND IMMUNOLOGICAL DISORDERS,2,Moderate,Minor,Surgical,Medicare,Private Health Insurance,,,,false,19851.03,11965.1
Capital/Adirond,Columbia,1001000,000146,Columbia Memorial Hospital,18 to 29,125,F,Black/African American,Not Span/Hispanic,6,Elective,Home or Self Care,2018,BLD010,OTHER SPECIFIED AND UNSPECIFIED HEMATOLOGIC CONDITIONS,LYM006,SPLEEN PROCEDURES (EXCLUDING SPLENECTOMY),650,SPLENECTOMY,16,DISEASES AND DISORDERS OF THE BLOOD AND BLOOD FORMING ORGANS AND IMMUNOLOGICAL DISORDERS,2,Moderate,Moderate,Surgical,Medicaid,,,,,true,42018.6,15318.66
Long Island,Suffolk,5154000,000924,South Shore University Hospital,30 to 49,117,M,White,Not Span/Hispanic,6,Trauma,Home or Self Care,2018,INJ010,"INTERNAL ORGAN INJURY, INITIAL ENCOUNTER",LYM005,SPLENECTOMY,650,SPLENECTOMY,16,DISEASES AND DISORDERS OF THE BLOOD AND BLOOD FORMING ORGANS AND IMMUNOLOGICAL DISORDERS,3,Major,Major,Surgical,Private Health Insurance,,,,,true,113997.2,25899.28
New York City,Bronx,7000002,001165,Jacobi Medical Center,50 to 69,104,M,White,Not Span/Hispanic,28,Emergency,Home or Self Care,2018,BLD006,COAGULATION AND HEMORRHAGIC DISORDERS,LYM005,SPLENECTOMY,650,SPLENECTOMY,16,DISEASES AND DISORDERS OF THE BLOOD AND BLOOD FORMING ORGANS AND IMMUNOLOGICAL DISORDERS,2,Moderate,Minor,Surgical,Medicaid,,,,,true,164470.35,97308.88
Central NY,Onondaga,3301007,000635,University Hospital SUNY Health Science Center,70 or Older,148,M,White,Not Span/Hispanic,11,Trauma,Skilled Nursing Home,2018,INJ010,"INTERNAL ORGAN INJURY, INITIAL ENCOUNTER",LYM005,SPLENECTOMY,650,SPLENECTOMY,16,DISEASES AND DISORDERS OF THE BLOOD AND BLOOD FORMING ORGANS AND IMMUNOLOGICAL DISORDERS,4,Extreme,Extreme,Surgical,Miscellaneous/Other,,,,,true,214829.2,63579.6