Hospital Service Area,Hospital County,Operating Certificate Number,Permanent Facility Id,Facility Name,Age Group,Zip Code - 3 digits,Gender,Race,Ethnicity,Length of Stay,Type of Admission,Patient Disposition,Discharge Year,CCS Diagnosis Code,CCS Diagnosis Description,CCS Procedure Code,CCS Procedure Description,APR DRG Code,APR DRG Description,APR MDC Code,APR MDC Description,APR Severity of Illness Code,APR Severity of Illness Description,APR Risk of Mortality,APR Medical Surgical Description,Payment Typology 1,Payment Typology 2,Payment Typology 3,Birth Weight,Abortion Edit Indicator,Emergency Department Indicator,Total Charges,Total Costs
New York City,Manhattan,7002054,001458,New York-Presbyterian Hospital - New York Weill Cornell Center,50 to 69,113,M,White,Not Span/Hispanic,12,Emergency,Home or Self Care,2018,SYM016,OTHER GENERAL SIGNS AND SYMPTOMS,CAR021,"ARTERY, VEIN, AND GREAT VESSEL PROCEDURES, NEC",651,OTHER PROCEDURES OF BLOOD & BLOOD-FORMING ORGANS,16,DISEASES AND DISORDERS OF THE BLOOD AND BLOOD FORMING ORGANS AND IMMUNOLOGICAL DISORDERS,1,Minor,Minor,Surgical,Blue Cross/Blue Shield,Blue Cross/Blue Shield,Self-Pay,,,true,189518.02,45397.75
New York City,Queens,7003004,003376,Cohen Children's Medical Center,0 to 17,114,F,Other Race,Not Span/Hispanic,2,Elective,Home or Self Care,2018,NEO073,BENIGN NEOPLASMS,LYM004,THYMECTOMY,651,OTHER PROCEDURES OF BLOOD & BLOOD-FORMING ORGANS,16,DISEASES AND DISORDERS OF THE BLOOD AND BLOOD FORMING ORGANS AND IMMUNOLOGICAL DISORDERS,2,Moderate,Minor,Surgical,Private Health Insurance,Self-Pay,,,,false,47589.53,10392.49
New York City,Manhattan,7002054,001464,New York-Presbyterian Hospital - Columbia Presbyterian Center,70 or Older,127,F,White,Not Span/Hispanic,1,Elective,Home or Self Care,2018,NEO073,BENIGN NEOPLASMS,RES008,"LUNG, PLEURA, OR DIAPHRAGM RESECTION (OPEN AND THORACOSCOPIC)",651,OTHER PROCEDURES OF BLOOD & BLOOD-FORMING ORGANS,16,DISEASES AND DISORDERS OF THE BLOOD AND BLOOD FORMING ORGANS AND IMMUNOLOGICAL DISORDERS,1,Minor,Minor,Surgical,Medicare,Blue Cross/Blue Shield,Self-Pay,,,false,30287.63,5911
New York City,Queens,7003004,001630,Long Island Jewish Medical Center,30 to 49,114,M,White,Spanish/Hispanic,7,Emergency,Home or Self Care,2018,CIR039,OTHER SPECIFIED DISEASES OF VEINS AND LYMPHATICS,LYM001,LYMPH NODE BIOPSY,651,OTHER PROCEDURES OF BLOOD & BLOOD-FORMING ORGANS,16,DISEASES AND DISORDERS OF THE BLOOD AND BLOOD FORMING ORGANS AND IMMUNOLOGICAL DISORDERS,1,Minor,Minor,Surgical,Medicaid,Medicaid,Self-Pay,,,true,112226.7,17364.03
New York City,Manhattan,7002054,001464,New York-Presbyterian Hospital - Columbia Presbyterian Center,70 or Older,OOS,M,White,Not Span/Hispanic,6,Elective,Home or Self Care,2018,CIR039,OTHER SPECIFIED DISEASES OF VEINS AND LYMPHATICS,LYM001,LYMPH NODE BIOPSY,651,OTHER PROCEDURES OF BLOOD & BLOOD-FORMING ORGANS,16,DISEASES AND DISORDERS OF THE BLOOD AND BLOOD FORMING ORGANS AND IMMUNOLOGICAL DISORDERS,3,Major,Major,Surgical,Medicare,Medicare,Self-Pay,,,false,65156.52,14818.4
New York City,Queens,7003004,001630,Long Island Jewish Medical Center,50 to 69,115,M,White,Not Span/Hispanic,1,Urgent,Home or Self Care,2018,SYM016,OTHER GENERAL SIGNS AND SYMPTOMS,LYM001,LYMPH NODE BIOPSY,651,OTHER PROCEDURES OF BLOOD & BLOOD-FORMING ORGANS,16,DISEASES AND DISORDERS OF THE BLOOD AND BLOOD FORMING ORGANS AND IMMUNOLOGICAL DISORDERS,1,Minor,Moderate,Surgical,Medicaid,Medicaid,Self-Pay,,,false,32260.8,7608.95
New York City,Queens,7003004,001630,Long Island Jewish Medical Center,70 or Older,117,M,White,Not Span/Hispanic,12,Urgent,Skilled Nursing Home,2018,NEO073,BENIGN NEOPLASMS,LYM004,THYMECTOMY,651,OTHER PROCEDURES OF BLOOD & BLOOD-FORMING ORGANS,16,DISEASES AND DISORDERS OF THE BLOOD AND BLOOD FORMING ORGANS AND IMMUNOLOGICAL DISORDERS,3,Major,Moderate,Surgical,Medicare,Medicare,Self-Pay,,,false,254819.13,58985.94
New York City,Bronx,7000006,001169,Montefiore Medical Center - Henry & Lucy Moses Div,18 to 29,104,M,Other Race,Not Span/Hispanic,7,Elective,Home or Self Care,2018,NEO073,BENIGN NEOPLASMS,LYM004,THYMECTOMY,651,OTHER PROCEDURES OF BLOOD & BLOOD-FORMING ORGANS,16,DISEASES AND DISORDERS OF THE BLOOD AND BLOOD FORMING ORGANS AND IMMUNOLOGICAL DISORDERS,3,Major,Moderate,Surgical,Private Health Insurance,,,,,false,170126.24,34132.37
New York City,Manhattan,7002032,001469,Mount Sinai Morningside,50 to 69,100,M,Black/African American,Not Span/Hispanic,1,Emergency,Home or Self Care,2018,SYM016,OTHER GENERAL SIGNS AND SYMPTOMS,LYM001,LYMPH NODE BIOPSY,651,OTHER PROCEDURES OF BLOOD & BLOOD-FORMING ORGANS,16,DISEASES AND DISORDERS OF THE BLOOD AND BLOOD FORMING ORGANS AND IMMUNOLOGICAL DISORDERS,3,Major,Major,Surgical,Medicare,Medicare,Medicaid,,,true,30522.86,7214.64
Capital/Adirond,Albany,0101000,000001,Albany Medical Center Hospital,0 to 17,124,M,White,Not Span/Hispanic,2,Emergency,Home or Self Care,2018,SKN001,SKIN AND SUBCUTANEOUS TISSUE INFECTIONS,LYM011,"LYMPHATIC PROCEDURES, NEC",651,OTHER PROCEDURES OF BLOOD & BLOOD-FORMING ORGANS,16,DISEASES AND DISORDERS OF THE BLOOD AND BLOOD FORMING ORGANS AND IMMUNOLOGICAL DISORDERS,1,Minor,Minor,Surgical,"Managed Care, Unspecified",,,,,true,21446.81,6030.35
Finger Lakes,Monroe,2701005,000413,Strong Memorial Hospital,70 or Older,135,F,White,Not Span/Hispanic,2,Urgent,Home or Self Care,2018,SYM016,OTHER GENERAL SIGNS AND SYMPTOMS,LYM003,LYMPH NODE DISSECTION,651,OTHER PROCEDURES OF BLOOD & BLOOD-FORMING ORGANS,16,DISEASES AND DISORDERS OF THE BLOOD AND BLOOD FORMING ORGANS AND IMMUNOLOGICAL DISORDERS,1,Minor,Moderate,Surgical,Medicare,Blue Cross/Blue Shield,Self-Pay,,,false,24759.71,12017.17
New York City,Queens,7003004,001630,Long Island Jewish Medical Center,18 to 29,117,M,Other Race,Not Span/Hispanic,14,Urgent,Home or Self Care,2018,BLD008,IMMUNITY DISORDERS,LYM001,LYMPH NODE BIOPSY,651,OTHER PROCEDURES OF BLOOD & BLOOD-FORMING ORGANS,16,DISEASES AND DISORDERS OF THE BLOOD AND BLOOD FORMING ORGANS AND IMMUNOLOGICAL DISORDERS,2,Moderate,Minor,Surgical,Blue Cross/Blue Shield,Self-Pay,,,,true,176786.1,32992.25
Long Island,Suffolk,5149000,000895,John T Mather Memorial Hospital of Port Jefferson New York Inc,50 to 69,119,F,White,Not Span/Hispanic,1,Elective,Home or Self Care,2018,SYM016,OTHER GENERAL SIGNS AND SYMPTOMS,LYM001,LYMPH NODE BIOPSY,651,OTHER PROCEDURES OF BLOOD & BLOOD-FORMING ORGANS,16,DISEASES AND DISORDERS OF THE BLOOD AND BLOOD FORMING ORGANS AND IMMUNOLOGICAL DISORDERS,1,Minor,Moderate,Surgical,Blue Cross/Blue Shield,,,,,false,21363.28,4406.2
Long Island,Nassau,2951001,000541,North Shore University Hospital,50 to 69,114,F,Black/African American,Not Span/Hispanic,120 +,Urgent,Skilled Nursing Home,2018,NEO073,BENIGN NEOPLASMS,GIS005,EXPLORATION OF PERITONEAL CAVITY,651,OTHER PROCEDURES OF BLOOD & BLOOD-FORMING ORGANS,16,DISEASES AND DISORDERS OF THE BLOOD AND BLOOD FORMING ORGANS AND IMMUNOLOGICAL DISORDERS,4,Extreme,Extreme,Surgical,Medicare,Medicare,,,,false,2141827.59,388724.81
Central NY,Onondaga,3301008,000636,Crouse Hospital,30 to 49,131,F,White,Not Span/Hispanic,3,Urgent,Home or Self Care,2018,SYM016,OTHER GENERAL SIGNS AND SYMPTOMS,LYM001,LYMPH NODE BIOPSY,651,OTHER PROCEDURES OF BLOOD & BLOOD-FORMING ORGANS,16,DISEASES AND DISORDERS OF THE BLOOD AND BLOOD FORMING ORGANS AND IMMUNOLOGICAL DISORDERS,1,Minor,Minor,Surgical,Private Health Insurance,,,,,true,30801.8,12816.55
New York City,Manhattan,7002053,001463,NYU Langone Hospitals,50 to 69,104,F,Black/African American,Not Span/Hispanic,1,Elective,Home w/ Home Health Services,2018,END015,OTHER SPECIFIED AND UNSPECIFIED ENDOCRINE DISORDERS,LYM004,THYMECTOMY,651,OTHER PROCEDURES OF BLOOD & BLOOD-FORMING ORGANS,16,DISEASES AND DISORDERS OF THE BLOOD AND BLOOD FORMING ORGANS AND IMMUNOLOGICAL DISORDERS,2,Moderate,Minor,Surgical,Private Health Insurance,,,,,false,105147.55,17538.07
New York City,Manhattan,7002032,001469,Mount Sinai Morningside,50 to 69,113,M,Other Race,Spanish/Hispanic,5,Emergency,Home or Self Care,2018,SYM016,OTHER GENERAL SIGNS AND SYMPTOMS,LYM001,LYMPH NODE BIOPSY,651,OTHER PROCEDURES OF BLOOD & BLOOD-FORMING ORGANS,16,DISEASES AND DISORDERS OF THE BLOOD AND BLOOD FORMING ORGANS AND IMMUNOLOGICAL DISORDERS,2,Moderate,Moderate,Surgical,Private Health Insurance,Medicaid,Self-Pay,,,true,71644.97,16357.64
New York City,Manhattan,7002024,001456,Mount Sinai Hospital,30 to 49,100,M,Other Race,Not Span/Hispanic,9,Emergency,Home or Self Care,2018,CIR039,OTHER SPECIFIED DISEASES OF VEINS AND LYMPHATICS,LYM001,LYMPH NODE BIOPSY,651,OTHER PROCEDURES OF BLOOD & BLOOD-FORMING ORGANS,16,DISEASES AND DISORDERS OF THE BLOOD AND BLOOD FORMING ORGANS AND IMMUNOLOGICAL DISORDERS,1,Minor,Moderate,Surgical,"Managed Care, Unspecified",Medicaid,Self-Pay,,,true,100048.17,30518.41
New York City,Bronx,7000006,001169,Montefiore Medical Center - Henry & Lucy Moses Div,0 to 17,104,M,Other Race,Spanish/Hispanic,7,Emergency,Home or Self Care,2018,SYM016,OTHER GENERAL SIGNS AND SYMPTOMS,LYM001,LYMPH NODE BIOPSY,651,OTHER PROCEDURES OF BLOOD & BLOOD-FORMING ORGANS,16,DISEASES AND DISORDERS OF THE BLOOD AND BLOOD FORMING ORGANS AND IMMUNOLOGICAL DISORDERS,2,Moderate,Minor,Surgical,Medicaid,,,,,false,265410.48,38288.59
Long Island,Nassau,2953000,000563,St. Francis Hospital & Heart Center,30 to 49,,F,Black/African American,Not Span/Hispanic,3,Elective,Home w/ Home Health Services,2018,NEO073,BENIGN NEOPLASMS,LYM004,THYMECTOMY,651,OTHER PROCEDURES OF BLOOD & BLOOD-FORMING ORGANS,16,DISEASES AND DISORDERS OF THE BLOOD AND BLOOD FORMING ORGANS AND IMMUNOLOGICAL DISORDERS,2,Moderate,Minor,Surgical,Blue Cross/Blue Shield,,,,,false,51854.56,10018.22
Long Island,Suffolk,5153000,000913,Huntington Hospital,18 to 29,117,F,Other Race,Not Span/Hispanic,6,Emergency,Home or Self Care,2018,BLD003,APLASTIC ANEMIA,LYM001,LYMPH NODE BIOPSY,651,OTHER PROCEDURES OF BLOOD & BLOOD-FORMING ORGANS,16,DISEASES AND DISORDERS OF THE BLOOD AND BLOOD FORMING ORGANS AND IMMUNOLOGICAL DISORDERS,1,Minor,Minor,Surgical,Medicaid,Medicaid,,,,true,68530.27,17155.15
New York City,Manhattan,7002054,001458,New York-Presbyterian Hospital - New York Weill Cornell Center,30 to 49,112,M,Black/African American,Not Span/Hispanic,6,Emergency,Home or Self Care,2018,BLD006,COAGULATION AND HEMORRHAGIC DISORDERS,LYM001,LYMPH NODE BIOPSY,651,OTHER PROCEDURES OF BLOOD & BLOOD-FORMING ORGANS,16,DISEASES AND DISORDERS OF THE BLOOD AND BLOOD FORMING ORGANS AND IMMUNOLOGICAL DISORDERS,2,Moderate,Minor,Surgical,"Managed Care, Unspecified",Medicaid,Self-Pay,,,true,103427.3,37976.03
Hudson Valley,Westchester,5904001,001072,Montefiore New Rochelle Hospital,18 to 29,105,M,Black/African American,Not Span/Hispanic,2,Emergency,Home or Self Care,2018,SYM016,OTHER GENERAL SIGNS AND SYMPTOMS,LYM001,LYMPH NODE BIOPSY,651,OTHER PROCEDURES OF BLOOD & BLOOD-FORMING ORGANS,16,DISEASES AND DISORDERS OF THE BLOOD AND BLOOD FORMING ORGANS AND IMMUNOLOGICAL DISORDERS,1,Minor,Minor,Surgical,Private Health Insurance,Medicaid,Self-Pay,,,true,17922,4240.29
New York City,Manhattan,7002017,001450,Lenox Hill Hospital,50 to 69,112,F,White,Not Span/Hispanic,1,Urgent,Home or Self Care,2018,SYM016,OTHER GENERAL SIGNS AND SYMPTOMS,LYM001,LYMPH NODE BIOPSY,651,OTHER PROCEDURES OF BLOOD & BLOOD-FORMING ORGANS,16,DISEASES AND DISORDERS OF THE BLOOD AND BLOOD FORMING ORGANS AND IMMUNOLOGICAL DISORDERS,1,Minor,Minor,Surgical,Medicaid,Medicaid,,,,false,31937.42,10109.76
Finger Lakes,Monroe,2701003,000411,Rochester General Hospital,50 to 69,144,M,White,Not Span/Hispanic,3,Urgent,Home or Self Care,2018,SYM016,OTHER GENERAL SIGNS AND SYMPTOMS,LYM002,LYMPH NODE EXCISION (THERAPEUTIC),651,OTHER PROCEDURES OF BLOOD & BLOOD-FORMING ORGANS,16,DISEASES AND DISORDERS OF THE BLOOD AND BLOOD FORMING ORGANS AND IMMUNOLOGICAL DISORDERS,1,Minor,Minor,Surgical,Blue Cross/Blue Shield,Medicare,,,,false,34222.62,14689.65
Long Island,Suffolk,5151001,000245,Stony Brook University Hospital,50 to 69,117,M,White,Not Span/Hispanic,10,Emergency,Home or Self Care,2018,CIR039,OTHER SPECIFIED DISEASES OF VEINS AND LYMPHATICS,LYM011,"LYMPHATIC PROCEDURES, NEC",651,OTHER PROCEDURES OF BLOOD & BLOOD-FORMING ORGANS,16,DISEASES AND DISORDERS OF THE BLOOD AND BLOOD FORMING ORGANS AND IMMUNOLOGICAL DISORDERS,3,Major,Moderate,Surgical,Private Health Insurance,,,,,true,119823.35,40286.84
New York City,Bronx,7000006,003058,Montefiore Med Center - Jack D Weiler Hosp of A Einstein College Div,70 or Older,104,F,Black/African American,Not Span/Hispanic,1,Emergency,Home or Self Care,2018,SYM016,OTHER GENERAL SIGNS AND SYMPTOMS,LYM001,LYMPH NODE BIOPSY,651,OTHER PROCEDURES OF BLOOD & BLOOD-FORMING ORGANS,16,DISEASES AND DISORDERS OF THE BLOOD AND BLOOD FORMING ORGANS AND IMMUNOLOGICAL DISORDERS,1,Minor,Minor,Surgical,Medicare,,,,,false,51217.19,6706.78
New York City,Kings,7001002,001286,Brookdale Hospital Medical Center,70 or Older,112,F,Other Race,Spanish/Hispanic,8,Emergency,Home or Self Care,2018,BLD001,NUTRITIONAL ANEMIA,ADM001,TRANSFUSION OF BLOOD AND BLOOD PRODUCTS,651,OTHER PROCEDURES OF BLOOD & BLOOD-FORMING ORGANS,16,DISEASES AND DISORDERS OF THE BLOOD AND BLOOD FORMING ORGANS AND IMMUNOLOGICAL DISORDERS,3,Major,Major,Surgical,Medicare,Medicaid,,,,true,39285.82,19258.49
New York City,Manhattan,7002053,001463,NYU Langone Hospitals,30 to 49,111,M,Other Race,Spanish/Hispanic,1,Elective,Home or Self Care,2018,END015,OTHER SPECIFIED AND UNSPECIFIED ENDOCRINE DISORDERS,LYM004,THYMECTOMY,651,OTHER PROCEDURES OF BLOOD & BLOOD-FORMING ORGANS,16,DISEASES AND DISORDERS OF THE BLOOD AND BLOOD FORMING ORGANS AND IMMUNOLOGICAL DISORDERS,2,Moderate,Minor,Surgical,Private Health Insurance,,,,,false,96515.15,16401.76
Long Island,Suffolk,5149000,000895,John T Mather Memorial Hospital of Port Jefferson New York Inc,70 or Older,117,M,White,Not Span/Hispanic,2,Elective,Home or Self Care,2018,NEO073,BENIGN NEOPLASMS,LYM004,THYMECTOMY,651,OTHER PROCEDURES OF BLOOD & BLOOD-FORMING ORGANS,16,DISEASES AND DISORDERS OF THE BLOOD AND BLOOD FORMING ORGANS AND IMMUNOLOGICAL DISORDERS,1,Minor,Minor,Surgical,Medicare,Medicare,Blue Cross/Blue Shield,,,false,38201.32,8911.35
New York City,Manhattan,7002053,001463,NYU Langone Hospitals,50 to 69,100,F,White,Not Span/Hispanic,2,Elective,Home or Self Care,2018,NEO073,BENIGN NEOPLASMS,LYM004,THYMECTOMY,651,OTHER PROCEDURES OF BLOOD & BLOOD-FORMING ORGANS,16,DISEASES AND DISORDERS OF THE BLOOD AND BLOOD FORMING ORGANS AND IMMUNOLOGICAL DISORDERS,2,Moderate,Minor,Surgical,Private Health Insurance,,,,,false,118928.15,22071.89
New York City,Manhattan,7002024,001456,Mount Sinai Hospital,70 or Older,101,F,Other Race,Not Span/Hispanic,3,Elective,Home or Self Care,2018,NEO073,BENIGN NEOPLASMS,LYM004,THYMECTOMY,651,OTHER PROCEDURES OF BLOOD & BLOOD-FORMING ORGANS,16,DISEASES AND DISORDERS OF THE BLOOD AND BLOOD FORMING ORGANS AND IMMUNOLOGICAL DISORDERS,2,Moderate,Minor,Surgical,Medicare,Private Health Insurance,Self-Pay,,,false,53656.21,13517.39
Long Island,Nassau,2908000,000511,NYU Langone Hospital-Long Island,50 to 69,117,F,White,Not Span/Hispanic,3,Elective,Home or Self Care,2018,SYM016,OTHER GENERAL SIGNS AND SYMPTOMS,LYM001,LYMPH NODE BIOPSY,651,OTHER PROCEDURES OF BLOOD & BLOOD-FORMING ORGANS,16,DISEASES AND DISORDERS OF THE BLOOD AND BLOOD FORMING ORGANS AND IMMUNOLOGICAL DISORDERS,1,Minor,Moderate,Surgical,Blue Cross/Blue Shield,,,,,false,70410.89,10205.59
New York City,Kings,7002053,001304,NYU Langone Hospital-Brooklyn,70 or Older,112,M,White,Not Span/Hispanic,2,Elective,Home w/ Home Health Services,2018,NEO073,BENIGN NEOPLASMS,LYM004,THYMECTOMY,651,OTHER PROCEDURES OF BLOOD & BLOOD-FORMING ORGANS,16,DISEASES AND DISORDERS OF THE BLOOD AND BLOOD FORMING ORGANS AND IMMUNOLOGICAL DISORDERS,2,Moderate,Minor,Surgical,Medicare,,,,,false,90002.87,22575.83
New York City,Manhattan,7002001,001438,Bellevue Hospital Center,50 to 69,113,F,Other Race,Not Span/Hispanic,1,Emergency,Home or Self Care,2018,END015,OTHER SPECIFIED AND UNSPECIFIED ENDOCRINE DISORDERS,LYM004,THYMECTOMY,651,OTHER PROCEDURES OF BLOOD & BLOOD-FORMING ORGANS,16,DISEASES AND DISORDERS OF THE BLOOD AND BLOOD FORMING ORGANS AND IMMUNOLOGICAL DISORDERS,2,Moderate,Minor,Surgical,Medicaid,,,,,false,3266.62,2171
Hudson Valley,Westchester,5902001,001045,White Plains Hospital Center,30 to 49,105,M,Other Race,Not Span/Hispanic,7,Emergency,Home or Self Care,2018,CIR039,OTHER SPECIFIED DISEASES OF VEINS AND LYMPHATICS,LYM001,LYMPH NODE BIOPSY,651,OTHER PROCEDURES OF BLOOD & BLOOD-FORMING ORGANS,16,DISEASES AND DISORDERS OF THE BLOOD AND BLOOD FORMING ORGANS AND IMMUNOLOGICAL DISORDERS,1,Minor,Minor,Surgical,Blue Cross/Blue Shield,,,,,true,39605,11515.27
New York City,Manhattan,7002053,001463,NYU Langone Hospitals,30 to 49,112,F,White,Not Span/Hispanic,1,Elective,Home or Self Care,2018,NEO073,BENIGN NEOPLASMS,LYM004,THYMECTOMY,651,OTHER PROCEDURES OF BLOOD & BLOOD-FORMING ORGANS,16,DISEASES AND DISORDERS OF THE BLOOD AND BLOOD FORMING ORGANS AND IMMUNOLOGICAL DISORDERS,2,Moderate,Minor,Surgical,Private Health Insurance,,,,,false,118297.84,19202.18
New York City,Manhattan,7002054,001458,New York-Presbyterian Hospital - New York Weill Cornell Center,50 to 69,100,F,Other Race,Not Span/Hispanic,2,Elective,Home or Self Care,2018,NEO073,BENIGN NEOPLASMS,LYM004,THYMECTOMY,651,OTHER PROCEDURES OF BLOOD & BLOOD-FORMING ORGANS,16,DISEASES AND DISORDERS OF THE BLOOD AND BLOOD FORMING ORGANS AND IMMUNOLOGICAL DISORDERS,2,Moderate,Minor,Surgical,Private Health Insurance,Self-Pay,,,,false,62758.84,22384.95
New York City,Manhattan,7002020,001453,Memorial Hospital for Cancer and Allied Diseases,50 to 69,100,M,White,Not Span/Hispanic,1,Elective,Home or Self Care,2018,NEO073,BENIGN NEOPLASMS,LYM004,THYMECTOMY,651,OTHER PROCEDURES OF BLOOD & BLOOD-FORMING ORGANS,16,DISEASES AND DISORDERS OF THE BLOOD AND BLOOD FORMING ORGANS AND IMMUNOLOGICAL DISORDERS,1,Minor,Minor,Surgical,Private Health Insurance,,,,,false,41146.29,17996.81
New York City,Manhattan,7002053,001463,NYU Langone Hospitals,70 or Older,112,M,White,Not Span/Hispanic,3,Elective,Home or Self Care,2018,NEO073,BENIGN NEOPLASMS,LYM004,THYMECTOMY,651,OTHER PROCEDURES OF BLOOD & BLOOD-FORMING ORGANS,16,DISEASES AND DISORDERS OF THE BLOOD AND BLOOD FORMING ORGANS AND IMMUNOLOGICAL DISORDERS,2,Moderate,Major,Surgical,Medicare,,,,,false,244405.66,37674.12
New York City,Bronx,7000024,001186,North Central Bronx Hospital,30 to 49,104,M,Black/African American,Not Span/Hispanic,1,Emergency,Home or Self Care,2018,CIR039,OTHER SPECIFIED DISEASES OF VEINS AND LYMPHATICS,LYM001,LYMPH NODE BIOPSY,651,OTHER PROCEDURES OF BLOOD & BLOOD-FORMING ORGANS,16,DISEASES AND DISORDERS OF THE BLOOD AND BLOOD FORMING ORGANS AND IMMUNOLOGICAL DISORDERS,1,Minor,Minor,Surgical,Medicaid,Medicaid,,,,true,8872.46,5326.22
New York City,Bronx,7000008,001172,Lincoln Medical & Mental Health Center,30 to 49,104,F,Other Race,Spanish/Hispanic,5,Elective,Home or Self Care,2018,SYM016,OTHER GENERAL SIGNS AND SYMPTOMS,LYM001,LYMPH NODE BIOPSY,651,OTHER PROCEDURES OF BLOOD & BLOOD-FORMING ORGANS,16,DISEASES AND DISORDERS OF THE BLOOD AND BLOOD FORMING ORGANS AND IMMUNOLOGICAL DISORDERS,1,Minor,Minor,Surgical,Medicaid,Medicaid,,,,false,45595.24,26926.59
New York City,Bronx,7000008,001172,Lincoln Medical & Mental Health Center,50 to 69,104,F,Other Race,Spanish/Hispanic,3,Emergency,Home or Self Care,2018,SYM016,OTHER GENERAL SIGNS AND SYMPTOMS,LYM001,LYMPH NODE BIOPSY,651,OTHER PROCEDURES OF BLOOD & BLOOD-FORMING ORGANS,16,DISEASES AND DISORDERS OF THE BLOOD AND BLOOD FORMING ORGANS AND IMMUNOLOGICAL DISORDERS,2,Moderate,Major,Surgical,Medicaid,,,,,true,20715.14,12233.47
New York City,Queens,7003010,001637,New York - Presbyterian/Queens,70 or Older,113,M,Other Race,Not Span/Hispanic,1,Elective,Home or Self Care,2018,END015,OTHER SPECIFIED AND UNSPECIFIED ENDOCRINE DISORDERS,LYM004,THYMECTOMY,651,OTHER PROCEDURES OF BLOOD & BLOOD-FORMING ORGANS,16,DISEASES AND DISORDERS OF THE BLOOD AND BLOOD FORMING ORGANS AND IMMUNOLOGICAL DISORDERS,2,Moderate,Minor,Surgical,Medicare,Medicare,Medicaid,,,false,29457.7,12094.1
New York City,Kings,7001021,001306,New York - Presbyterian Brooklyn Methodist Hospital,50 to 69,112,M,White,Not Span/Hispanic,1,Emergency,Home or Self Care,2018,SYM016,OTHER GENERAL SIGNS AND SYMPTOMS,LYM001,LYMPH NODE BIOPSY,651,OTHER PROCEDURES OF BLOOD & BLOOD-FORMING ORGANS,16,DISEASES AND DISORDERS OF THE BLOOD AND BLOOD FORMING ORGANS AND IMMUNOLOGICAL DISORDERS,1,Minor,Minor,Surgical,Medicare,Medicare,Self-Pay,,,true,26041.51,9330.71
New York City,Richmond,7004003,001740,Staten Island University Hosp-North,50 to 69,112,F,White,Not Span/Hispanic,6,Emergency,Home or Self Care,2018,SYM016,OTHER GENERAL SIGNS AND SYMPTOMS,LYM001,LYMPH NODE BIOPSY,651,OTHER PROCEDURES OF BLOOD & BLOOD-FORMING ORGANS,16,DISEASES AND DISORDERS OF THE BLOOD AND BLOOD FORMING ORGANS AND IMMUNOLOGICAL DISORDERS,1,Minor,Minor,Surgical,Medicaid,Medicaid,,,,true,104159.55,21293.52
New York City,Richmond,7004010,001738,Richmond University Medical Center,70 or Older,103,F,White,Not Span/Hispanic,2,Emergency,Home w/ Home Health Services,2018,SKN001,SKIN AND SUBCUTANEOUS TISSUE INFECTIONS,MST004,INCISION AND DRAINAGE OF MUSCULOSKELETAL TISSUE AND JOINTS,651,OTHER PROCEDURES OF BLOOD & BLOOD-FORMING ORGANS,16,DISEASES AND DISORDERS OF THE BLOOD AND BLOOD FORMING ORGANS AND IMMUNOLOGICAL DISORDERS,1,Minor,Minor,Surgical,Medicare,Private Health Insurance,Self-Pay,,,true,18173.73,5808.52
New York City,Manhattan,7002020,001453,Memorial Hospital for Cancer and Allied Diseases,30 to 49,OOS,M,White,Not Span/Hispanic,7,Elective,Home or Self Care,2018,CIR039,OTHER SPECIFIED DISEASES OF VEINS AND LYMPHATICS,LYM002,LYMPH NODE EXCISION (THERAPEUTIC),651,OTHER PROCEDURES OF BLOOD & BLOOD-FORMING ORGANS,16,DISEASES AND DISORDERS OF THE BLOOD AND BLOOD FORMING ORGANS AND IMMUNOLOGICAL DISORDERS,2,Moderate,Moderate,Surgical,Blue Cross/Blue Shield,,,,,false,86635.09,35117.88
Long Island,Nassau,2953000,000563,St. Francis Hospital & Heart Center,50 to 69,115,M,Other Race,Not Span/Hispanic,3,Elective,Home or Self Care,2018,NEO073,BENIGN NEOPLASMS,LYM004,THYMECTOMY,651,OTHER PROCEDURES OF BLOOD & BLOOD-FORMING ORGANS,16,DISEASES AND DISORDERS OF THE BLOOD AND BLOOD FORMING ORGANS AND IMMUNOLOGICAL DISORDERS,2,Moderate,Minor,Surgical,Medicare,Medicare,,,,false,65078.21,10506.32
New York City,Manhattan,7002054,001464,New York-Presbyterian Hospital - Columbia Presbyterian Center,18 to 29,104,F,Black/African American,Not Span/Hispanic,9,Emergency,Home or Self Care,2018,SKN001,SKIN AND SUBCUTANEOUS TISSUE INFECTIONS,LYM001,LYMPH NODE BIOPSY,651,OTHER PROCEDURES OF BLOOD & BLOOD-FORMING ORGANS,16,DISEASES AND DISORDERS OF THE BLOOD AND BLOOD FORMING ORGANS AND IMMUNOLOGICAL DISORDERS,3,Major,Minor,Surgical,Medicaid,Medicaid,Self-Pay,,,true,100523.28,21994.01
Central NY,Onondaga,3301003,000630,St. Joseph's Hospital Health Center,30 to 49,132,M,Other Race,Not Span/Hispanic,1,Elective,Home or Self Care,2018,CIR039,OTHER SPECIFIED DISEASES OF VEINS AND LYMPHATICS,LYM011,"LYMPHATIC PROCEDURES, NEC",651,OTHER PROCEDURES OF BLOOD & BLOOD-FORMING ORGANS,16,DISEASES AND DISORDERS OF THE BLOOD AND BLOOD FORMING ORGANS AND IMMUNOLOGICAL DISORDERS,1,Minor,Minor,Surgical,Medicaid,,,,,false,9662.85,4335.09
,,,,Redacted for Confidentiality,30 to 49,,M,White,Spanish/Hispanic,1,Elective,Home or Self Care,2018,SYM016,OTHER GENERAL SIGNS AND SYMPTOMS,LYM001,LYMPH NODE BIOPSY,651,OTHER PROCEDURES OF BLOOD & BLOOD-FORMING ORGANS,16,DISEASES AND DISORDERS OF THE BLOOD AND BLOOD FORMING ORGANS AND IMMUNOLOGICAL DISORDERS,1,Minor,Minor,Surgical,Medicaid,Medicaid,,,,false,13111.9,5093.64