Hospital Service Area,Hospital County,Operating Certificate Number,Permanent Facility Id,Facility Name,Age Group,Zip Code - 3 digits,Gender,Race,Ethnicity,Length of Stay,Type of Admission,Patient Disposition,Discharge Year,CCS Diagnosis Code,CCS Diagnosis Description,CCS Procedure Code,CCS Procedure Description,APR DRG Code,APR DRG Description,APR MDC Code,APR MDC Description,APR Severity of Illness Code,APR Severity of Illness Description,APR Risk of Mortality,APR Medical Surgical Description,Payment Typology 1,Payment Typology 2,Payment Typology 3,Birth Weight,Abortion Edit Indicator,Emergency Department Indicator,Total Charges,Total Costs
New York City,Manhattan,7002020,001453,Memorial Hospital for Cancer and Allied Diseases,0 to 17,105,F,White,Not Span/Hispanic,4,Emergency,Home or Self Care,2018,NEO074,CONDITIONS DUE TO NEOPLASM OR THE TREATMENT OF NEOPLASM,ADM017,ADMINISTRATION OF NUTRITIONAL AND ELECTROLYTIC SUBSTANCES,660,MAJOR HEMATOLOGIC/IMMUNOLOGIC DIAG EXC SICKLE CELL CRISIS & COAGUL,16,DISEASES AND DISORDERS OF THE BLOOD AND BLOOD FORMING ORGANS AND IMMUNOLOGICAL DISORDERS,3,Major,Moderate,Medical,Medicaid,,,,,false,42798.08,17412.12
New York City,Manhattan,7002054,001458,New York-Presbyterian Hospital - New York Weill Cornell Center,70 or Older,100,F,White,Not Span/Hispanic,3,Emergency,Home w/ Home Health Services,2018,NEO074,CONDITIONS DUE TO NEOPLASM OR THE TREATMENT OF NEOPLASM,RAD004,"RADIATION THERAPY, NEC",660,MAJOR HEMATOLOGIC/IMMUNOLOGIC DIAG EXC SICKLE CELL CRISIS & COAGUL,16,DISEASES AND DISORDERS OF THE BLOOD AND BLOOD FORMING ORGANS AND IMMUNOLOGICAL DISORDERS,4,Extreme,Major,Medical,Medicare,Private Health Insurance,Self-Pay,,,true,51313.38,11076.22
Capital/Adirond,Schenectady,4601001,000829,Ellis Hospital,30 to 49,123,M,White,Not Span/Hispanic,9,Emergency,Short-term Hospital,2018,BLD003,APLASTIC ANEMIA,ADM001,TRANSFUSION OF BLOOD AND BLOOD PRODUCTS,660,MAJOR HEMATOLOGIC/IMMUNOLOGIC DIAG EXC SICKLE CELL CRISIS & COAGUL,16,DISEASES AND DISORDERS OF THE BLOOD AND BLOOD FORMING ORGANS AND IMMUNOLOGICAL DISORDERS,3,Major,Major,Medical,Medicare,Medicare,Medicaid,,,true,66104,18346.88
New York City,Kings,7001037,001320,University Hospital of Brooklyn,70 or Older,112,M,Black/African American,Not Span/Hispanic,5,Emergency,Home or Self Care,2018,BLD003,APLASTIC ANEMIA,IMG004,FLUOROSCOPY OF NON-CIRCULATORY ORGANS,660,MAJOR HEMATOLOGIC/IMMUNOLOGIC DIAG EXC SICKLE CELL CRISIS & COAGUL,16,DISEASES AND DISORDERS OF THE BLOOD AND BLOOD FORMING ORGANS AND IMMUNOLOGICAL DISORDERS,3,Major,Moderate,Medical,Medicare,Self-Pay,,,,true,27298,16805.86
New York City,Manhattan,7002020,001453,Memorial Hospital for Cancer and Allied Diseases,30 to 49,100,F,White,Not Span/Hispanic,4,Emergency,Home or Self Care,2018,BLD007,DISEASES OF WHITE BLOOD CELLS,,,660,MAJOR HEMATOLOGIC/IMMUNOLOGIC DIAG EXC SICKLE CELL CRISIS & COAGUL,16,DISEASES AND DISORDERS OF THE BLOOD AND BLOOD FORMING ORGANS AND IMMUNOLOGICAL DISORDERS,2,Moderate,Moderate,Medical,Blue Cross/Blue Shield,,,,,true,42629.11,15785.95
Finger Lakes,Monroe,2701003,000411,Rochester General Hospital,50 to 69,146,M,Black/African American,Not Span/Hispanic,6,Emergency,Home or Self Care,2018,BLD007,DISEASES OF WHITE BLOOD CELLS,,,660,MAJOR HEMATOLOGIC/IMMUNOLOGIC DIAG EXC SICKLE CELL CRISIS & COAGUL,16,DISEASES AND DISORDERS OF THE BLOOD AND BLOOD FORMING ORGANS AND IMMUNOLOGICAL DISORDERS,2,Moderate,Moderate,Medical,Medicaid,,,,,true,17101.98,8915.08
New York City,Queens,7003010,001637,New York - Presbyterian/Queens,50 to 69,113,M,Other Race,Multi-ethnic,5,Emergency,Short-term Hospital,2018,BLD003,APLASTIC ANEMIA,ADM001,TRANSFUSION OF BLOOD AND BLOOD PRODUCTS,660,MAJOR HEMATOLOGIC/IMMUNOLOGIC DIAG EXC SICKLE CELL CRISIS & COAGUL,16,DISEASES AND DISORDERS OF THE BLOOD AND BLOOD FORMING ORGANS AND IMMUNOLOGICAL DISORDERS,1,Minor,Minor,Medical,Medicaid,Self-Pay,,,,true,48095.54,12634.47
New York City,Manhattan,7002054,001458,New York-Presbyterian Hospital - New York Weill Cornell Center,18 to 29,103,M,White,Not Span/Hispanic,6,Emergency,Home or Self Care,2018,INJ036,"COMPLICATION OF TRANSPLANTED ORGANS OR TISSUE, INITIAL ENCOUNTER",HEP001,LIVER BIOPSY,660,MAJOR HEMATOLOGIC/IMMUNOLOGIC DIAG EXC SICKLE CELL CRISIS & COAGUL,16,DISEASES AND DISORDERS OF THE BLOOD AND BLOOD FORMING ORGANS AND IMMUNOLOGICAL DISORDERS,4,Extreme,Major,Medical,Medicare,Medicare,Medicaid,,,false,121093.91,28713.24
New York City,Manhattan,7002054,001458,New York-Presbyterian Hospital - New York Weill Cornell Center,18 to 29,103,M,White,Not Span/Hispanic,12,Emergency,Home or Self Care,2018,INJ036,"COMPLICATION OF TRANSPLANTED ORGANS OR TISSUE, INITIAL ENCOUNTER",ADM012,CHEMOTHERAPY,660,MAJOR HEMATOLOGIC/IMMUNOLOGIC DIAG EXC SICKLE CELL CRISIS & COAGUL,16,DISEASES AND DISORDERS OF THE BLOOD AND BLOOD FORMING ORGANS AND IMMUNOLOGICAL DISORDERS,4,Extreme,Major,Medical,Medicare,Medicare,Medicaid,,,false,202650.32,45409.52
Central NY,Cortland,1101000,000158,Guthrie Cortland Medical Center,70 or Older,130,M,White,Not Span/Hispanic,1,Emergency,Home or Self Care,2018,BLD003,APLASTIC ANEMIA,,,660,MAJOR HEMATOLOGIC/IMMUNOLOGIC DIAG EXC SICKLE CELL CRISIS & COAGUL,16,DISEASES AND DISORDERS OF THE BLOOD AND BLOOD FORMING ORGANS AND IMMUNOLOGICAL DISORDERS,1,Minor,Minor,Medical,Medicare,Private Health Insurance,,,,true,8697.96,3593.79
Long Island,Suffolk,5154001,000925,Good Samaritan Hospital Medical Center,70 or Older,117,M,White,Not Span/Hispanic,21,Emergency,Home w/ Home Health Services,2018,NEO074,CONDITIONS DUE TO NEOPLASM OR THE TREATMENT OF NEOPLASM,CAR025,PLACEMENT OF TUNNELED OR IMPLANTABLE PORTION OF A VASCULAR ACCESS DEVICE,660,MAJOR HEMATOLOGIC/IMMUNOLOGIC DIAG EXC SICKLE CELL CRISIS & COAGUL,16,DISEASES AND DISORDERS OF THE BLOOD AND BLOOD FORMING ORGANS AND IMMUNOLOGICAL DISORDERS,4,Extreme,Extreme,Medical,Medicare,Blue Cross/Blue Shield,,,,true,213078,43409.67
Long Island,Nassau,2950001,000527,Mount Sinai South Nassau,70 or Older,115,M,White,Not Span/Hispanic,5,Emergency,Skilled Nursing Home,2018,BLD003,APLASTIC ANEMIA,ADM001,TRANSFUSION OF BLOOD AND BLOOD PRODUCTS,660,MAJOR HEMATOLOGIC/IMMUNOLOGIC DIAG EXC SICKLE CELL CRISIS & COAGUL,16,DISEASES AND DISORDERS OF THE BLOOD AND BLOOD FORMING ORGANS AND IMMUNOLOGICAL DISORDERS,4,Extreme,Major,Medical,Medicare,,,,,true,61609.15,9623.15
New York City,Manhattan,7002020,001453,Memorial Hospital for Cancer and Allied Diseases,50 to 69,114,F,Black/African American,Not Span/Hispanic,2,Emergency,Home w/ Home Health Services,2018,BLD007,DISEASES OF WHITE BLOOD CELLS,,,660,MAJOR HEMATOLOGIC/IMMUNOLOGIC DIAG EXC SICKLE CELL CRISIS & COAGUL,16,DISEASES AND DISORDERS OF THE BLOOD AND BLOOD FORMING ORGANS AND IMMUNOLOGICAL DISORDERS,3,Major,Major,Medical,Private Health Insurance,,,,,true,23592.07,9033.22
New York City,Manhattan,7002020,001453,Memorial Hospital for Cancer and Allied Diseases,50 to 69,109,F,White,Not Span/Hispanic,3,Emergency,Home or Self Care,2018,BLD007,DISEASES OF WHITE BLOOD CELLS,,,660,MAJOR HEMATOLOGIC/IMMUNOLOGIC DIAG EXC SICKLE CELL CRISIS & COAGUL,16,DISEASES AND DISORDERS OF THE BLOOD AND BLOOD FORMING ORGANS AND IMMUNOLOGICAL DISORDERS,3,Major,Major,Medical,Private Health Insurance,Medicare,,,,true,28391.14,10376.35
New York City,Richmond,7004003,001740,Staten Island University Hosp-North,70 or Older,103,F,White,Not Span/Hispanic,4,Emergency,Home or Self Care,2018,NEO074,CONDITIONS DUE TO NEOPLASM OR THE TREATMENT OF NEOPLASM,ADM001,TRANSFUSION OF BLOOD AND BLOOD PRODUCTS,660,MAJOR HEMATOLOGIC/IMMUNOLOGIC DIAG EXC SICKLE CELL CRISIS & COAGUL,16,DISEASES AND DISORDERS OF THE BLOOD AND BLOOD FORMING ORGANS AND IMMUNOLOGICAL DISORDERS,2,Moderate,Major,Medical,Federal/State/Local/VA,Medicare,,,,true,30071.6,7186.41
New York City,Manhattan,7002020,001453,Memorial Hospital for Cancer and Allied Diseases,30 to 49,OOS,M,White,Not Span/Hispanic,3,Emergency,Home or Self Care,2018,BLD007,DISEASES OF WHITE BLOOD CELLS,,,660,MAJOR HEMATOLOGIC/IMMUNOLOGIC DIAG EXC SICKLE CELL CRISIS & COAGUL,16,DISEASES AND DISORDERS OF THE BLOOD AND BLOOD FORMING ORGANS AND IMMUNOLOGICAL DISORDERS,3,Major,Moderate,Medical,Private Health Insurance,,,,,true,34297.97,13025.21
Hudson Valley,Westchester,5957001,001139,Westchester Medical Center,50 to 69,105,F,White,Not Span/Hispanic,14,Urgent,Home or Self Care,2018,BLD007,DISEASES OF WHITE BLOOD CELLS,ADM001,TRANSFUSION OF BLOOD AND BLOOD PRODUCTS,660,MAJOR HEMATOLOGIC/IMMUNOLOGIC DIAG EXC SICKLE CELL CRISIS & COAGUL,16,DISEASES AND DISORDERS OF THE BLOOD AND BLOOD FORMING ORGANS AND IMMUNOLOGICAL DISORDERS,2,Moderate,Minor,Medical,Private Health Insurance,,,,,false,250727.65,45315.18
New York City,Manhattan,7002020,001453,Memorial Hospital for Cancer and Allied Diseases,18 to 29,116,M,White,Not Span/Hispanic,3,Emergency,Home or Self Care,2018,NEO074,CONDITIONS DUE TO NEOPLASM OR THE TREATMENT OF NEOPLASM,,,660,MAJOR HEMATOLOGIC/IMMUNOLOGIC DIAG EXC SICKLE CELL CRISIS & COAGUL,16,DISEASES AND DISORDERS OF THE BLOOD AND BLOOD FORMING ORGANS AND IMMUNOLOGICAL DISORDERS,2,Moderate,Moderate,Medical,Medicaid,Medicaid,,,,false,27869.94,9585.91
New York City,Manhattan,7002020,001453,Memorial Hospital for Cancer and Allied Diseases,30 to 49,117,M,White,Not Span/Hispanic,4,Emergency,Home or Self Care,2018,BLD007,DISEASES OF WHITE BLOOD CELLS,ADM012,CHEMOTHERAPY,660,MAJOR HEMATOLOGIC/IMMUNOLOGIC DIAG EXC SICKLE CELL CRISIS & COAGUL,16,DISEASES AND DISORDERS OF THE BLOOD AND BLOOD FORMING ORGANS AND IMMUNOLOGICAL DISORDERS,3,Major,Major,Medical,Private Health Insurance,,,,,false,31950.72,11978.26
New York City,Manhattan,7002020,001453,Memorial Hospital for Cancer and Allied Diseases,18 to 29,OOS,F,Black/African American,Spanish/Hispanic,3,Emergency,Home or Self Care,2018,BLD007,DISEASES OF WHITE BLOOD CELLS,ADM018,IRRIGATION (DIAGNOSTIC AND THERAPEUTIC),660,MAJOR HEMATOLOGIC/IMMUNOLOGIC DIAG EXC SICKLE CELL CRISIS & COAGUL,16,DISEASES AND DISORDERS OF THE BLOOD AND BLOOD FORMING ORGANS AND IMMUNOLOGICAL DISORDERS,2,Moderate,Moderate,Medical,Blue Cross/Blue Shield,,,,,false,25530.42,11746.05
New York City,Kings,7002053,001304,NYU Langone Hospital-Brooklyn,18 to 29,112,M,Other Race,Not Span/Hispanic,4,Emergency,Home or Self Care,2018,BLD003,APLASTIC ANEMIA,LYM007,BONE MARROW BIOPSY,660,MAJOR HEMATOLOGIC/IMMUNOLOGIC DIAG EXC SICKLE CELL CRISIS & COAGUL,16,DISEASES AND DISORDERS OF THE BLOOD AND BLOOD FORMING ORGANS AND IMMUNOLOGICAL DISORDERS,1,Minor,Minor,Medical,Medicaid,,,,,true,72745.96,19257.62
New York City,Manhattan,7002054,001464,New York-Presbyterian Hospital - Columbia Presbyterian Center,70 or Older,100,F,Multi-racial,Multi-ethnic,2,Emergency,Home or Self Care,2018,NEO074,CONDITIONS DUE TO NEOPLASM OR THE TREATMENT OF NEOPLASM,ADM021,"ADMINISTRATION OF THERAPEUTIC SUBSTANCES, NEC",660,MAJOR HEMATOLOGIC/IMMUNOLOGIC DIAG EXC SICKLE CELL CRISIS & COAGUL,16,DISEASES AND DISORDERS OF THE BLOOD AND BLOOD FORMING ORGANS AND IMMUNOLOGICAL DISORDERS,2,Moderate,Moderate,Medical,Medicare,Medicare,Self-Pay,,,true,32595.6,7032.83
New York City,Manhattan,7002054,001464,New York-Presbyterian Hospital - Columbia Presbyterian Center,0 to 17,100,M,White,Spanish/Hispanic,3,Emergency,Home or Self Care,2018,BLD003,APLASTIC ANEMIA,ADM001,TRANSFUSION OF BLOOD AND BLOOD PRODUCTS,660,MAJOR HEMATOLOGIC/IMMUNOLOGIC DIAG EXC SICKLE CELL CRISIS & COAGUL,16,DISEASES AND DISORDERS OF THE BLOOD AND BLOOD FORMING ORGANS AND IMMUNOLOGICAL DISORDERS,3,Major,Moderate,Medical,Medicaid,Medicaid,Self-Pay,,,false,53843.41,14904.01
Long Island,Suffolk,5151001,000245,Stony Brook University Hospital,70 or Older,119,M,White,Not Span/Hispanic,15,Emergency,Expired,2018,BLD007,DISEASES OF WHITE BLOOD CELLS,ESA004,NON-INVASIVE VENTILATION,660,MAJOR HEMATOLOGIC/IMMUNOLOGIC DIAG EXC SICKLE CELL CRISIS & COAGUL,16,DISEASES AND DISORDERS OF THE BLOOD AND BLOOD FORMING ORGANS AND IMMUNOLOGICAL DISORDERS,4,Extreme,Extreme,Medical,Medicare,Private Health Insurance,,,,true,250930.93,68641.67
Central NY,Onondaga,3301003,000630,St. Joseph's Hospital Health Center,70 or Older,130,F,White,Not Span/Hispanic,5,Emergency,Home w/ Home Health Services,2018,NEO074,CONDITIONS DUE TO NEOPLASM OR THE TREATMENT OF NEOPLASM,,,660,MAJOR HEMATOLOGIC/IMMUNOLOGIC DIAG EXC SICKLE CELL CRISIS & COAGUL,16,DISEASES AND DISORDERS OF THE BLOOD AND BLOOD FORMING ORGANS AND IMMUNOLOGICAL DISORDERS,2,Moderate,Moderate,Medical,Medicare,Blue Cross/Blue Shield,,,,true,13987.56,5824.46
Finger Lakes,Monroe,2701005,000413,Strong Memorial Hospital,70 or Older,145,M,White,Not Span/Hispanic,4,Urgent,Home or Self Care,2018,BLD007,DISEASES OF WHITE BLOOD CELLS,,,660,MAJOR HEMATOLOGIC/IMMUNOLOGIC DIAG EXC SICKLE CELL CRISIS & COAGUL,16,DISEASES AND DISORDERS OF THE BLOOD AND BLOOD FORMING ORGANS AND IMMUNOLOGICAL DISORDERS,3,Major,Major,Medical,Medicare,,,,,false,18159.5,7106.09
New York City,Manhattan,7002024,001456,Mount Sinai Hospital,0 to 17,104,M,Other Race,Spanish/Hispanic,4,Emergency,Home or Self Care,2018,BLD007,DISEASES OF WHITE BLOOD CELLS,OTR004,ISOLATION PROCEDURES,660,MAJOR HEMATOLOGIC/IMMUNOLOGIC DIAG EXC SICKLE CELL CRISIS & COAGUL,16,DISEASES AND DISORDERS OF THE BLOOD AND BLOOD FORMING ORGANS AND IMMUNOLOGICAL DISORDERS,3,Major,Moderate,Medical,Blue Cross/Blue Shield,Self-Pay,,,,true,47388.88,15868.18
Western NY,Erie,1401010,000216,Roswell Park Cancer Institute,50 to 69,143,F,Black/African American,Not Span/Hispanic,4,Urgent,Home or Self Care,2018,BLD007,DISEASES OF WHITE BLOOD CELLS,ADM015,ADMINISTRATION OF ANTIBIOTICS,660,MAJOR HEMATOLOGIC/IMMUNOLOGIC DIAG EXC SICKLE CELL CRISIS & COAGUL,16,DISEASES AND DISORDERS OF THE BLOOD AND BLOOD FORMING ORGANS AND IMMUNOLOGICAL DISORDERS,3,Major,Moderate,Medical,Medicare,Medicaid,,,,false,13472.16,4838.21
Capital/Adirond,Schenectady,4601001,000829,Ellis Hospital,70 or Older,121,F,White,Not Span/Hispanic,3,Emergency,Home or Self Care,2018,BLD007,DISEASES OF WHITE BLOOD CELLS,ADM001,TRANSFUSION OF BLOOD AND BLOOD PRODUCTS,660,MAJOR HEMATOLOGIC/IMMUNOLOGIC DIAG EXC SICKLE CELL CRISIS & COAGUL,16,DISEASES AND DISORDERS OF THE BLOOD AND BLOOD FORMING ORGANS AND IMMUNOLOGICAL DISORDERS,4,Extreme,Major,Medical,Medicare,Medicare,,,,true,16676.7,4945.12
New York City,Manhattan,7002032,001466,Mount Sinai West,70 or Older,113,F,Other Race,Not Span/Hispanic,4,Emergency,Home or Self Care,2018,NEO074,CONDITIONS DUE TO NEOPLASM OR THE TREATMENT OF NEOPLASM,ADM015,ADMINISTRATION OF ANTIBIOTICS,660,MAJOR HEMATOLOGIC/IMMUNOLOGIC DIAG EXC SICKLE CELL CRISIS & COAGUL,16,DISEASES AND DISORDERS OF THE BLOOD AND BLOOD FORMING ORGANS AND IMMUNOLOGICAL DISORDERS,3,Major,Major,Medical,Medicare,Medicare,Self-Pay,,,true,57642.23,12933.69
New York City,Manhattan,7002020,001453,Memorial Hospital for Cancer and Allied Diseases,30 to 49,112,F,Black/African American,Spanish/Hispanic,1,Emergency,Home or Self Care,2018,INJ036,"COMPLICATION OF TRANSPLANTED ORGANS OR TISSUE, INITIAL ENCOUNTER",,,660,MAJOR HEMATOLOGIC/IMMUNOLOGIC DIAG EXC SICKLE CELL CRISIS & COAGUL,16,DISEASES AND DISORDERS OF THE BLOOD AND BLOOD FORMING ORGANS AND IMMUNOLOGICAL DISORDERS,3,Major,Moderate,Medical,Private Health Insurance,Medicaid,,,,true,99859.64,38316.53
New York City,Kings,7001037,001320,University Hospital of Brooklyn,70 or Older,112,M,Black/African American,Not Span/Hispanic,1,Urgent,Home or Self Care,2018,NEO074,CONDITIONS DUE TO NEOPLASM OR THE TREATMENT OF NEOPLASM,ADM001,TRANSFUSION OF BLOOD AND BLOOD PRODUCTS,660,MAJOR HEMATOLOGIC/IMMUNOLOGIC DIAG EXC SICKLE CELL CRISIS & COAGUL,16,DISEASES AND DISORDERS OF THE BLOOD AND BLOOD FORMING ORGANS AND IMMUNOLOGICAL DISORDERS,3,Major,Major,Medical,Medicare,Medicare,Self-Pay,,,false,11050,4834.44
Finger Lakes,Ontario,3402000,000671,Geneva General Hospital,70 or Older,131,M,White,Not Span/Hispanic,3,Emergency,Home or Self Care,2018,NEO074,CONDITIONS DUE TO NEOPLASM OR THE TREATMENT OF NEOPLASM,ADM001,TRANSFUSION OF BLOOD AND BLOOD PRODUCTS,660,MAJOR HEMATOLOGIC/IMMUNOLOGIC DIAG EXC SICKLE CELL CRISIS & COAGUL,16,DISEASES AND DISORDERS OF THE BLOOD AND BLOOD FORMING ORGANS AND IMMUNOLOGICAL DISORDERS,4,Extreme,Major,Medical,Medicare,Blue Cross/Blue Shield,,,,true,22134.6,7882.59
Hudson Valley,Westchester,5957001,001139,Westchester Medical Center,0 to 17,105,F,Other Race,Unknown,5,Emergency,Home or Self Care,2018,BLD007,DISEASES OF WHITE BLOOD CELLS,,,660,MAJOR HEMATOLOGIC/IMMUNOLOGIC DIAG EXC SICKLE CELL CRISIS & COAGUL,16,DISEASES AND DISORDERS OF THE BLOOD AND BLOOD FORMING ORGANS AND IMMUNOLOGICAL DISORDERS,2,Moderate,Minor,Medical,Medicaid,Medicaid,,,,true,71740.44,12516.31
New York City,Manhattan,7002054,001464,New York-Presbyterian Hospital - Columbia Presbyterian Center,50 to 69,OOS,M,Other Race,Not Span/Hispanic,7,Emergency,Home w/ Home Health Services,2018,NEO074,CONDITIONS DUE TO NEOPLASM OR THE TREATMENT OF NEOPLASM,,,660,MAJOR HEMATOLOGIC/IMMUNOLOGIC DIAG EXC SICKLE CELL CRISIS & COAGUL,16,DISEASES AND DISORDERS OF THE BLOOD AND BLOOD FORMING ORGANS AND IMMUNOLOGICAL DISORDERS,4,Extreme,Major,Medical,Private Health Insurance,Self-Pay,,,,true,89233.6,20162.76
Finger Lakes,Monroe,2701005,000413,Strong Memorial Hospital,18 to 29,144,F,White,Not Span/Hispanic,3,Emergency,Home or Self Care,2018,BLD007,DISEASES OF WHITE BLOOD CELLS,,,660,MAJOR HEMATOLOGIC/IMMUNOLOGIC DIAG EXC SICKLE CELL CRISIS & COAGUL,16,DISEASES AND DISORDERS OF THE BLOOD AND BLOOD FORMING ORGANS AND IMMUNOLOGICAL DISORDERS,2,Moderate,Moderate,Medical,Medicaid,Medicaid,Self-Pay,,,true,11970.7,5081.75
New York City,Manhattan,7002024,001456,Mount Sinai Hospital,50 to 69,105,M,White,Not Span/Hispanic,3,Urgent,Home or Self Care,2018,BLD007,DISEASES OF WHITE BLOOD CELLS,OTR004,ISOLATION PROCEDURES,660,MAJOR HEMATOLOGIC/IMMUNOLOGIC DIAG EXC SICKLE CELL CRISIS & COAGUL,16,DISEASES AND DISORDERS OF THE BLOOD AND BLOOD FORMING ORGANS AND IMMUNOLOGICAL DISORDERS,2,Moderate,Moderate,Medical,Private Health Insurance,Self-Pay,,,,false,38431.89,12447.12
Hudson Valley,Westchester,5957001,001139,Westchester Medical Center,0 to 17,105,M,White,Not Span/Hispanic,4,Emergency,Home or Self Care,2018,BLD007,DISEASES OF WHITE BLOOD CELLS,LYM007,BONE MARROW BIOPSY,660,MAJOR HEMATOLOGIC/IMMUNOLOGIC DIAG EXC SICKLE CELL CRISIS & COAGUL,16,DISEASES AND DISORDERS OF THE BLOOD AND BLOOD FORMING ORGANS AND IMMUNOLOGICAL DISORDERS,2,Moderate,Moderate,Medical,Medicaid,,,,,true,88845.9,15953.55
Western NY,Erie,1401010,000216,Roswell Park Cancer Institute,30 to 49,142,F,White,Not Span/Hispanic,3,Urgent,Home or Self Care,2018,NEO074,CONDITIONS DUE TO NEOPLASM OR THE TREATMENT OF NEOPLASM,ADM015,ADMINISTRATION OF ANTIBIOTICS,660,MAJOR HEMATOLOGIC/IMMUNOLOGIC DIAG EXC SICKLE CELL CRISIS & COAGUL,16,DISEASES AND DISORDERS OF THE BLOOD AND BLOOD FORMING ORGANS AND IMMUNOLOGICAL DISORDERS,2,Moderate,Minor,Medical,Private Health Insurance,,,,,false,20904.22,7714.74
New York City,Manhattan,7002054,001464,New York-Presbyterian Hospital - Columbia Presbyterian Center,0 to 17,112,F,White,Not Span/Hispanic,8,Urgent,Home w/ Home Health Services,2018,BLD003,APLASTIC ANEMIA,LYM007,BONE MARROW BIOPSY,660,MAJOR HEMATOLOGIC/IMMUNOLOGIC DIAG EXC SICKLE CELL CRISIS & COAGUL,16,DISEASES AND DISORDERS OF THE BLOOD AND BLOOD FORMING ORGANS AND IMMUNOLOGICAL DISORDERS,3,Major,Moderate,Medical,Private Health Insurance,Self-Pay,,,,false,113762.95,24349.77
Central NY,Onondaga,3301003,000630,St. Joseph's Hospital Health Center,50 to 69,130,M,White,Not Span/Hispanic,4,Emergency,Home or Self Care,2018,BLD007,DISEASES OF WHITE BLOOD CELLS,IMG008,ULTRASONOGRAPHY,660,MAJOR HEMATOLOGIC/IMMUNOLOGIC DIAG EXC SICKLE CELL CRISIS & COAGUL,16,DISEASES AND DISORDERS OF THE BLOOD AND BLOOD FORMING ORGANS AND IMMUNOLOGICAL DISORDERS,2,Moderate,Moderate,Medical,Medicare,,,,,true,16979.03,6224.75
New York City,Manhattan,7002020,001453,Memorial Hospital for Cancer and Allied Diseases,30 to 49,100,M,White,Not Span/Hispanic,6,Emergency,Home or Self Care,2018,BLD007,DISEASES OF WHITE BLOOD CELLS,,,660,MAJOR HEMATOLOGIC/IMMUNOLOGIC DIAG EXC SICKLE CELL CRISIS & COAGUL,16,DISEASES AND DISORDERS OF THE BLOOD AND BLOOD FORMING ORGANS AND IMMUNOLOGICAL DISORDERS,3,Major,Moderate,Medical,Blue Cross/Blue Shield,,,,,true,74447.66,27102.73
New York City,Kings,7001021,001306,New York - Presbyterian Brooklyn Methodist Hospital,70 or Older,112,M,White,Spanish/Hispanic,3,Emergency,Inpatient Rehabilitation Facility,2018,INJ030,DRUG INDUCED OR TOXIC RELATED CONDITION,,,660,MAJOR HEMATOLOGIC/IMMUNOLOGIC DIAG EXC SICKLE CELL CRISIS & COAGUL,16,DISEASES AND DISORDERS OF THE BLOOD AND BLOOD FORMING ORGANS AND IMMUNOLOGICAL DISORDERS,3,Major,Major,Medical,Medicare,Private Health Insurance,Self-Pay,,,false,21152.9,5042.58
Hudson Valley,Westchester,5922000,001122,New York - Presbyterian Hospital,50 to 69,107,F,Other Race,Not Span/Hispanic,3,Emergency,Home or Self Care,2018,NEO074,CONDITIONS DUE TO NEOPLASM OR THE TREATMENT OF NEOPLASM,ADM001,TRANSFUSION OF BLOOD AND BLOOD PRODUCTS,660,MAJOR HEMATOLOGIC/IMMUNOLOGIC DIAG EXC SICKLE CELL CRISIS & COAGUL,16,DISEASES AND DISORDERS OF THE BLOOD AND BLOOD FORMING ORGANS AND IMMUNOLOGICAL DISORDERS,3,Major,Major,Medical,Medicare,Private Health Insurance,,,,true,53725.7,21233.23
New York City,Manhattan,7002054,001464,New York-Presbyterian Hospital - Columbia Presbyterian Center,50 to 69,105,F,Other Race,Not Span/Hispanic,9,Emergency,Home or Self Care,2018,INJ030,DRUG INDUCED OR TOXIC RELATED CONDITION,ADM001,TRANSFUSION OF BLOOD AND BLOOD PRODUCTS,660,MAJOR HEMATOLOGIC/IMMUNOLOGIC DIAG EXC SICKLE CELL CRISIS & COAGUL,16,DISEASES AND DISORDERS OF THE BLOOD AND BLOOD FORMING ORGANS AND IMMUNOLOGICAL DISORDERS,2,Moderate,Minor,Medical,Blue Cross/Blue Shield,Self-Pay,,,,true,107822.14,25897.05
New York City,Queens,7002024,001639,Mount Sinai Hospital - Mount Sinai Hospital of Queens,30 to 49,111,F,White,Not Span/Hispanic,4,Emergency,Home or Self Care,2018,BLD002,HEMOLYTIC ANEMIA,ADM001,TRANSFUSION OF BLOOD AND BLOOD PRODUCTS,660,MAJOR HEMATOLOGIC/IMMUNOLOGIC DIAG EXC SICKLE CELL CRISIS & COAGUL,16,DISEASES AND DISORDERS OF THE BLOOD AND BLOOD FORMING ORGANS AND IMMUNOLOGICAL DISORDERS,2,Moderate,Minor,Medical,Blue Cross/Blue Shield,,,,,true,16000.46,4316.86
Western NY,Erie,1401014,000208,John R. Oishei Children's Hospital,0 to 17,142,M,Other Race,Not Span/Hispanic,91,Urgent,Expired,2018,INJ036,"COMPLICATION OF TRANSPLANTED ORGANS OR TISSUE, INITIAL ENCOUNTER",CAR024,VENOUS AND ARTERIAL CATHETER PLACEMENT,660,MAJOR HEMATOLOGIC/IMMUNOLOGIC DIAG EXC SICKLE CELL CRISIS & COAGUL,16,DISEASES AND DISORDERS OF THE BLOOD AND BLOOD FORMING ORGANS AND IMMUNOLOGICAL DISORDERS,4,Extreme,Extreme,Medical,Private Health Insurance,Self-Pay,,,,false,862903.85,389789.62
Hudson Valley,Westchester,5957001,001139,Westchester Medical Center,70 or Older,105,F,White,Not Span/Hispanic,9,Emergency,Home or Self Care,2018,BLD002,HEMOLYTIC ANEMIA,ADM001,TRANSFUSION OF BLOOD AND BLOOD PRODUCTS,660,MAJOR HEMATOLOGIC/IMMUNOLOGIC DIAG EXC SICKLE CELL CRISIS & COAGUL,16,DISEASES AND DISORDERS OF THE BLOOD AND BLOOD FORMING ORGANS AND IMMUNOLOGICAL DISORDERS,2,Moderate,Moderate,Medical,Medicare,Private Health Insurance,,,,true,196116.84,35002.58
Western NY,Erie,1401014,000208,John R. Oishei Children's Hospital,0 to 17,142,F,White,Not Span/Hispanic,3,Emergency,Home or Self Care,2018,BLD007,DISEASES OF WHITE BLOOD CELLS,,,660,MAJOR HEMATOLOGIC/IMMUNOLOGIC DIAG EXC SICKLE CELL CRISIS & COAGUL,16,DISEASES AND DISORDERS OF THE BLOOD AND BLOOD FORMING ORGANS AND IMMUNOLOGICAL DISORDERS,3,Major,Moderate,Medical,Private Health Insurance,Medicaid,Self-Pay,,,true,11947.58,6578.03