Hospital Service Area,Hospital County,Operating Certificate Number,Permanent Facility Id,Facility Name,Age Group,Zip Code - 3 digits,Gender,Race,Ethnicity,Length of Stay,Type of Admission,Patient Disposition,Discharge Year,CCS Diagnosis Code,CCS Diagnosis Description,CCS Procedure Code,CCS Procedure Description,APR DRG Code,APR DRG Description,APR MDC Code,APR MDC Description,APR Severity of Illness Code,APR Severity of Illness Description,APR Risk of Mortality,APR Medical Surgical Description,Payment Typology 1,Payment Typology 2,Payment Typology 3,Birth Weight,Abortion Edit Indicator,Emergency Department Indicator,Total Charges,Total Costs
Long Island,Suffolk,5123000,000885,Long Island Community Hospital,70 or Older,117,F,White,Not Span/Hispanic,9,Emergency,Skilled Nursing Home,2019,NEO074,CONDITIONS DUE TO NEOPLASM OR THE TREATMENT OF NEOPLASM,ADM006,INFUSION OF VASOPRESSOR,660,MAJOR HEMATOLOGIC/IMMUNOLOGIC DIAG EXC SICKLE CELL CRISIS & COAGUL,16,DISEASES AND DISORDERS OF THE BLOOD AND BLOOD FORMING ORGANS AND IMMUNOLOGICAL DISORDERS,4,Extreme,Extreme,Medical,Medicare,,,,,true,74394.14,14307.52
Long Island,Suffolk,5123000,000885,Long Island Community Hospital,70 or Older,119,F,White,Not Span/Hispanic,4,Emergency,Home w/ Home Health Services,2019,NEO074,CONDITIONS DUE TO NEOPLASM OR THE TREATMENT OF NEOPLASM,ADM001,TRANSFUSION OF BLOOD AND BLOOD PRODUCTS,660,MAJOR HEMATOLOGIC/IMMUNOLOGIC DIAG EXC SICKLE CELL CRISIS & COAGUL,16,DISEASES AND DISORDERS OF THE BLOOD AND BLOOD FORMING ORGANS AND IMMUNOLOGICAL DISORDERS,2,Moderate,Moderate,Medical,Medicare,Medicare,Private Health Insurance,,,true,29721.42,6123.2
Long Island,Suffolk,5123000,000885,Long Island Community Hospital,70 or Older,117,M,White,Not Span/Hispanic,4,Emergency,Home w/ Home Health Services,2019,BLD002,HEMOLYTIC ANEMIA,ESA001,HEMODIALYSIS,660,MAJOR HEMATOLOGIC/IMMUNOLOGIC DIAG EXC SICKLE CELL CRISIS & COAGUL,16,DISEASES AND DISORDERS OF THE BLOOD AND BLOOD FORMING ORGANS AND IMMUNOLOGICAL DISORDERS,4,Extreme,Major,Medical,Medicare,Medicare,Private Health Insurance,,,true,56519.83,9440.49
Long Island,Suffolk,5123000,000885,Long Island Community Hospital,70 or Older,119,M,White,Not Span/Hispanic,7,Emergency,Home or Self Care,2019,NEO074,CONDITIONS DUE TO NEOPLASM OR THE TREATMENT OF NEOPLASM,ADM001,TRANSFUSION OF BLOOD AND BLOOD PRODUCTS,660,MAJOR HEMATOLOGIC/IMMUNOLOGIC DIAG EXC SICKLE CELL CRISIS & COAGUL,16,DISEASES AND DISORDERS OF THE BLOOD AND BLOOD FORMING ORGANS AND IMMUNOLOGICAL DISORDERS,3,Major,Major,Medical,Medicare,Medicare,Private Health Insurance,,,true,98377.24,15355.86
Long Island,Suffolk,5123000,000885,Long Island Community Hospital,50 to 69,117,M,Other Race,Not Span/Hispanic,5,Emergency,Home w/ Home Health Services,2019,INJ030,DRUG INDUCED OR TOXIC RELATED CONDITION,,,660,MAJOR HEMATOLOGIC/IMMUNOLOGIC DIAG EXC SICKLE CELL CRISIS & COAGUL,16,DISEASES AND DISORDERS OF THE BLOOD AND BLOOD FORMING ORGANS AND IMMUNOLOGICAL DISORDERS,2,Moderate,Moderate,Medical,Medicare,Medicare,Private Health Insurance,,,true,44288.27,8930
Long Island,Suffolk,5123000,000885,Long Island Community Hospital,70 or Older,117,M,White,Not Span/Hispanic,2,Emergency,Home or Self Care,2019,NEO074,CONDITIONS DUE TO NEOPLASM OR THE TREATMENT OF NEOPLASM,ADM001,TRANSFUSION OF BLOOD AND BLOOD PRODUCTS,660,MAJOR HEMATOLOGIC/IMMUNOLOGIC DIAG EXC SICKLE CELL CRISIS & COAGUL,16,DISEASES AND DISORDERS OF THE BLOOD AND BLOOD FORMING ORGANS AND IMMUNOLOGICAL DISORDERS,2,Moderate,Moderate,Medical,Medicare,Medicare,Blue Cross/Blue Shield,,,true,113497.91,18254
Long Island,Suffolk,5123000,000885,Long Island Community Hospital,50 to 69,117,F,Black/African American,Not Span/Hispanic,4,Emergency,Home or Self Care,2019,NEO074,CONDITIONS DUE TO NEOPLASM OR THE TREATMENT OF NEOPLASM,,,660,MAJOR HEMATOLOGIC/IMMUNOLOGIC DIAG EXC SICKLE CELL CRISIS & COAGUL,16,DISEASES AND DISORDERS OF THE BLOOD AND BLOOD FORMING ORGANS AND IMMUNOLOGICAL DISORDERS,2,Moderate,Moderate,Medical,Private Health Insurance,,,,,true,40726.1,6564.95
Long Island,Suffolk,5123000,000885,Long Island Community Hospital,70 or Older,119,F,White,Not Span/Hispanic,9,Emergency,Expired,2019,BLD007,DISEASES OF WHITE BLOOD CELLS,ADM001,TRANSFUSION OF BLOOD AND BLOOD PRODUCTS,660,MAJOR HEMATOLOGIC/IMMUNOLOGIC DIAG EXC SICKLE CELL CRISIS & COAGUL,16,DISEASES AND DISORDERS OF THE BLOOD AND BLOOD FORMING ORGANS AND IMMUNOLOGICAL DISORDERS,4,Extreme,Extreme,Medical,Medicare,Medicare,Blue Cross/Blue Shield,,,true,303728.65,49317.39
Long Island,Suffolk,5123000,000885,Long Island Community Hospital,50 to 69,OOS,M,White,Not Span/Hispanic,10,Emergency,Skilled Nursing Home,2019,BLD003,APLASTIC ANEMIA,ADM001,TRANSFUSION OF BLOOD AND BLOOD PRODUCTS,660,MAJOR HEMATOLOGIC/IMMUNOLOGIC DIAG EXC SICKLE CELL CRISIS & COAGUL,16,DISEASES AND DISORDERS OF THE BLOOD AND BLOOD FORMING ORGANS AND IMMUNOLOGICAL DISORDERS,4,Extreme,Major,Medical,Private Health Insurance,Private Health Insurance,,,,true,106950.39,17657.18
Long Island,Suffolk,5123000,000885,Long Island Community Hospital,50 to 69,119,F,White,Not Span/Hispanic,2,Emergency,Home or Self Care,2019,NEO074,CONDITIONS DUE TO NEOPLASM OR THE TREATMENT OF NEOPLASM,ADM001,TRANSFUSION OF BLOOD AND BLOOD PRODUCTS,660,MAJOR HEMATOLOGIC/IMMUNOLOGIC DIAG EXC SICKLE CELL CRISIS & COAGUL,16,DISEASES AND DISORDERS OF THE BLOOD AND BLOOD FORMING ORGANS AND IMMUNOLOGICAL DISORDERS,2,Moderate,Moderate,Medical,Blue Cross/Blue Shield,,,,,true,26769.49,4205.68
Long Island,Suffolk,5123000,000885,Long Island Community Hospital,30 to 49,117,M,White,Not Span/Hispanic,3,Emergency,Home or Self Care,2019,BLD003,APLASTIC ANEMIA,ADM001,TRANSFUSION OF BLOOD AND BLOOD PRODUCTS,660,MAJOR HEMATOLOGIC/IMMUNOLOGIC DIAG EXC SICKLE CELL CRISIS & COAGUL,16,DISEASES AND DISORDERS OF THE BLOOD AND BLOOD FORMING ORGANS AND IMMUNOLOGICAL DISORDERS,3,Major,Major,Medical,Medicare,Medicare,,,,true,58591.77,10451.79
Long Island,Suffolk,5123000,000885,Long Island Community Hospital,50 to 69,119,F,White,Not Span/Hispanic,2,Emergency,Home or Self Care,2019,NEO074,CONDITIONS DUE TO NEOPLASM OR THE TREATMENT OF NEOPLASM,ADM003,ADMINISTRATION OF ALBUMIN AND GLOBULIN,660,MAJOR HEMATOLOGIC/IMMUNOLOGIC DIAG EXC SICKLE CELL CRISIS & COAGUL,16,DISEASES AND DISORDERS OF THE BLOOD AND BLOOD FORMING ORGANS AND IMMUNOLOGICAL DISORDERS,3,Major,Major,Medical,Blue Cross/Blue Shield,Medicare,Medicare,,,true,103208.22,19846.49
Long Island,Suffolk,5123000,000885,Long Island Community Hospital,70 or Older,119,M,White,Not Span/Hispanic,23,Emergency,Skilled Nursing Home,2019,BLD003,APLASTIC ANEMIA,ADM001,TRANSFUSION OF BLOOD AND BLOOD PRODUCTS,660,MAJOR HEMATOLOGIC/IMMUNOLOGIC DIAG EXC SICKLE CELL CRISIS & COAGUL,16,DISEASES AND DISORDERS OF THE BLOOD AND BLOOD FORMING ORGANS AND IMMUNOLOGICAL DISORDERS,4,Extreme,Extreme,Medical,Medicare,Medicare,,,,true,223179.97,46222.17
Long Island,Suffolk,5123000,000885,Long Island Community Hospital,50 to 69,117,F,White,Not Span/Hispanic,2,Emergency,Home or Self Care,2019,NEO074,CONDITIONS DUE TO NEOPLASM OR THE TREATMENT OF NEOPLASM,ADM001,TRANSFUSION OF BLOOD AND BLOOD PRODUCTS,660,MAJOR HEMATOLOGIC/IMMUNOLOGIC DIAG EXC SICKLE CELL CRISIS & COAGUL,16,DISEASES AND DISORDERS OF THE BLOOD AND BLOOD FORMING ORGANS AND IMMUNOLOGICAL DISORDERS,2,Moderate,Moderate,Medical,Medicare,Medicare,Blue Cross/Blue Shield,,,true,38897.96,6665.3
Long Island,Suffolk,5123000,000885,Long Island Community Hospital,50 to 69,117,M,White,Not Span/Hispanic,6,Emergency,Home or Self Care,2019,NEO074,CONDITIONS DUE TO NEOPLASM OR THE TREATMENT OF NEOPLASM,OTR004,ISOLATION PROCEDURES,660,MAJOR HEMATOLOGIC/IMMUNOLOGIC DIAG EXC SICKLE CELL CRISIS & COAGUL,16,DISEASES AND DISORDERS OF THE BLOOD AND BLOOD FORMING ORGANS AND IMMUNOLOGICAL DISORDERS,4,Extreme,Major,Medical,Medicare,Medicare,Private Health Insurance,,,true,103089.07,18705.54
Long Island,Suffolk,5123000,000885,Long Island Community Hospital,70 or Older,119,F,Black/African American,Not Span/Hispanic,6,Emergency,Home w/ Home Health Services,2019,BLD007,DISEASES OF WHITE BLOOD CELLS,CAR029,"CARDIOVASCULAR DEVICE PROCEDURES, NEC",660,MAJOR HEMATOLOGIC/IMMUNOLOGIC DIAG EXC SICKLE CELL CRISIS & COAGUL,16,DISEASES AND DISORDERS OF THE BLOOD AND BLOOD FORMING ORGANS AND IMMUNOLOGICAL DISORDERS,3,Major,Major,Medical,Medicare,Medicare,Medicaid,,,true,70592.2,12064.95
Long Island,Suffolk,5123000,000885,Long Island Community Hospital,50 to 69,117,M,White,Not Span/Hispanic,9,Emergency,Home or Self Care,2019,BLD003,APLASTIC ANEMIA,HEP001,LIVER BIOPSY,660,MAJOR HEMATOLOGIC/IMMUNOLOGIC DIAG EXC SICKLE CELL CRISIS & COAGUL,16,DISEASES AND DISORDERS OF THE BLOOD AND BLOOD FORMING ORGANS AND IMMUNOLOGICAL DISORDERS,3,Major,Moderate,Medical,Private Health Insurance,,,,,true,119782.13,17496.33
Long Island,Suffolk,5123000,000885,Long Island Community Hospital,70 or Older,119,M,White,Not Span/Hispanic,11,Emergency,Home or Self Care,2019,BLD003,APLASTIC ANEMIA,ADM001,TRANSFUSION OF BLOOD AND BLOOD PRODUCTS,660,MAJOR HEMATOLOGIC/IMMUNOLOGIC DIAG EXC SICKLE CELL CRISIS & COAGUL,16,DISEASES AND DISORDERS OF THE BLOOD AND BLOOD FORMING ORGANS AND IMMUNOLOGICAL DISORDERS,3,Major,Major,Medical,Medicare,Medicare,Private Health Insurance,,,true,79116.41,16688.84
