Hospital Service Area,Hospital County,Operating Certificate Number,Permanent Facility Id,Facility Name,Age Group,Zip Code - 3 digits,Gender,Race,Ethnicity,Length of Stay,Type of Admission,Patient Disposition,Discharge Year,CCS Diagnosis Code,CCS Diagnosis Description,CCS Procedure Code,CCS Procedure Description,APR DRG Code,APR DRG Description,APR MDC Code,APR MDC Description,APR Severity of Illness Code,APR Severity of Illness Description,APR Risk of Mortality,APR Medical Surgical Description,Payment Typology 1,Payment Typology 2,Payment Typology 3,Birth Weight,Abortion Edit Indicator,Emergency Department Indicator,Total Charges,Total Costs
New York City,Kings,7002053,001304,NYU Langone Hospital-Brooklyn,50 to 69,112,F,Black/African American,Spanish/Hispanic,5,Emergency,Home w/ Home Health Services,2020,NEO074,CONDITIONS DUE TO NEOPLASM OR THE TREATMENT OF NEOPLASM,ADM015,ADMINISTRATION OF ANTIBIOTICS,660,MAJOR HEMATOLOGIC/IMMUNOLOGIC DIAG EXC SICKLE CELL CRISIS & COAGUL,16,DISEASES AND DISORDERS OF THE BLOOD AND BLOOD FORMING ORGANS AND IMMUNOLOGICAL DISORDERS,2,Moderate,Major,Medical,Private Health Insurance,,,,,Y,63275.79,17862.28
New York City,Kings,7002053,001304,NYU Langone Hospital-Brooklyn,70 or Older,112,F,White,Not Span/Hispanic,5,Emergency,Home or Self Care,2020,NEO074,CONDITIONS DUE TO NEOPLASM OR THE TREATMENT OF NEOPLASM,,,660,MAJOR HEMATOLOGIC/IMMUNOLOGIC DIAG EXC SICKLE CELL CRISIS & COAGUL,16,DISEASES AND DISORDERS OF THE BLOOD AND BLOOD FORMING ORGANS AND IMMUNOLOGICAL DISORDERS,2,Moderate,Moderate,Medical,Private Health Insurance,,,,,Y,69919.11,18189.82
New York City,Kings,7002053,001304,NYU Langone Hospital-Brooklyn,50 to 69,112,F,White,Not Span/Hispanic,3,Emergency,Home or Self Care,2020,NEO074,CONDITIONS DUE TO NEOPLASM OR THE TREATMENT OF NEOPLASM,OTR004,ISOLATION PROCEDURES,660,MAJOR HEMATOLOGIC/IMMUNOLOGIC DIAG EXC SICKLE CELL CRISIS & COAGUL,16,DISEASES AND DISORDERS OF THE BLOOD AND BLOOD FORMING ORGANS AND IMMUNOLOGICAL DISORDERS,3,Major,Moderate,Medical,Blue Cross/Blue Shield,,,,,Y,53019.54,11543.33
New York City,Kings,7002053,001304,NYU Langone Hospital-Brooklyn,18 to 29,112,M,Other Race,Not Span/Hispanic,3,Emergency,Home or Self Care,2020,INJ030,DRUG INDUCED OR TOXIC RELATED CONDITION,ADM015,ADMINISTRATION OF ANTIBIOTICS,660,MAJOR HEMATOLOGIC/IMMUNOLOGIC DIAG EXC SICKLE CELL CRISIS & COAGUL,16,DISEASES AND DISORDERS OF THE BLOOD AND BLOOD FORMING ORGANS AND IMMUNOLOGICAL DISORDERS,4,Extreme,Major,Medical,Medicaid,,,,,Y,50105.43,11964.29
New York City,Kings,7002053,001304,NYU Langone Hospital-Brooklyn,70 or Older,112,M,Other Race,Spanish/Hispanic,3,Emergency,Home or Self Care,2020,BLD007,DISEASES OF WHITE BLOOD CELLS,,,660,MAJOR HEMATOLOGIC/IMMUNOLOGIC DIAG EXC SICKLE CELL CRISIS & COAGUL,16,DISEASES AND DISORDERS OF THE BLOOD AND BLOOD FORMING ORGANS AND IMMUNOLOGICAL DISORDERS,3,Major,Major,Medical,Medicare,Private Health Insurance,,,,Y,48430.78,11320.83
New York City,Kings,7002053,001304,NYU Langone Hospital-Brooklyn,50 to 69,112,M,White,Unknown,4,Emergency,Skilled Nursing Home,2020,NEO074,CONDITIONS DUE TO NEOPLASM OR THE TREATMENT OF NEOPLASM,,,660,MAJOR HEMATOLOGIC/IMMUNOLOGIC DIAG EXC SICKLE CELL CRISIS & COAGUL,16,DISEASES AND DISORDERS OF THE BLOOD AND BLOOD FORMING ORGANS AND IMMUNOLOGICAL DISORDERS,2,Moderate,Major,Medical,Medicare,Private Health Insurance,,,,Y,88311.28,21542.56
New York City,Kings,7002053,001304,NYU Langone Hospital-Brooklyn,50 to 69,112,F,Other Race,Spanish/Hispanic,2,Emergency,Home or Self Care,2020,NEO074,CONDITIONS DUE TO NEOPLASM OR THE TREATMENT OF NEOPLASM,OTR004,ISOLATION PROCEDURES,660,MAJOR HEMATOLOGIC/IMMUNOLOGIC DIAG EXC SICKLE CELL CRISIS & COAGUL,16,DISEASES AND DISORDERS OF THE BLOOD AND BLOOD FORMING ORGANS AND IMMUNOLOGICAL DISORDERS,2,Moderate,Moderate,Medical,Medicaid,,,,,Y,54294.83,9802.34
New York City,Kings,7002053,001304,NYU Langone Hospital-Brooklyn,70 or Older,112,F,Black/African American,Not Span/Hispanic,2,Emergency,Expired,2020,BLD003,APLASTIC ANEMIA,ADM001,TRANSFUSION OF BLOOD AND BLOOD PRODUCTS,660,MAJOR HEMATOLOGIC/IMMUNOLOGIC DIAG EXC SICKLE CELL CRISIS & COAGUL,16,DISEASES AND DISORDERS OF THE BLOOD AND BLOOD FORMING ORGANS AND IMMUNOLOGICAL DISORDERS,3,Major,Major,Medical,Medicare,,,,,Y,29348.16,7807.22
New York City,Kings,7002053,001304,NYU Langone Hospital-Brooklyn,0 to 17,112,M,Black/African American,Not Span/Hispanic,2,Emergency,Home or Self Care,2020,SYM002,FEVER,ADM021,"ADMINISTRATION OF THERAPEUTIC SUBSTANCES, NEC",660,MAJOR HEMATOLOGIC/IMMUNOLOGIC DIAG EXC SICKLE CELL CRISIS & COAGUL,16,DISEASES AND DISORDERS OF THE BLOOD AND BLOOD FORMING ORGANS AND IMMUNOLOGICAL DISORDERS,1,Minor,Minor,Medical,Self-Pay,,,,,Y,21034.2,5382.08
New York City,Kings,7002053,001304,NYU Langone Hospital-Brooklyn,70 or Older,112,M,Multi-racial,Not Span/Hispanic,3,Emergency,Skilled Nursing Home,2020,BLD003,APLASTIC ANEMIA,OTR004,ISOLATION PROCEDURES,660,MAJOR HEMATOLOGIC/IMMUNOLOGIC DIAG EXC SICKLE CELL CRISIS & COAGUL,16,DISEASES AND DISORDERS OF THE BLOOD AND BLOOD FORMING ORGANS AND IMMUNOLOGICAL DISORDERS,3,Major,Major,Medical,Medicare,Medicaid,,,,Y,37634.06,11190.96
New York City,Kings,7002053,001304,NYU Langone Hospital-Brooklyn,50 to 69,112,F,Other Race,Spanish/Hispanic,3,Emergency,Home or Self Care,2020,NEO074,CONDITIONS DUE TO NEOPLASM OR THE TREATMENT OF NEOPLASM,ADM001,TRANSFUSION OF BLOOD AND BLOOD PRODUCTS,660,MAJOR HEMATOLOGIC/IMMUNOLOGIC DIAG EXC SICKLE CELL CRISIS & COAGUL,16,DISEASES AND DISORDERS OF THE BLOOD AND BLOOD FORMING ORGANS AND IMMUNOLOGICAL DISORDERS,2,Moderate,Major,Medical,Private Health Insurance,,,,,Y,69989.02,13949.53
New York City,Kings,7002053,001304,NYU Langone Hospital-Brooklyn,30 to 49,112,M,White,Not Span/Hispanic,16,Emergency,Home or Self Care,2020,MUS024,SYSTEMIC LUPUS ERYTHEMATOSUS AND CONNECTIVE TISSUE DISORDERS,EST001,PHERESIS THERAPY,660,MAJOR HEMATOLOGIC/IMMUNOLOGIC DIAG EXC SICKLE CELL CRISIS & COAGUL,16,DISEASES AND DISORDERS OF THE BLOOD AND BLOOD FORMING ORGANS AND IMMUNOLOGICAL DISORDERS,2,Moderate,Major,Medical,Private Health Insurance,,,,,Y,415523.6,73250.01
New York City,Kings,7002053,001304,NYU Langone Hospital-Brooklyn,50 to 69,104,F,Other Race,Spanish/Hispanic,6,Emergency,Home or Self Care,2020,NEO074,CONDITIONS DUE TO NEOPLASM OR THE TREATMENT OF NEOPLASM,EST001,PHERESIS THERAPY,660,MAJOR HEMATOLOGIC/IMMUNOLOGIC DIAG EXC SICKLE CELL CRISIS & COAGUL,16,DISEASES AND DISORDERS OF THE BLOOD AND BLOOD FORMING ORGANS AND IMMUNOLOGICAL DISORDERS,2,Moderate,Moderate,Medical,Medicaid,,,,,Y,130113.81,27621.33
New York City,Kings,7002053,001304,NYU Langone Hospital-Brooklyn,30 to 49,112,M,White,Not Span/Hispanic,5,Emergency,Home or Self Care,2020,BLD003,APLASTIC ANEMIA,EST001,PHERESIS THERAPY,660,MAJOR HEMATOLOGIC/IMMUNOLOGIC DIAG EXC SICKLE CELL CRISIS & COAGUL,16,DISEASES AND DISORDERS OF THE BLOOD AND BLOOD FORMING ORGANS AND IMMUNOLOGICAL DISORDERS,1,Minor,Minor,Medical,Medicaid,,,,,Y,110143.69,23148.24
New York City,Kings,7002053,001304,NYU Langone Hospital-Brooklyn,50 to 69,112,F,Other Race,Spanish/Hispanic,12,Emergency,Home w/ Home Health Services,2020,BLD002,HEMOLYTIC ANEMIA,EST001,PHERESIS THERAPY,660,MAJOR HEMATOLOGIC/IMMUNOLOGIC DIAG EXC SICKLE CELL CRISIS & COAGUL,16,DISEASES AND DISORDERS OF THE BLOOD AND BLOOD FORMING ORGANS AND IMMUNOLOGICAL DISORDERS,3,Major,Major,Medical,Private Health Insurance,,,,,Y,288106.47,66715.04
New York City,Kings,7002053,001304,NYU Langone Hospital-Brooklyn,70 or Older,112,F,Other Race,Not Span/Hispanic,8,Emergency,Home w/ Home Health Services,2020,BLD003,APLASTIC ANEMIA,LYM007,BONE MARROW BIOPSY,660,MAJOR HEMATOLOGIC/IMMUNOLOGIC DIAG EXC SICKLE CELL CRISIS & COAGUL,16,DISEASES AND DISORDERS OF THE BLOOD AND BLOOD FORMING ORGANS AND IMMUNOLOGICAL DISORDERS,2,Moderate,Moderate,Medical,Medicare,Medicaid,,,,Y,128051.87,41616.23
New York City,Kings,7002053,001304,NYU Langone Hospital-Brooklyn,30 to 49,112,M,White,Spanish/Hispanic,6,Emergency,Home or Self Care,2020,MUS024,SYSTEMIC LUPUS ERYTHEMATOSUS AND CONNECTIVE TISSUE DISORDERS,EST001,PHERESIS THERAPY,660,MAJOR HEMATOLOGIC/IMMUNOLOGIC DIAG EXC SICKLE CELL CRISIS & COAGUL,16,DISEASES AND DISORDERS OF THE BLOOD AND BLOOD FORMING ORGANS AND IMMUNOLOGICAL DISORDERS,3,Major,Major,Medical,Private Health Insurance,,,,,Y,231841.3,40021.15
New York City,Kings,7002053,001304,NYU Langone Hospital-Brooklyn,50 to 69,112,M,Other Race,Not Span/Hispanic,6,Emergency,Home or Self Care,2020,BLD002,HEMOLYTIC ANEMIA,ADM001,TRANSFUSION OF BLOOD AND BLOOD PRODUCTS,660,MAJOR HEMATOLOGIC/IMMUNOLOGIC DIAG EXC SICKLE CELL CRISIS & COAGUL,16,DISEASES AND DISORDERS OF THE BLOOD AND BLOOD FORMING ORGANS AND IMMUNOLOGICAL DISORDERS,3,Major,Major,Medical,Medicare,Blue Cross/Blue Shield,,,,Y,133465.22,35182.73
New York City,Kings,7002053,001304,NYU Langone Hospital-Brooklyn,70 or Older,112,F,Other Race,Not Span/Hispanic,6,Emergency,Hospice - Home,2020,BLD003,APLASTIC ANEMIA,ADM001,TRANSFUSION OF BLOOD AND BLOOD PRODUCTS,660,MAJOR HEMATOLOGIC/IMMUNOLOGIC DIAG EXC SICKLE CELL CRISIS & COAGUL,16,DISEASES AND DISORDERS OF THE BLOOD AND BLOOD FORMING ORGANS AND IMMUNOLOGICAL DISORDERS,3,Major,Major,Medical,Medicare,Medicaid,,,,Y,119502.63,32629.01
New York City,Kings,7002053,001304,NYU Langone Hospital-Brooklyn,50 to 69,112,F,Other Race,Spanish/Hispanic,1,Emergency,Home or Self Care,2020,BLD003,APLASTIC ANEMIA,ADM001,TRANSFUSION OF BLOOD AND BLOOD PRODUCTS,660,MAJOR HEMATOLOGIC/IMMUNOLOGIC DIAG EXC SICKLE CELL CRISIS & COAGUL,16,DISEASES AND DISORDERS OF THE BLOOD AND BLOOD FORMING ORGANS AND IMMUNOLOGICAL DISORDERS,1,Minor,Minor,Medical,Medicaid,,,,,Y,24950.39,6288.57
New York City,Kings,7002053,001304,NYU Langone Hospital-Brooklyn,70 or Older,112,F,Other Race,Unknown,11,Emergency,Skilled Nursing Home,2020,BLD003,APLASTIC ANEMIA,ADM001,TRANSFUSION OF BLOOD AND BLOOD PRODUCTS,660,MAJOR HEMATOLOGIC/IMMUNOLOGIC DIAG EXC SICKLE CELL CRISIS & COAGUL,16,DISEASES AND DISORDERS OF THE BLOOD AND BLOOD FORMING ORGANS AND IMMUNOLOGICAL DISORDERS,3,Major,Moderate,Medical,Medicare,Medicaid,,,,Y,217170.65,58743.37
New York City,Kings,7002053,001304,NYU Langone Hospital-Brooklyn,70 or Older,112,M,White,Not Span/Hispanic,3,Emergency,Left Against Medical Advice,2020,BLD003,APLASTIC ANEMIA,ADM001,TRANSFUSION OF BLOOD AND BLOOD PRODUCTS,660,MAJOR HEMATOLOGIC/IMMUNOLOGIC DIAG EXC SICKLE CELL CRISIS & COAGUL,16,DISEASES AND DISORDERS OF THE BLOOD AND BLOOD FORMING ORGANS AND IMMUNOLOGICAL DISORDERS,1,Minor,Moderate,Medical,Medicare,,,,,Y,54563.88,17002.94
New York City,Kings,7002053,001304,NYU Langone Hospital-Brooklyn,70 or Older,112,F,White,Not Span/Hispanic,7,Emergency,Home w/ Home Health Services,2020,MUS024,SYSTEMIC LUPUS ERYTHEMATOSUS AND CONNECTIVE TISSUE DISORDERS,MST028,"SUBCUTANEOUS TISSUE AND FASCIA PROCEDURES, NEC",660,MAJOR HEMATOLOGIC/IMMUNOLOGIC DIAG EXC SICKLE CELL CRISIS & COAGUL,16,DISEASES AND DISORDERS OF THE BLOOD AND BLOOD FORMING ORGANS AND IMMUNOLOGICAL DISORDERS,4,Extreme,Extreme,Medical,Medicare,,,,,Y,314337.88,57486.99
New York City,Kings,7002053,001304,NYU Langone Hospital-Brooklyn,50 to 69,112,M,White,Not Span/Hispanic,4,Emergency,Home or Self Care,2020,NEO074,CONDITIONS DUE TO NEOPLASM OR THE TREATMENT OF NEOPLASM,ADM001,TRANSFUSION OF BLOOD AND BLOOD PRODUCTS,660,MAJOR HEMATOLOGIC/IMMUNOLOGIC DIAG EXC SICKLE CELL CRISIS & COAGUL,16,DISEASES AND DISORDERS OF THE BLOOD AND BLOOD FORMING ORGANS AND IMMUNOLOGICAL DISORDERS,3,Major,Moderate,Medical,Medicare,,,,,Y,93228.59,23052.99
New York City,Kings,7002053,001304,NYU Langone Hospital-Brooklyn,30 to 49,112,F,Other Race,Not Span/Hispanic,3,Emergency,Home or Self Care,2020,NEO074,CONDITIONS DUE TO NEOPLASM OR THE TREATMENT OF NEOPLASM,,,660,MAJOR HEMATOLOGIC/IMMUNOLOGIC DIAG EXC SICKLE CELL CRISIS & COAGUL,16,DISEASES AND DISORDERS OF THE BLOOD AND BLOOD FORMING ORGANS AND IMMUNOLOGICAL DISORDERS,2,Moderate,Major,Medical,Private Health Insurance,,,,,Y,51473.05,15386.91
New York City,Kings,7002053,001304,NYU Langone Hospital-Brooklyn,50 to 69,112,M,White,Not Span/Hispanic,4,Emergency,Home or Self Care,2020,NEO074,CONDITIONS DUE TO NEOPLASM OR THE TREATMENT OF NEOPLASM,ADM001,TRANSFUSION OF BLOOD AND BLOOD PRODUCTS,660,MAJOR HEMATOLOGIC/IMMUNOLOGIC DIAG EXC SICKLE CELL CRISIS & COAGUL,16,DISEASES AND DISORDERS OF THE BLOOD AND BLOOD FORMING ORGANS AND IMMUNOLOGICAL DISORDERS,3,Major,Minor,Medical,Medicare,,,,,Y,83200.36,20986.97
New York City,Kings,7002053,001304,NYU Langone Hospital-Brooklyn,70 or Older,112,F,White,Not Span/Hispanic,3,Emergency,Home w/ Home Health Services,2020,BLD007,DISEASES OF WHITE BLOOD CELLS,ADM021,"ADMINISTRATION OF THERAPEUTIC SUBSTANCES, NEC",660,MAJOR HEMATOLOGIC/IMMUNOLOGIC DIAG EXC SICKLE CELL CRISIS & COAGUL,16,DISEASES AND DISORDERS OF THE BLOOD AND BLOOD FORMING ORGANS AND IMMUNOLOGICAL DISORDERS,2,Moderate,Moderate,Medical,Medicare,,,,,Y,60194.91,16329.5
New York City,Kings,7002053,001304,NYU Langone Hospital-Brooklyn,70 or Older,112,F,Other Race,Not Span/Hispanic,9,Emergency,Home w/ Home Health Services,2020,BLD003,APLASTIC ANEMIA,ADM001,TRANSFUSION OF BLOOD AND BLOOD PRODUCTS,660,MAJOR HEMATOLOGIC/IMMUNOLOGIC DIAG EXC SICKLE CELL CRISIS & COAGUL,16,DISEASES AND DISORDERS OF THE BLOOD AND BLOOD FORMING ORGANS AND IMMUNOLOGICAL DISORDERS,3,Major,Major,Medical,Medicare,Medicaid,,,,Y,159952.34,39866.27
New York City,Kings,7002053,001304,NYU Langone Hospital-Brooklyn,30 to 49,112,M,White,Not Span/Hispanic,7,Emergency,Home or Self Care,2020,MUS024,SYSTEMIC LUPUS ERYTHEMATOSUS AND CONNECTIVE TISSUE DISORDERS,EST001,PHERESIS THERAPY,660,MAJOR HEMATOLOGIC/IMMUNOLOGIC DIAG EXC SICKLE CELL CRISIS & COAGUL,16,DISEASES AND DISORDERS OF THE BLOOD AND BLOOD FORMING ORGANS AND IMMUNOLOGICAL DISORDERS,2,Moderate,Major,Medical,Blue Cross/Blue Shield,,,,,Y,209449.45,34816.89
