Hospital Service Area,Hospital County,Operating Certificate Number,Permanent Facility Id,Facility Name,Age Group,Zip Code - 3 digits,Gender,Race,Ethnicity,Length of Stay,Type of Admission,Patient Disposition,Discharge Year,CCS Diagnosis Code,CCS Diagnosis Description,CCS Procedure Code,CCS Procedure Description,APR DRG Code,APR DRG Description,APR MDC Code,APR MDC Description,APR Severity of Illness Code,APR Severity of Illness Description,APR Risk of Mortality,APR Medical Surgical Description,Payment Typology 1,Payment Typology 2,Payment Typology 3,Birth Weight,Abortion Edit Indicator,Emergency Department Indicator,Total Charges,Total Costs
Long Island,Nassau,2908000,000511,NYU Winthrop Hospital,70 or Older,118,F,White,Not Span/Hispanic,3,Emergency,Home or Self Care,2017,062,Coagulation and hemorrhagic disorders,000,NO PROC,661,Coagulation & platelet disorders,16,"Diseases and Disorders of Blood, Blood Forming Organs and Immunological Disorders",1,Minor,Moderate,Medical,Medicare,Medicare,Private Health Insurance,,N,Y,20208.39,4698.56
Long Island,Nassau,2908000,000511,NYU Winthrop Hospital,50 to 69,110,M,White,Not Span/Hispanic,2,Emergency,Home or Self Care,2017,062,Coagulation and hemorrhagic disorders,222,BLOOD TRANSFUSION,661,Coagulation & platelet disorders,16,"Diseases and Disorders of Blood, Blood Forming Organs and Immunological Disorders",2,Moderate,Moderate,Medical,Private Health Insurance,,,,N,Y,105819.53,23579.66
Long Island,Nassau,2908000,000511,NYU Winthrop Hospital,50 to 69,115,F,White,Not Span/Hispanic,12,Emergency,Skilled Nursing Home,2017,062,Coagulation and hemorrhagic disorders,092,OTHER BOWEL DX PRCS,661,Coagulation & platelet disorders,16,"Diseases and Disorders of Blood, Blood Forming Organs and Immunological Disorders",3,Major,Major,Medical,Medicare,Medicare,Private Health Insurance,,N,Y,142078.57,24142.04
Long Island,Nassau,2908000,000511,NYU Winthrop Hospital,70 or Older,115,M,White,Not Span/Hispanic,4,Emergency,Home w/ Home Health Services,2017,062,Coagulation and hemorrhagic disorders,222,BLOOD TRANSFUSION,661,Coagulation & platelet disorders,16,"Diseases and Disorders of Blood, Blood Forming Organs and Immunological Disorders",2,Moderate,Moderate,Medical,Medicare,Medicare,Blue Cross/Blue Shield,,N,Y,65065.07,15529.26
Long Island,Nassau,2908000,000511,NYU Winthrop Hospital,70 or Older,117,M,White,Not Span/Hispanic,7,Emergency,Home w/ Home Health Services,2017,062,Coagulation and hemorrhagic disorders,000,NO PROC,661,Coagulation & platelet disorders,16,"Diseases and Disorders of Blood, Blood Forming Organs and Immunological Disorders",2,Moderate,Moderate,Medical,Medicare,Medicare,Blue Cross/Blue Shield,,N,Y,133355.17,30932.49
Long Island,Nassau,2908000,000511,NYU Winthrop Hospital,0 to 17,,M,White,Unknown,4,Emergency,Home or Self Care,2017,062,Coagulation and hemorrhagic disorders,198,MAG RESONANCE IMAGING,661,Coagulation & platelet disorders,16,"Diseases and Disorders of Blood, Blood Forming Organs and Immunological Disorders",2,Moderate,Minor,Medical,Private Health Insurance,,,,N,Y,49848.87,7195.75
Long Island,Nassau,2908000,000511,NYU Winthrop Hospital,50 to 69,117,M,White,Not Span/Hispanic,6,Emergency,Home or Self Care,2017,062,Coagulation and hemorrhagic disorders,000,NO PROC,661,Coagulation & platelet disorders,16,"Diseases and Disorders of Blood, Blood Forming Organs and Immunological Disorders",1,Minor,Minor,Medical,Medicare,Medicare,,,N,Y,60366.73,11568.27
Long Island,Nassau,2908000,000511,NYU Winthrop Hospital,70 or Older,116,F,Black/African American,Not Span/Hispanic,6,Urgent,Skilled Nursing Home,2017,062,Coagulation and hemorrhagic disorders,222,BLOOD TRANSFUSION,661,Coagulation & platelet disorders,16,"Diseases and Disorders of Blood, Blood Forming Organs and Immunological Disorders",3,Major,Major,Medical,Medicare,Medicare,Medicaid,,N,N,45720.66,9637.80
Long Island,Nassau,2908000,000511,NYU Winthrop Hospital,50 to 69,115,M,White,Not Span/Hispanic,6,Emergency,Home or Self Care,2017,062,Coagulation and hemorrhagic disorders,231,OTHER THERAPEUTIC PRCS,661,Coagulation & platelet disorders,16,"Diseases and Disorders of Blood, Blood Forming Organs and Immunological Disorders",3,Major,Major,Medical,Medicare,Private Health Insurance,,,N,Y,139530.49,31731.47
Long Island,Nassau,2908000,000511,NYU Winthrop Hospital,50 to 69,115,F,White,Not Span/Hispanic,2,Emergency,Home or Self Care,2017,062,Coagulation and hemorrhagic disorders,222,BLOOD TRANSFUSION,661,Coagulation & platelet disorders,16,"Diseases and Disorders of Blood, Blood Forming Organs and Immunological Disorders",1,Minor,Minor,Medical,Private Health Insurance,,,,N,Y,72652.01,16367.11
Long Island,Nassau,2908000,000511,NYU Winthrop Hospital,30 to 49,114,F,White,Spanish/Hispanic,2,Emergency,Home or Self Care,2017,062,Coagulation and hemorrhagic disorders,222,BLOOD TRANSFUSION,661,Coagulation & platelet disorders,16,"Diseases and Disorders of Blood, Blood Forming Organs and Immunological Disorders",1,Minor,Minor,Medical,Private Health Insurance,,,,N,Y,115331.79,26726.19
Long Island,Nassau,2908000,000511,NYU Winthrop Hospital,70 or Older,110,M,White,Not Span/Hispanic,3,Emergency,Home w/ Home Health Services,2017,062,Coagulation and hemorrhagic disorders,222,BLOOD TRANSFUSION,661,Coagulation & platelet disorders,16,"Diseases and Disorders of Blood, Blood Forming Organs and Immunological Disorders",1,Minor,Minor,Medical,Medicare,Medicare,Blue Cross/Blue Shield,,N,Y,87695.94,20095.24
Long Island,Nassau,2908000,000511,NYU Winthrop Hospital,70 or Older,115,M,White,Not Span/Hispanic,10,Urgent,Home w/ Home Health Services,2017,062,Coagulation and hemorrhagic disorders,222,BLOOD TRANSFUSION,661,Coagulation & platelet disorders,16,"Diseases and Disorders of Blood, Blood Forming Organs and Immunological Disorders",3,Major,Major,Medical,Medicare,Medicare,,,N,N,78000.90,17853.18
Long Island,Nassau,2908000,000511,NYU Winthrop Hospital,70 or Older,115,F,White,Not Span/Hispanic,5,Emergency,Home or Self Care,2017,062,Coagulation and hemorrhagic disorders,000,NO PROC,661,Coagulation & platelet disorders,16,"Diseases and Disorders of Blood, Blood Forming Organs and Immunological Disorders",2,Moderate,Moderate,Medical,Medicare,Medicare,Medicaid,,N,Y,45596.57,8326.08
Long Island,Nassau,2908000,000511,NYU Winthrop Hospital,70 or Older,115,F,White,Not Span/Hispanic,3,Urgent,Home w/ Home Health Services,2017,062,Coagulation and hemorrhagic disorders,222,BLOOD TRANSFUSION,661,Coagulation & platelet disorders,16,"Diseases and Disorders of Blood, Blood Forming Organs and Immunological Disorders",2,Moderate,Moderate,Medical,Medicare,Medicare,Blue Cross/Blue Shield,,N,N,85453.31,19894.89
Long Island,Nassau,2908000,000511,NYU Winthrop Hospital,0 to 17,117,M,White,Not Span/Hispanic,1,Emergency,Home or Self Care,2017,062,Coagulation and hemorrhagic disorders,222,BLOOD TRANSFUSION,661,Coagulation & platelet disorders,16,"Diseases and Disorders of Blood, Blood Forming Organs and Immunological Disorders",1,Minor,Minor,Medical,Blue Cross/Blue Shield,,,,N,Y,17458.99,4093.13
Long Island,Nassau,2908000,000511,NYU Winthrop Hospital,0 to 17,117,F,White,Not Span/Hispanic,2,Emergency,Home or Self Care,2017,062,Coagulation and hemorrhagic disorders,231,OTHER THERAPEUTIC PRCS,661,Coagulation & platelet disorders,16,"Diseases and Disorders of Blood, Blood Forming Organs and Immunological Disorders",1,Minor,Minor,Medical,Medicaid,Medicaid,,,N,Y,19753.66,3955.72
Long Island,Nassau,2908000,000511,NYU Winthrop Hospital,0 to 17,115,F,White,Spanish/Hispanic,4,Urgent,Home or Self Care,2017,062,Coagulation and hemorrhagic disorders,000,NO PROC,661,Coagulation & platelet disorders,16,"Diseases and Disorders of Blood, Blood Forming Organs and Immunological Disorders",1,Minor,Minor,Medical,Medicaid,,,,N,N,32692.89,5672.55
Long Island,Nassau,2908000,000511,NYU Winthrop Hospital,50 to 69,110,M,White,Not Span/Hispanic,1,Emergency,Home or Self Care,2017,062,Coagulation and hemorrhagic disorders,222,BLOOD TRANSFUSION,661,Coagulation & platelet disorders,16,"Diseases and Disorders of Blood, Blood Forming Organs and Immunological Disorders",2,Moderate,Minor,Medical,Private Health Insurance,,,,N,Y,95867.59,22352.47
Long Island,Nassau,2908000,000511,NYU Winthrop Hospital,50 to 69,117,M,White,Not Span/Hispanic,3,Emergency,Home w/ Home Health Services,2017,062,Coagulation and hemorrhagic disorders,098,OT NON-OR GI THER PRCS,661,Coagulation & platelet disorders,16,"Diseases and Disorders of Blood, Blood Forming Organs and Immunological Disorders",3,Major,Moderate,Medical,Medicare,Medicare,,,N,Y,27982.24,5905.84
Long Island,Nassau,2908000,000511,NYU Winthrop Hospital,70 or Older,117,M,White,Not Span/Hispanic,4,Emergency,Home or Self Care,2017,062,Coagulation and hemorrhagic disorders,193,DX ULTRASOUND HEART,661,Coagulation & platelet disorders,16,"Diseases and Disorders of Blood, Blood Forming Organs and Immunological Disorders",2,Moderate,Moderate,Medical,Medicare,Medicare,Blue Cross/Blue Shield,,N,Y,36060.45,7078.03
Long Island,Nassau,2908000,000511,NYU Winthrop Hospital,50 to 69,115,F,White,Not Span/Hispanic,4,Emergency,Home or Self Care,2017,062,Coagulation and hemorrhagic disorders,092,OTHER BOWEL DX PRCS,661,Coagulation & platelet disorders,16,"Diseases and Disorders of Blood, Blood Forming Organs and Immunological Disorders",1,Minor,Minor,Medical,Private Health Insurance,,,,N,Y,44284.58,8904.75
Long Island,Nassau,2908000,000511,NYU Winthrop Hospital,50 to 69,115,F,Black/African American,Not Span/Hispanic,5,Emergency,Home or Self Care,2017,062,Coagulation and hemorrhagic disorders,061,OT OR PRCS VES NOT HEAD,661,Coagulation & platelet disorders,16,"Diseases and Disorders of Blood, Blood Forming Organs and Immunological Disorders",1,Minor,Major,Medical,Medicare,Medicare,Medicaid,,N,Y,65519.02,15916.09
Long Island,Nassau,2908000,000511,NYU Winthrop Hospital,70 or Older,117,F,White,Not Span/Hispanic,3,Emergency,Home or Self Care,2017,062,Coagulation and hemorrhagic disorders,222,BLOOD TRANSFUSION,661,Coagulation & platelet disorders,16,"Diseases and Disorders of Blood, Blood Forming Organs and Immunological Disorders",3,Major,Moderate,Medical,Medicare,Medicare,Private Health Insurance,,N,Y,35388.70,7609.32
Long Island,Nassau,2908000,000511,NYU Winthrop Hospital,0 to 17,117,M,White,Not Span/Hispanic,2,Emergency,Home or Self Care,2017,062,Coagulation and hemorrhagic disorders,174,OT NON-OR THER PRC SKIN,661,Coagulation & platelet disorders,16,"Diseases and Disorders of Blood, Blood Forming Organs and Immunological Disorders",2,Moderate,Minor,Medical,Blue Cross/Blue Shield,,,,N,Y,42103.96,11376.54
Long Island,Nassau,2908000,000511,NYU Winthrop Hospital,70 or Older,115,F,White,Not Span/Hispanic,8,Emergency,Home w/ Home Health Services,2017,062,Coagulation and hemorrhagic disorders,070,UP GASTRO ENDOSC/BIOPSY,661,Coagulation & platelet disorders,16,"Diseases and Disorders of Blood, Blood Forming Organs and Immunological Disorders",3,Major,Moderate,Medical,Medicare,Medicare,Blue Cross/Blue Shield,,N,Y,165949.14,42194.26
Long Island,Nassau,2908000,000511,NYU Winthrop Hospital,0 to 17,115,M,Other Race,Not Span/Hispanic,2,Emergency,Home or Self Care,2017,062,Coagulation and hemorrhagic disorders,222,BLOOD TRANSFUSION,661,Coagulation & platelet disorders,16,"Diseases and Disorders of Blood, Blood Forming Organs and Immunological Disorders",1,Minor,Minor,Medical,Medicaid,Medicaid,,,N,Y,29830.59,7287.82
Long Island,Nassau,2908000,000511,NYU Winthrop Hospital,18 to 29,115,F,Black/African American,Not Span/Hispanic,1,Emergency,Left Against Medical Advice,2017,062,Coagulation and hemorrhagic disorders,000,NO PROC,661,Coagulation & platelet disorders,16,"Diseases and Disorders of Blood, Blood Forming Organs and Immunological Disorders",1,Minor,Minor,Medical,Medicaid,Medicaid,,,N,Y,8901.94,2039.39
Long Island,Nassau,2908000,000511,NYU Winthrop Hospital,70 or Older,115,F,White,Not Span/Hispanic,2,Emergency,Home w/ Home Health Services,2017,062,Coagulation and hemorrhagic disorders,222,BLOOD TRANSFUSION,661,Coagulation & platelet disorders,16,"Diseases and Disorders of Blood, Blood Forming Organs and Immunological Disorders",3,Major,Minor,Medical,Medicare,Medicare,Blue Cross/Blue Shield,,N,Y,88528.45,19072.95
Long Island,Nassau,2908000,000511,NYU Winthrop Hospital,18 to 29,114,M,White,Not Span/Hispanic,2,Emergency,Home or Self Care,2017,062,Coagulation and hemorrhagic disorders,000,NO PROC,661,Coagulation & platelet disorders,16,"Diseases and Disorders of Blood, Blood Forming Organs and Immunological Disorders",1,Minor,Minor,Medical,Private Health Insurance,,,,N,Y,47396.39,6453.35
Long Island,Nassau,2908000,000511,NYU Winthrop Hospital,50 to 69,115,M,White,Not Span/Hispanic,2,Emergency,Home or Self Care,2017,062,Coagulation and hemorrhagic disorders,222,BLOOD TRANSFUSION,661,Coagulation & platelet disorders,16,"Diseases and Disorders of Blood, Blood Forming Organs and Immunological Disorders",1,Minor,Minor,Medical,Private Health Insurance,,,,N,Y,106152.14,24178.99
Long Island,Nassau,2908000,000511,NYU Winthrop Hospital,30 to 49,115,F,Black/African American,Not Span/Hispanic,8,Emergency,Home or Self Care,2017,062,Coagulation and hemorrhagic disorders,222,BLOOD TRANSFUSION,661,Coagulation & platelet disorders,16,"Diseases and Disorders of Blood, Blood Forming Organs and Immunological Disorders",3,Major,Moderate,Medical,Medicaid,Medicaid,,,N,Y,352915.31,72429.72
Long Island,Nassau,2908000,000511,NYU Winthrop Hospital,30 to 49,114,F,White,Spanish/Hispanic,2,Emergency,Home or Self Care,2017,062,Coagulation and hemorrhagic disorders,000,NO PROC,661,Coagulation & platelet disorders,16,"Diseases and Disorders of Blood, Blood Forming Organs and Immunological Disorders",2,Moderate,Minor,Medical,Private Health Insurance,,,,N,Y,172537.77,40579.61
Long Island,Nassau,2908000,000511,NYU Winthrop Hospital,70 or Older,115,F,White,Not Span/Hispanic,1,Emergency,Home or Self Care,2017,062,Coagulation and hemorrhagic disorders,222,BLOOD TRANSFUSION,661,Coagulation & platelet disorders,16,"Diseases and Disorders of Blood, Blood Forming Organs and Immunological Disorders",2,Moderate,Moderate,Medical,Medicare,Medicare,Private Health Insurance,,N,Y,32641.62,6360.21
Long Island,Nassau,2908000,000511,NYU Winthrop Hospital,70 or Older,115,F,White,Not Span/Hispanic,3,Elective,Home w/ Home Health Services,2017,062,Coagulation and hemorrhagic disorders,222,BLOOD TRANSFUSION,661,Coagulation & platelet disorders,16,"Diseases and Disorders of Blood, Blood Forming Organs and Immunological Disorders",2,Moderate,Moderate,Medical,Medicare,Medicare,Blue Cross/Blue Shield,,N,N,121759.52,27259.37
Long Island,Nassau,2908000,000511,NYU Winthrop Hospital,50 to 69,115,M,Other Race,Spanish/Hispanic,4,Emergency,Home or Self Care,2017,062,Coagulation and hemorrhagic disorders,000,NO PROC,661,Coagulation & platelet disorders,16,"Diseases and Disorders of Blood, Blood Forming Organs and Immunological Disorders",3,Major,Minor,Medical,Medicaid,,,,N,Y,60682.68,14013.09
Long Island,Nassau,2908000,000511,NYU Winthrop Hospital,70 or Older,115,F,White,Not Span/Hispanic,3,Emergency,Home or Self Care,2017,062,Coagulation and hemorrhagic disorders,222,BLOOD TRANSFUSION,661,Coagulation & platelet disorders,16,"Diseases and Disorders of Blood, Blood Forming Organs and Immunological Disorders",2,Moderate,Moderate,Medical,Medicare,Medicare,,,N,Y,173399.59,40773.43
Long Island,Nassau,2908000,000511,NYU Winthrop Hospital,70 or Older,115,F,White,Not Span/Hispanic,5,Emergency,Home w/ Home Health Services,2017,062,Coagulation and hemorrhagic disorders,222,BLOOD TRANSFUSION,661,Coagulation & platelet disorders,16,"Diseases and Disorders of Blood, Blood Forming Organs and Immunological Disorders",3,Major,Major,Medical,Medicare,Medicare,Blue Cross/Blue Shield,,N,Y,54214.94,11475.79
Long Island,Nassau,2908000,000511,NYU Winthrop Hospital,0 to 17,115,F,White,Not Span/Hispanic,1,Emergency,Home or Self Care,2017,062,Coagulation and hemorrhagic disorders,222,BLOOD TRANSFUSION,661,Coagulation & platelet disorders,16,"Diseases and Disorders of Blood, Blood Forming Organs and Immunological Disorders",1,Minor,Minor,Medical,Medicaid,Medicaid,,,N,Y,23196.23,4620.19
Long Island,Nassau,2908000,000511,NYU Winthrop Hospital,0 to 17,117,F,Other Race,Not Span/Hispanic,1,Emergency,Home or Self Care,2017,062,Coagulation and hemorrhagic disorders,222,BLOOD TRANSFUSION,661,Coagulation & platelet disorders,16,"Diseases and Disorders of Blood, Blood Forming Organs and Immunological Disorders",1,Minor,Minor,Medical,Blue Cross/Blue Shield,,,,N,Y,23904.18,4067.13
Long Island,Nassau,2908000,000511,NYU Winthrop Hospital,70 or Older,110,F,White,Not Span/Hispanic,6,Emergency,Home or Self Care,2017,062,Coagulation and hemorrhagic disorders,070,UP GASTRO ENDOSC/BIOPSY,661,Coagulation & platelet disorders,16,"Diseases and Disorders of Blood, Blood Forming Organs and Immunological Disorders",3,Major,Major,Medical,Medicare,Medicare,Self-Pay,,N,Y,87786.85,17267.82
Long Island,Nassau,2908000,000511,NYU Winthrop Hospital,50 to 69,115,F,Black/African American,Not Span/Hispanic,3,Emergency,Home w/ Home Health Services,2017,062,Coagulation and hemorrhagic disorders,000,NO PROC,661,Coagulation & platelet disorders,16,"Diseases and Disorders of Blood, Blood Forming Organs and Immunological Disorders",1,Minor,Minor,Medical,Blue Cross/Blue Shield,,,,N,Y,30245.70,6042.36
Long Island,Nassau,2908000,000511,NYU Winthrop Hospital,70 or Older,127,F,White,Not Span/Hispanic,2,Emergency,Home or Self Care,2017,062,Coagulation and hemorrhagic disorders,000,NO PROC,661,Coagulation & platelet disorders,16,"Diseases and Disorders of Blood, Blood Forming Organs and Immunological Disorders",1,Minor,Minor,Medical,Medicare,Medicare,Blue Cross/Blue Shield,,N,Y,24977.82,4806.11
Long Island,Nassau,2908000,000511,NYU Winthrop Hospital,70 or Older,115,F,White,Not Span/Hispanic,9,Emergency,Home w/ Home Health Services,2017,062,Coagulation and hemorrhagic disorders,222,BLOOD TRANSFUSION,661,Coagulation & platelet disorders,16,"Diseases and Disorders of Blood, Blood Forming Organs and Immunological Disorders",3,Major,Moderate,Medical,Medicare,Medicare,,,N,Y,170418.83,41392.83
Long Island,Nassau,2908000,000511,NYU Winthrop Hospital,70 or Older,115,M,White,Not Span/Hispanic,3,Emergency,Home or Self Care,2017,062,Coagulation and hemorrhagic disorders,222,BLOOD TRANSFUSION,661,Coagulation & platelet disorders,16,"Diseases and Disorders of Blood, Blood Forming Organs and Immunological Disorders",2,Moderate,Moderate,Medical,Medicare,Medicare,,,N,Y,170450.51,37139.70
Long Island,Nassau,2908000,000511,NYU Winthrop Hospital,70 or Older,117,F,White,Not Span/Hispanic,3,Emergency,Home or Self Care,2017,062,Coagulation and hemorrhagic disorders,222,BLOOD TRANSFUSION,661,Coagulation & platelet disorders,16,"Diseases and Disorders of Blood, Blood Forming Organs and Immunological Disorders",2,Moderate,Moderate,Medical,Medicare,Medicare,,,N,Y,201082.82,45598.34
Long Island,Nassau,2908000,000511,NYU Winthrop Hospital,50 to 69,115,F,White,Spanish/Hispanic,5,Emergency,Home or Self Care,2017,062,Coagulation and hemorrhagic disorders,216,RESP INTUB/MECH VENTIL,661,Coagulation & platelet disorders,16,"Diseases and Disorders of Blood, Blood Forming Organs and Immunological Disorders",2,Moderate,Minor,Medical,Federal/State/Local/VA,Self-Pay,,,N,Y,108025.95,19571.17
Long Island,Nassau,2908000,000511,NYU Winthrop Hospital,0 to 17,117,F,Other Race,Spanish/Hispanic,7,Urgent,Home or Self Care,2017,062,Coagulation and hemorrhagic disorders,222,BLOOD TRANSFUSION,661,Coagulation & platelet disorders,16,"Diseases and Disorders of Blood, Blood Forming Organs and Immunological Disorders",3,Major,Major,Medical,Medicaid,Medicaid,,,N,N,232720.31,41182.45
Long Island,Nassau,2908000,000511,NYU Winthrop Hospital,0 to 17,115,M,White,Not Span/Hispanic,1,Emergency,Home or Self Care,2017,062,Coagulation and hemorrhagic disorders,000,NO PROC,661,Coagulation & platelet disorders,16,"Diseases and Disorders of Blood, Blood Forming Organs and Immunological Disorders",1,Minor,Minor,Medical,Blue Cross/Blue Shield,,,,N,Y,21453.64,4372.32
Long Island,Nassau,2908000,000511,NYU Winthrop Hospital,70 or Older,115,F,White,Not Span/Hispanic,22,Emergency,Expired,2017,062,Coagulation and hemorrhagic disorders,076,COLONOSCOPY AND BIOPSY,661,Coagulation & platelet disorders,16,"Diseases and Disorders of Blood, Blood Forming Organs and Immunological Disorders",4,Extreme,Extreme,Medical,Medicare,Medicare,Private Health Insurance,,N,Y,318538.91,60522.88
Long Island,Nassau,2908000,000511,NYU Winthrop Hospital,50 to 69,117,F,White,Spanish/Hispanic,22,Emergency,Skilled Nursing Home,2017,062,Coagulation and hemorrhagic disorders,173,OT DX PRC SKIN/SUBCUTAN,661,Coagulation & platelet disorders,16,"Diseases and Disorders of Blood, Blood Forming Organs and Immunological Disorders",3,Major,Major,Medical,Medicare,Medicare,Medicaid,,N,Y,422108.00,100647.69
Long Island,Nassau,2908000,000511,NYU Winthrop Hospital,0 to 17,115,F,White,Not Span/Hispanic,2,Emergency,Home or Self Care,2017,062,Coagulation and hemorrhagic disorders,000,NO PROC,661,Coagulation & platelet disorders,16,"Diseases and Disorders of Blood, Blood Forming Organs and Immunological Disorders",1,Minor,Minor,Medical,Blue Cross/Blue Shield,Blue Cross/Blue Shield,,,N,Y,21310.50,4764.26
