Hospital Service Area,Hospital County,Operating Certificate Number,Permanent Facility Id,Facility Name,Age Group,Zip Code - 3 digits,Gender,Race,Ethnicity,Length of Stay,Type of Admission,Patient Disposition,Discharge Year,CCS Diagnosis Code,CCS Diagnosis Description,CCS Procedure Code,CCS Procedure Description,APR DRG Code,APR DRG Description,APR MDC Code,APR MDC Description,APR Severity of Illness Code,APR Severity of Illness Description,APR Risk of Mortality,APR Medical Surgical Description,Payment Typology 1,Payment Typology 2,Payment Typology 3,Birth Weight,Abortion Edit Indicator,Emergency Department Indicator,Total Charges,Total Costs
New York City,Manhattan,7002001,001438,Bellevue Hospital Center,50 to 69,100,M,Other Race,Not Span/Hispanic,6,Emergency,Home or Self Care,2019,BLD006,COAGULATION AND HEMORRHAGIC DISORDERS,SUD001,SUBSTANCE USE DETOXIFICATION,661,COAGULATION & PLATELET DISORDERS,16,DISEASES AND DISORDERS OF THE BLOOD AND BLOOD FORMING ORGANS AND IMMUNOLOGICAL DISORDERS,1,Minor,Moderate,Medical,Medicaid,,,,,true,38721.94,25734.6
Western NY,Erie,1401014,000208,John R. Oishei Children's Hospital,0 to 17,140,M,White,Not Span/Hispanic,1,Emergency,Home or Self Care,2019,BLD006,COAGULATION AND HEMORRHAGIC DISORDERS,ADM003,ADMINISTRATION OF ALBUMIN AND GLOBULIN,661,COAGULATION & PLATELET DISORDERS,16,DISEASES AND DISORDERS OF THE BLOOD AND BLOOD FORMING ORGANS AND IMMUNOLOGICAL DISORDERS,1,Minor,Minor,Medical,Private Health Insurance,Self-Pay,,,,true,7676.59,3491.36
New York City,Kings,7001016,001301,Kings County Hospital Center,50 to 69,112,M,Black/African American,Not Span/Hispanic,4,Emergency,Home or Self Care,2019,BLD006,COAGULATION AND HEMORRHAGIC DISORDERS,,,661,COAGULATION & PLATELET DISORDERS,16,DISEASES AND DISORDERS OF THE BLOOD AND BLOOD FORMING ORGANS AND IMMUNOLOGICAL DISORDERS,3,Major,Moderate,Medical,Medicaid,,,,,true,27127.4,19270.25
New York City,Bronx,7000006,001169,Montefiore Medical Center - Henry & Lucy Moses Div,50 to 69,107,F,Black/African American,Not Span/Hispanic,2,Emergency,Home or Self Care,2019,BLD006,COAGULATION AND HEMORRHAGIC DISORDERS,,,661,COAGULATION & PLATELET DISORDERS,16,DISEASES AND DISORDERS OF THE BLOOD AND BLOOD FORMING ORGANS AND IMMUNOLOGICAL DISORDERS,2,Moderate,Moderate,Medical,Medicare,Blue Cross/Blue Shield,,,,true,70041.33,8511.35
New York City,Manhattan,7002054,001458,New York-Presbyterian Hospital - New York Weill Cornell Center,30 to 49,111,F,Black/African American,Not Span/Hispanic,2,Emergency,Home or Self Care,2019,BLD006,COAGULATION AND HEMORRHAGIC DISORDERS,ADM003,ADMINISTRATION OF ALBUMIN AND GLOBULIN,661,COAGULATION & PLATELET DISORDERS,16,DISEASES AND DISORDERS OF THE BLOOD AND BLOOD FORMING ORGANS AND IMMUNOLOGICAL DISORDERS,1,Minor,Minor,Medical,"Managed Care, Unspecified",Medicaid,Self-Pay,,,true,67166.29,19648.35
Western NY,Erie,1401005,000210,Erie County Medical Center,30 to 49,142,F,Black/African American,Not Span/Hispanic,4,Emergency,Home or Self Care,2019,BLD006,COAGULATION AND HEMORRHAGIC DISORDERS,ADM001,TRANSFUSION OF BLOOD AND BLOOD PRODUCTS,661,COAGULATION & PLATELET DISORDERS,16,DISEASES AND DISORDERS OF THE BLOOD AND BLOOD FORMING ORGANS AND IMMUNOLOGICAL DISORDERS,2,Moderate,Minor,Medical,Medicaid,Medicaid,,,,true,14564.48,8033.59
New York City,Manhattan,7002001,001438,Bellevue Hospital Center,70 or Older,112,M,Other Race,Not Span/Hispanic,1,Emergency,Home or Self Care,2019,BLD006,COAGULATION AND HEMORRHAGIC DISORDERS,ADM001,TRANSFUSION OF BLOOD AND BLOOD PRODUCTS,661,COAGULATION & PLATELET DISORDERS,16,DISEASES AND DISORDERS OF THE BLOOD AND BLOOD FORMING ORGANS AND IMMUNOLOGICAL DISORDERS,2,Moderate,Minor,Medical,Medicare,Medicare,Medicaid,,,true,7308.35,4857.13
Western NY,Genesee,1801000,000339,United Memorial Medical Center North Street Campus,70 or Older,144,M,White,Not Span/Hispanic,3,Emergency,Home or Self Care,2019,BLD006,COAGULATION AND HEMORRHAGIC DISORDERS,ADM021,"ADMINISTRATION OF THERAPEUTIC SUBSTANCES, NEC",661,COAGULATION & PLATELET DISORDERS,16,DISEASES AND DISORDERS OF THE BLOOD AND BLOOD FORMING ORGANS AND IMMUNOLOGICAL DISORDERS,1,Minor,Minor,Medical,Medicare,Medicare,,,,true,12692.53,4596.57
New York City,Manhattan,7002053,001463,NYU Langone Hospitals,70 or Older,101,M,White,Not Span/Hispanic,1,Emergency,Home or Self Care,2019,BLD006,COAGULATION AND HEMORRHAGIC DISORDERS,ADM001,TRANSFUSION OF BLOOD AND BLOOD PRODUCTS,661,COAGULATION & PLATELET DISORDERS,16,DISEASES AND DISORDERS OF THE BLOOD AND BLOOD FORMING ORGANS AND IMMUNOLOGICAL DISORDERS,3,Major,Major,Medical,Medicare,Private Health Insurance,,,,true,54667.97,10384.4
New York City,Kings,7002053,001304,NYU Langone Hospital-Brooklyn,18 to 29,112,F,White,Not Span/Hispanic,1,Emergency,Home or Self Care,2019,BLD006,COAGULATION AND HEMORRHAGIC DISORDERS,ADM021,"ADMINISTRATION OF THERAPEUTIC SUBSTANCES, NEC",661,COAGULATION & PLATELET DISORDERS,16,DISEASES AND DISORDERS OF THE BLOOD AND BLOOD FORMING ORGANS AND IMMUNOLOGICAL DISORDERS,1,Minor,Minor,Medical,Medicaid,,,,,true,36490.38,5292.71
New York City,Bronx,7000006,001168,Montefiore Medical Center-Wakefield Hospital,70 or Older,104,F,Other Race,Unknown,4,Emergency,Home w/ Home Health Services,2019,BLD006,COAGULATION AND HEMORRHAGIC DISORDERS,ADM001,TRANSFUSION OF BLOOD AND BLOOD PRODUCTS,661,COAGULATION & PLATELET DISORDERS,16,DISEASES AND DISORDERS OF THE BLOOD AND BLOOD FORMING ORGANS AND IMMUNOLOGICAL DISORDERS,3,Major,Minor,Medical,Medicare,Private Health Insurance,,,,true,62570.68,11681.3
Western NY,Erie,1401014,000208,John R. Oishei Children's Hospital,0 to 17,140,F,White,Not Span/Hispanic,2,Emergency,Home or Self Care,2019,BLD006,COAGULATION AND HEMORRHAGIC DISORDERS,ADM003,ADMINISTRATION OF ALBUMIN AND GLOBULIN,661,COAGULATION & PLATELET DISORDERS,16,DISEASES AND DISORDERS OF THE BLOOD AND BLOOD FORMING ORGANS AND IMMUNOLOGICAL DISORDERS,2,Moderate,Minor,Medical,Blue Cross/Blue Shield,Self-Pay,,,,true,19500.15,8446.96
New York City,Manhattan,7002054,001458,New York-Presbyterian Hospital - New York Weill Cornell Center,30 to 49,113,M,Other Race,Spanish/Hispanic,2,Emergency,Home or Self Care,2019,BLD006,COAGULATION AND HEMORRHAGIC DISORDERS,ESA001,HEMODIALYSIS,661,COAGULATION & PLATELET DISORDERS,16,DISEASES AND DISORDERS OF THE BLOOD AND BLOOD FORMING ORGANS AND IMMUNOLOGICAL DISORDERS,3,Major,Moderate,Medical,Medicaid,Self-Pay,,,,true,33787.94,7419.93
Hudson Valley,Rockland,4324000,000776,Montefiore Nyack,50 to 69,109,F,Other Race,Spanish/Hispanic,9,Emergency,Home or Self Care,2019,BLD006,COAGULATION AND HEMORRHAGIC DISORDERS,PLC002,PACKING AND DRESSING PROCEDURES,661,COAGULATION & PLATELET DISORDERS,16,DISEASES AND DISORDERS OF THE BLOOD AND BLOOD FORMING ORGANS AND IMMUNOLOGICAL DISORDERS,2,Moderate,Minor,Medical,Medicaid,,,,,false,117142.88,25961.52
Hudson Valley,Rockland,4324000,000776,Montefiore Nyack,18 to 29,109,F,White,Not Span/Hispanic,1,Emergency,Home or Self Care,2019,BLD006,COAGULATION AND HEMORRHAGIC DISORDERS,,,661,COAGULATION & PLATELET DISORDERS,16,DISEASES AND DISORDERS OF THE BLOOD AND BLOOD FORMING ORGANS AND IMMUNOLOGICAL DISORDERS,1,Minor,Minor,Medical,Private Health Insurance,,,,,false,28914.71,4345.52
New York City,Kings,7001021,001306,New York - Presbyterian Brooklyn Methodist Hospital,70 or Older,112,M,Black/African American,Not Span/Hispanic,4,Emergency,Home w/ Home Health Services,2019,BLD006,COAGULATION AND HEMORRHAGIC DISORDERS,GIS001,ESOPHAGOGASTRODUODENOSCOPY (EGD) WITH BIOPSY,661,COAGULATION & PLATELET DISORDERS,16,DISEASES AND DISORDERS OF THE BLOOD AND BLOOD FORMING ORGANS AND IMMUNOLOGICAL DISORDERS,3,Major,Major,Medical,Medicare,Medicare,Self-Pay,,,true,55168.51,17417.15
New York City,Kings,7001021,001306,New York - Presbyterian Brooklyn Methodist Hospital,0 to 17,112,F,White,Not Span/Hispanic,2,Emergency,Home or Self Care,2019,BLD006,COAGULATION AND HEMORRHAGIC DISORDERS,ADM003,ADMINISTRATION OF ALBUMIN AND GLOBULIN,661,COAGULATION & PLATELET DISORDERS,16,DISEASES AND DISORDERS OF THE BLOOD AND BLOOD FORMING ORGANS AND IMMUNOLOGICAL DISORDERS,1,Minor,Minor,Medical,"Managed Care, Unspecified",Medicaid,Self-Pay,,,true,62133.07,14368.13
Long Island,Nassau,2950001,000527,Mount Sinai South Nassau,70 or Older,115,F,White,Not Span/Hispanic,9,Emergency,Skilled Nursing Home,2019,BLD006,COAGULATION AND HEMORRHAGIC DISORDERS,,,661,COAGULATION & PLATELET DISORDERS,16,DISEASES AND DISORDERS OF THE BLOOD AND BLOOD FORMING ORGANS AND IMMUNOLOGICAL DISORDERS,1,Minor,Moderate,Medical,Medicare,Medicare,Medicaid,,,true,68939.22,13062.61
Hudson Valley,Westchester,5957001,001139,Westchester Medical Center,18 to 29,127,M,Black/African American,Not Span/Hispanic,3,Urgent,Home or Self Care,2019,BLD006,COAGULATION AND HEMORRHAGIC DISORDERS,ADM004,TRANSFUSION OF CLOTTING FACTORS,661,COAGULATION & PLATELET DISORDERS,16,DISEASES AND DISORDERS OF THE BLOOD AND BLOOD FORMING ORGANS AND IMMUNOLOGICAL DISORDERS,3,Major,Minor,Medical,Medicaid,Medicaid,,,,false,348719.52,64471.56
Central NY,Oneida,3202003,000599,Faxton-St Lukes Healthcare St Lukes Division,70 or Older,134,M,White,Not Span/Hispanic,5,Urgent,Short-term Hospital,2019,BLD006,COAGULATION AND HEMORRHAGIC DISORDERS,RES007,AIRWAY INTUBATION,661,COAGULATION & PLATELET DISORDERS,16,DISEASES AND DISORDERS OF THE BLOOD AND BLOOD FORMING ORGANS AND IMMUNOLOGICAL DISORDERS,4,Extreme,Extreme,Medical,Medicare,,,,,false,160441.04,27502.1
New York City,Manhattan,7002053,001463,NYU Langone Hospitals,30 to 49,112,M,White,Not Span/Hispanic,2,Emergency,Home or Self Care,2019,BLD006,COAGULATION AND HEMORRHAGIC DISORDERS,ADM003,ADMINISTRATION OF ALBUMIN AND GLOBULIN,661,COAGULATION & PLATELET DISORDERS,16,DISEASES AND DISORDERS OF THE BLOOD AND BLOOD FORMING ORGANS AND IMMUNOLOGICAL DISORDERS,1,Minor,Minor,Medical,Blue Cross/Blue Shield,,,,,true,189226.07,12616.95
Long Island,Suffolk,5151001,000245,Stony Brook University Hospital,70 or Older,117,F,White,Not Span/Hispanic,1,Emergency,Home or Self Care,2019,BLD006,COAGULATION AND HEMORRHAGIC DISORDERS,,,661,COAGULATION & PLATELET DISORDERS,16,DISEASES AND DISORDERS OF THE BLOOD AND BLOOD FORMING ORGANS AND IMMUNOLOGICAL DISORDERS,2,Moderate,Moderate,Medical,Medicare,Blue Cross/Blue Shield,Blue Cross/Blue Shield,,,true,28068.84,7196.55
New York City,Kings,7002053,001304,NYU Langone Hospital-Brooklyn,70 or Older,112,M,White,Not Span/Hispanic,4,Emergency,Home w/ Home Health Services,2019,BLD006,COAGULATION AND HEMORRHAGIC DISORDERS,ADM001,TRANSFUSION OF BLOOD AND BLOOD PRODUCTS,661,COAGULATION & PLATELET DISORDERS,16,DISEASES AND DISORDERS OF THE BLOOD AND BLOOD FORMING ORGANS AND IMMUNOLOGICAL DISORDERS,3,Major,Major,Medical,Medicare,Private Health Insurance,,,,true,62626.44,22310.56
New York City,Kings,7001021,001306,New York - Presbyterian Brooklyn Methodist Hospital,70 or Older,112,F,Other Race,Spanish/Hispanic,4,Emergency,Home or Self Care,2019,BLD006,COAGULATION AND HEMORRHAGIC DISORDERS,ADM002,TRANSFUSION OF PLASMA,661,COAGULATION & PLATELET DISORDERS,16,DISEASES AND DISORDERS OF THE BLOOD AND BLOOD FORMING ORGANS AND IMMUNOLOGICAL DISORDERS,3,Major,Major,Medical,Medicare,Medicare,Medicaid,,,true,36675.57,8832.14
New York City,Kings,7001046,001309,Interfaith Medical Center,70 or Older,112,F,Black/African American,Not Span/Hispanic,5,Emergency,Home or Self Care,2019,BLD006,COAGULATION AND HEMORRHAGIC DISORDERS,ADM001,TRANSFUSION OF BLOOD AND BLOOD PRODUCTS,661,COAGULATION & PLATELET DISORDERS,16,DISEASES AND DISORDERS OF THE BLOOD AND BLOOD FORMING ORGANS AND IMMUNOLOGICAL DISORDERS,3,Major,Moderate,Medical,Medicare,Medicare,,,,true,34190.74,16224.82
New York City,Kings,7001002,001286,Brookdale Hospital Medical Center,50 to 69,112,M,Black/African American,Not Span/Hispanic,5,Emergency,Home or Self Care,2019,BLD006,COAGULATION AND HEMORRHAGIC DISORDERS,,,661,COAGULATION & PLATELET DISORDERS,16,DISEASES AND DISORDERS OF THE BLOOD AND BLOOD FORMING ORGANS AND IMMUNOLOGICAL DISORDERS,2,Moderate,Major,Medical,Medicare,Private Health Insurance,,,,true,21263.41,11458.14
Capital/Adirond,Albany,0101004,000005,St. Peter's Hospital,70 or Older,122,F,Other Race,Not Span/Hispanic,8,Emergency,Home or Self Care,2019,BLD006,COAGULATION AND HEMORRHAGIC DISORDERS,LYM007,BONE MARROW BIOPSY,661,COAGULATION & PLATELET DISORDERS,16,DISEASES AND DISORDERS OF THE BLOOD AND BLOOD FORMING ORGANS AND IMMUNOLOGICAL DISORDERS,4,Extreme,Major,Medical,Medicare,Medicare,,,,true,86665,31172.03
New York City,Manhattan,7002054,001464,New York-Presbyterian Hospital - Columbia Presbyterian Center,18 to 29,112,F,Other Race,Not Span/Hispanic,1,Emergency,Left Against Medical Advice,2019,BLD007,DISEASES OF WHITE BLOOD CELLS,,,661,COAGULATION & PLATELET DISORDERS,16,DISEASES AND DISORDERS OF THE BLOOD AND BLOOD FORMING ORGANS AND IMMUNOLOGICAL DISORDERS,3,Major,Major,Medical,Medicaid,Medicaid,Self-Pay,,,true,20351.27,6266.84
New York City,Manhattan,7002054,001464,New York-Presbyterian Hospital - Columbia Presbyterian Center,18 to 29,112,F,Other Race,Not Span/Hispanic,11,Urgent,Home or Self Care,2019,BLD007,DISEASES OF WHITE BLOOD CELLS,MAM005,MEASUREMENT DURING CARDIAC CATHETERIZATION,661,COAGULATION & PLATELET DISORDERS,16,DISEASES AND DISORDERS OF THE BLOOD AND BLOOD FORMING ORGANS AND IMMUNOLOGICAL DISORDERS,3,Major,Major,Medical,Medicaid,Medicaid,Self-Pay,,,false,371124.75,129327.08
New York City,Kings,7001021,001306,New York - Presbyterian Brooklyn Methodist Hospital,18 to 29,112,M,White,Not Span/Hispanic,11,Emergency,Home or Self Care,2019,BLD006,COAGULATION AND HEMORRHAGIC DISORDERS,ADM002,TRANSFUSION OF PLASMA,661,COAGULATION & PLATELET DISORDERS,16,DISEASES AND DISORDERS OF THE BLOOD AND BLOOD FORMING ORGANS AND IMMUNOLOGICAL DISORDERS,4,Extreme,Extreme,Medical,"Managed Care, Unspecified",Medicaid,Self-Pay,,,true,135743.22,32425.47
New York City,Manhattan,7002054,001464,New York-Presbyterian Hospital - Columbia Presbyterian Center,30 to 49,104,M,Other Race,Spanish/Hispanic,1,Emergency,Home or Self Care,2019,BLD006,COAGULATION AND HEMORRHAGIC DISORDERS,,,661,COAGULATION & PLATELET DISORDERS,16,DISEASES AND DISORDERS OF THE BLOOD AND BLOOD FORMING ORGANS AND IMMUNOLOGICAL DISORDERS,1,Minor,Minor,Medical,Medicaid,Medicaid,Self-Pay,,,true,21202.95,4530.44
Central NY,Onondaga,3301008,000636,Crouse Hospital,50 to 69,130,F,White,Not Span/Hispanic,1,Emergency,Home or Self Care,2019,BLD006,COAGULATION AND HEMORRHAGIC DISORDERS,ADM017,ADMINISTRATION OF NUTRITIONAL AND ELECTROLYTIC SUBSTANCES,661,COAGULATION & PLATELET DISORDERS,16,DISEASES AND DISORDERS OF THE BLOOD AND BLOOD FORMING ORGANS AND IMMUNOLOGICAL DISORDERS,1,Minor,Minor,Medical,Medicare,,,,,true,6040.04,2758.72
New York City,Kings,7002002,001324,Mount Sinai Brooklyn,50 to 69,112,F,Black/African American,Not Span/Hispanic,4,Emergency,Home or Self Care,2019,BLD006,COAGULATION AND HEMORRHAGIC DISORDERS,ADM001,TRANSFUSION OF BLOOD AND BLOOD PRODUCTS,661,COAGULATION & PLATELET DISORDERS,16,DISEASES AND DISORDERS OF THE BLOOD AND BLOOD FORMING ORGANS AND IMMUNOLOGICAL DISORDERS,3,Major,Moderate,Medical,Medicaid,Medicaid,Self-Pay,,,true,54399.34,9776.26
Hudson Valley,Rockland,4324000,000776,Montefiore Nyack,70 or Older,109,M,White,Not Span/Hispanic,5,Emergency,Home w/ Home Health Services,2019,BLD006,COAGULATION AND HEMORRHAGIC DISORDERS,,,661,COAGULATION & PLATELET DISORDERS,16,DISEASES AND DISORDERS OF THE BLOOD AND BLOOD FORMING ORGANS AND IMMUNOLOGICAL DISORDERS,2,Moderate,Major,Medical,Medicare,Private Health Insurance,,,,false,57612.02,10321.57
Long Island,Suffolk,5149001,000896,St. Charles Hospital,30 to 49,117,M,White,Not Span/Hispanic,3,Emergency,Home or Self Care,2019,BLD006,COAGULATION AND HEMORRHAGIC DISORDERS,ADM002,TRANSFUSION OF PLASMA,661,COAGULATION & PLATELET DISORDERS,16,DISEASES AND DISORDERS OF THE BLOOD AND BLOOD FORMING ORGANS AND IMMUNOLOGICAL DISORDERS,1,Minor,Moderate,Medical,Blue Cross/Blue Shield,,,,,true,34701,6704.24
New York City,Manhattan,7002001,001438,Bellevue Hospital Center,70 or Older,104,F,Other Race,Spanish/Hispanic,3,Emergency,Home or Self Care,2019,BLD006,COAGULATION AND HEMORRHAGIC DISORDERS,ADM001,TRANSFUSION OF BLOOD AND BLOOD PRODUCTS,661,COAGULATION & PLATELET DISORDERS,16,DISEASES AND DISORDERS OF THE BLOOD AND BLOOD FORMING ORGANS AND IMMUNOLOGICAL DISORDERS,3,Major,Moderate,Medical,Medicare,Medicare,Medicaid,,,true,18414.1,12238.01
New York City,Kings,7001021,001306,New York - Presbyterian Brooklyn Methodist Hospital,70 or Older,112,M,Black/African American,Not Span/Hispanic,10,Emergency,Home or Self Care,2019,BLD006,COAGULATION AND HEMORRHAGIC DISORDERS,SKB006,SKIN LACERATION REPAIR (EXCLUDING PERINEUM),661,COAGULATION & PLATELET DISORDERS,16,DISEASES AND DISORDERS OF THE BLOOD AND BLOOD FORMING ORGANS AND IMMUNOLOGICAL DISORDERS,3,Major,Major,Medical,Medicare,Medicare,Medicaid,,,true,74414.95,19524.08
New York City,Kings,7001021,001306,New York - Presbyterian Brooklyn Methodist Hospital,70 or Older,112,M,White,Spanish/Hispanic,3,Emergency,Home w/ Home Health Services,2019,BLD006,COAGULATION AND HEMORRHAGIC DISORDERS,,,661,COAGULATION & PLATELET DISORDERS,16,DISEASES AND DISORDERS OF THE BLOOD AND BLOOD FORMING ORGANS AND IMMUNOLOGICAL DISORDERS,3,Major,Major,Medical,Medicare,Private Health Insurance,Self-Pay,,,true,24135.84,5703.93
Hudson Valley,Westchester,5957001,001139,Westchester Medical Center,18 to 29,109,M,Black/African American,Not Span/Hispanic,3,Emergency,Home or Self Care,2019,BLD006,COAGULATION AND HEMORRHAGIC DISORDERS,GIS004,GI SYSTEM ENDOSCOPY WITHOUT BIOPSY (DIAGNOSTIC),661,COAGULATION & PLATELET DISORDERS,16,DISEASES AND DISORDERS OF THE BLOOD AND BLOOD FORMING ORGANS AND IMMUNOLOGICAL DISORDERS,3,Major,Minor,Medical,Medicaid,Medicaid,,,,true,533653.47,97130.77
Central NY,Oneida,3202003,000599,Faxton-St Lukes Healthcare St Lukes Division,70 or Older,134,F,White,Not Span/Hispanic,3,Emergency,Home or Self Care,2019,BLD006,COAGULATION AND HEMORRHAGIC DISORDERS,GIS004,GI SYSTEM ENDOSCOPY WITHOUT BIOPSY (DIAGNOSTIC),661,COAGULATION & PLATELET DISORDERS,16,DISEASES AND DISORDERS OF THE BLOOD AND BLOOD FORMING ORGANS AND IMMUNOLOGICAL DISORDERS,3,Major,Extreme,Medical,Medicare,,,,,true,22028.54,6471.69
New York City,Manhattan,7002032,001469,Mount Sinai Morningside,70 or Older,112,M,White,Not Span/Hispanic,5,Emergency,Skilled Nursing Home,2019,BLD006,COAGULATION AND HEMORRHAGIC DISORDERS,CAR028,INFERIOR VENA CAVA (IVC) FILTER PROCEDURES,661,COAGULATION & PLATELET DISORDERS,16,DISEASES AND DISORDERS OF THE BLOOD AND BLOOD FORMING ORGANS AND IMMUNOLOGICAL DISORDERS,4,Extreme,Extreme,Medical,Medicare,Blue Cross/Blue Shield,Self-Pay,,,true,134185.99,43755.48
Finger Lakes,Monroe,2701003,000411,Rochester General Hospital,0 to 17,144,M,White,Not Span/Hispanic,2,Emergency,Home or Self Care,2019,BLD006,COAGULATION AND HEMORRHAGIC DISORDERS,,,661,COAGULATION & PLATELET DISORDERS,16,DISEASES AND DISORDERS OF THE BLOOD AND BLOOD FORMING ORGANS AND IMMUNOLOGICAL DISORDERS,2,Moderate,Minor,Medical,Medicaid,,,,,true,39092.66,21333.96
Long Island,Nassau,2951001,000541,North Shore University Hospital,70 or Older,113,F,White,Not Span/Hispanic,1,Emergency,Home or Self Care,2019,BLD006,COAGULATION AND HEMORRHAGIC DISORDERS,ADM001,TRANSFUSION OF BLOOD AND BLOOD PRODUCTS,661,COAGULATION & PLATELET DISORDERS,16,DISEASES AND DISORDERS OF THE BLOOD AND BLOOD FORMING ORGANS AND IMMUNOLOGICAL DISORDERS,1,Minor,Minor,Medical,Medicare,Private Health Insurance,,,,true,21488.5,4506.78
New York City,Bronx,7000008,001172,Lincoln Medical & Mental Health Center,50 to 69,104,F,Other Race,Spanish/Hispanic,3,Emergency,Home or Self Care,2019,BLD006,COAGULATION AND HEMORRHAGIC DISORDERS,ADM003,ADMINISTRATION OF ALBUMIN AND GLOBULIN,661,COAGULATION & PLATELET DISORDERS,16,DISEASES AND DISORDERS OF THE BLOOD AND BLOOD FORMING ORGANS AND IMMUNOLOGICAL DISORDERS,2,Moderate,Minor,Medical,Medicaid,Medicaid,,,,false,17981.31,10618.99
Capital/Adirond,Albany,0101004,000005,St. Peter's Hospital,50 to 69,122,F,Other Race,Not Span/Hispanic,3,Elective,Home or Self Care,2019,BLD006,COAGULATION AND HEMORRHAGIC DISORDERS,,,661,COAGULATION & PLATELET DISORDERS,16,DISEASES AND DISORDERS OF THE BLOOD AND BLOOD FORMING ORGANS AND IMMUNOLOGICAL DISORDERS,1,Minor,Minor,Medical,Medicare,Medicaid,,,,false,48440.8,20232.52
New York City,Manhattan,7002054,001458,New York-Presbyterian Hospital - New York Weill Cornell Center,0 to 17,113,F,White,Not Span/Hispanic,1,Emergency,Home or Self Care,2019,BLD006,COAGULATION AND HEMORRHAGIC DISORDERS,ADM003,ADMINISTRATION OF ALBUMIN AND GLOBULIN,661,COAGULATION & PLATELET DISORDERS,16,DISEASES AND DISORDERS OF THE BLOOD AND BLOOD FORMING ORGANS AND IMMUNOLOGICAL DISORDERS,2,Moderate,Minor,Medical,"Managed Care, Unspecified",Medicaid,Self-Pay,,,true,19761.89,6478.75
Central NY,Onondaga,3301007,000635,University Hospital SUNY Health Science Center,50 to 69,130,M,White,Not Span/Hispanic,1,Emergency,Left Against Medical Advice,2019,BLD006,COAGULATION AND HEMORRHAGIC DISORDERS,ADM001,TRANSFUSION OF BLOOD AND BLOOD PRODUCTS,661,COAGULATION & PLATELET DISORDERS,16,DISEASES AND DISORDERS OF THE BLOOD AND BLOOD FORMING ORGANS AND IMMUNOLOGICAL DISORDERS,3,Major,Minor,Medical,Medicaid,,,,,true,20121.5,8540.74
Long Island,Nassau,2951001,000541,North Shore University Hospital,70 or Older,114,M,Other Race,Unknown,20,Trauma,Home w/ Home Health Services,2019,BLD006,COAGULATION AND HEMORRHAGIC DISORDERS,CAR028,INFERIOR VENA CAVA (IVC) FILTER PROCEDURES,661,COAGULATION & PLATELET DISORDERS,16,DISEASES AND DISORDERS OF THE BLOOD AND BLOOD FORMING ORGANS AND IMMUNOLOGICAL DISORDERS,4,Extreme,Extreme,Medical,Medicare,,,,,true,350178.01,71856.66
Long Island,Nassau,2952006,000551,St. Joseph Hospital,50 to 69,117,M,Other Race,Unknown,3,Emergency,Home or Self Care,2019,BLD006,COAGULATION AND HEMORRHAGIC DISORDERS,GNR004,ENDOSCOPIC CONTROL OF BLEEDING,661,COAGULATION & PLATELET DISORDERS,16,DISEASES AND DISORDERS OF THE BLOOD AND BLOOD FORMING ORGANS AND IMMUNOLOGICAL DISORDERS,3,Major,Moderate,Medical,Medicare,Medicare,Medicaid,,,true,22942.98,5105.12
Capital/Adirond,Albany,0101004,000005,St. Peter's Hospital,70 or Older,120,F,White,Not Span/Hispanic,5,Emergency,Home or Self Care,2019,BLD006,COAGULATION AND HEMORRHAGIC DISORDERS,,,661,COAGULATION & PLATELET DISORDERS,16,DISEASES AND DISORDERS OF THE BLOOD AND BLOOD FORMING ORGANS AND IMMUNOLOGICAL DISORDERS,4,Extreme,Extreme,Medical,Medicare,Private Health Insurance,,,,true,23431.45,8624.36
Southern Tier,Broome,0301001,000043,Our Lady of Lourdes Memorial Hospital,30 to 49,138,F,White,Not Span/Hispanic,3,Emergency,Home or Self Care,2019,BLD006,COAGULATION AND HEMORRHAGIC DISORDERS,GNR004,ENDOSCOPIC CONTROL OF BLEEDING,661,COAGULATION & PLATELET DISORDERS,16,DISEASES AND DISORDERS OF THE BLOOD AND BLOOD FORMING ORGANS AND IMMUNOLOGICAL DISORDERS,3,Major,Major,Medical,Private Health Insurance,Self-Pay,Self-Pay,,,true,16840.79,4532.45
Finger Lakes,Monroe,2754001,000471,The Unity Hospital of Rochester,70 or Older,146,M,White,Not Span/Hispanic,9,Emergency,Skilled Nursing Home,2019,BLD006,COAGULATION AND HEMORRHAGIC DISORDERS,ADM018,IRRIGATION (DIAGNOSTIC AND THERAPEUTIC),661,COAGULATION & PLATELET DISORDERS,16,DISEASES AND DISORDERS OF THE BLOOD AND BLOOD FORMING ORGANS AND IMMUNOLOGICAL DISORDERS,4,Extreme,Extreme,Medical,Medicare,,,,,true,25350.57,20036.67
Finger Lakes,Monroe,2754001,000471,The Unity Hospital of Rochester,70 or Older,146,M,White,Not Span/Hispanic,4,Emergency,Home w/ Home Health Services,2019,BLD006,COAGULATION AND HEMORRHAGIC DISORDERS,GIS004,GI SYSTEM ENDOSCOPY WITHOUT BIOPSY (DIAGNOSTIC),661,COAGULATION & PLATELET DISORDERS,16,DISEASES AND DISORDERS OF THE BLOOD AND BLOOD FORMING ORGANS AND IMMUNOLOGICAL DISORDERS,1,Minor,Moderate,Medical,Federal/State/Local/VA,,,,,true,14338.84,10544.53