Hospital Service Area,Hospital County,Operating Certificate Number,Permanent Facility Id,Facility Name,Age Group,Zip Code - 3 digits,Gender,Race,Ethnicity,Length of Stay,Type of Admission,Patient Disposition,Discharge Year,CCS Diagnosis Code,CCS Diagnosis Description,CCS Procedure Code,CCS Procedure Description,APR DRG Code,APR DRG Description,APR MDC Code,APR MDC Description,APR Severity of Illness Code,APR Severity of Illness Description,APR Risk of Mortality,APR Medical Surgical Description,Payment Typology 1,Payment Typology 2,Payment Typology 3,Birth Weight,Abortion Edit Indicator,Emergency Department Indicator,Total Charges,Total Costs
New York City,Manhattan,7002053,001463,NYU Langone Hospitals,70 or Older,101,M,White,Not Span/Hispanic,1,Emergency,Home or Self Care,2019,BLD006,COAGULATION AND HEMORRHAGIC DISORDERS,ADM001,TRANSFUSION OF BLOOD AND BLOOD PRODUCTS,661,COAGULATION & PLATELET DISORDERS,16,DISEASES AND DISORDERS OF THE BLOOD AND BLOOD FORMING ORGANS AND IMMUNOLOGICAL DISORDERS,3,Major,Major,Medical,Medicare,Private Health Insurance,,,,true,54667.97,10384.4
New York City,Manhattan,7002053,001463,NYU Langone Hospitals,30 to 49,112,M,White,Not Span/Hispanic,2,Emergency,Home or Self Care,2019,BLD006,COAGULATION AND HEMORRHAGIC DISORDERS,ADM003,ADMINISTRATION OF ALBUMIN AND GLOBULIN,661,COAGULATION & PLATELET DISORDERS,16,DISEASES AND DISORDERS OF THE BLOOD AND BLOOD FORMING ORGANS AND IMMUNOLOGICAL DISORDERS,1,Minor,Minor,Medical,Blue Cross/Blue Shield,,,,,true,189226.07,12616.95
New York City,Manhattan,7002053,001463,NYU Langone Hospitals,70 or Older,112,F,Other Race,Not Span/Hispanic,5,Emergency,Home or Self Care,2019,BLD006,COAGULATION AND HEMORRHAGIC DISORDERS,RES001,BRONCHOSCOPY (DIAGNOSTIC),661,COAGULATION & PLATELET DISORDERS,16,DISEASES AND DISORDERS OF THE BLOOD AND BLOOD FORMING ORGANS AND IMMUNOLOGICAL DISORDERS,3,Major,Moderate,Medical,Medicare,Medicare,,,,true,166462.32,36542.19
New York City,Manhattan,7002053,001463,NYU Langone Hospitals,70 or Older,112,F,White,Not Span/Hispanic,3,Emergency,Home or Self Care,2019,BLD006,COAGULATION AND HEMORRHAGIC DISORDERS,ADM003,ADMINISTRATION OF ALBUMIN AND GLOBULIN,661,COAGULATION & PLATELET DISORDERS,16,DISEASES AND DISORDERS OF THE BLOOD AND BLOOD FORMING ORGANS AND IMMUNOLOGICAL DISORDERS,2,Moderate,Major,Medical,Medicare,Medicare,,,,true,148834.16,17192.69
New York City,Manhattan,7002053,001463,NYU Langone Hospitals,0 to 17,112,F,White,Spanish/Hispanic,3,Emergency,Home or Self Care,2019,BLD006,COAGULATION AND HEMORRHAGIC DISORDERS,,,661,COAGULATION & PLATELET DISORDERS,16,DISEASES AND DISORDERS OF THE BLOOD AND BLOOD FORMING ORGANS AND IMMUNOLOGICAL DISORDERS,3,Major,Moderate,Medical,Medicaid,,,,,true,87068.4,14606.72
New York City,Manhattan,7002053,001463,NYU Langone Hospitals,50 to 69,114,F,White,Not Span/Hispanic,2,Emergency,Home or Self Care,2019,BLD006,COAGULATION AND HEMORRHAGIC DISORDERS,ADM001,TRANSFUSION OF BLOOD AND BLOOD PRODUCTS,661,COAGULATION & PLATELET DISORDERS,16,DISEASES AND DISORDERS OF THE BLOOD AND BLOOD FORMING ORGANS AND IMMUNOLOGICAL DISORDERS,3,Major,Moderate,Medical,Medicaid,,,,,true,87307.35,17104.17
New York City,Manhattan,7002053,001463,NYU Langone Hospitals,70 or Older,100,M,White,Not Span/Hispanic,4,Emergency,Home w/ Home Health Services,2019,BLD006,COAGULATION AND HEMORRHAGIC DISORDERS,PLC001,IMMOBILIZATION BY SPLINT OR OTHER EXTERNAL DEVICE,661,COAGULATION & PLATELET DISORDERS,16,DISEASES AND DISORDERS OF THE BLOOD AND BLOOD FORMING ORGANS AND IMMUNOLOGICAL DISORDERS,3,Major,Major,Medical,Medicaid,,,,,true,42250.15,15354.01
New York City,Manhattan,7002053,001463,NYU Langone Hospitals,0 to 17,112,M,White,Unknown,1,Emergency,Home or Self Care,2019,BLD006,COAGULATION AND HEMORRHAGIC DISORDERS,ADM017,ADMINISTRATION OF NUTRITIONAL AND ELECTROLYTIC SUBSTANCES,661,COAGULATION & PLATELET DISORDERS,16,DISEASES AND DISORDERS OF THE BLOOD AND BLOOD FORMING ORGANS AND IMMUNOLOGICAL DISORDERS,3,Major,Moderate,Medical,Medicaid,,,,,true,22268.07,4991.04
New York City,Manhattan,7002053,001463,NYU Langone Hospitals,70 or Older,100,M,Other Race,Not Span/Hispanic,3,Emergency,Home w/ Home Health Services,2019,BLD006,COAGULATION AND HEMORRHAGIC DISORDERS,ADM003,ADMINISTRATION OF ALBUMIN AND GLOBULIN,661,COAGULATION & PLATELET DISORDERS,16,DISEASES AND DISORDERS OF THE BLOOD AND BLOOD FORMING ORGANS AND IMMUNOLOGICAL DISORDERS,1,Minor,Moderate,Medical,Medicare,Medicaid,,,,true,126935.96,14027.01
New York City,Manhattan,7002053,001463,NYU Langone Hospitals,70 or Older,112,F,Other Race,Not Span/Hispanic,2,Elective,Home or Self Care,2019,BLD006,COAGULATION AND HEMORRHAGIC DISORDERS,,,661,COAGULATION & PLATELET DISORDERS,16,DISEASES AND DISORDERS OF THE BLOOD AND BLOOD FORMING ORGANS AND IMMUNOLOGICAL DISORDERS,3,Major,Major,Medical,Medicare,Medicaid,,,,false,20620.39,7575.05
New York City,Manhattan,7002053,001463,NYU Langone Hospitals,50 to 69,100,M,Other Race,Unknown,3,Elective,Home or Self Care,2019,BLD006,COAGULATION AND HEMORRHAGIC DISORDERS,RES001,BRONCHOSCOPY (DIAGNOSTIC),661,COAGULATION & PLATELET DISORDERS,16,DISEASES AND DISORDERS OF THE BLOOD AND BLOOD FORMING ORGANS AND IMMUNOLOGICAL DISORDERS,2,Moderate,Minor,Medical,Private Health Insurance,,,,,false,95926.22,21256.36
New York City,Manhattan,7002053,001463,NYU Langone Hospitals,70 or Older,100,F,Other Race,Spanish/Hispanic,5,Emergency,Home w/ Home Health Services,2019,BLD006,COAGULATION AND HEMORRHAGIC DISORDERS,ADM003,ADMINISTRATION OF ALBUMIN AND GLOBULIN,661,COAGULATION & PLATELET DISORDERS,16,DISEASES AND DISORDERS OF THE BLOOD AND BLOOD FORMING ORGANS AND IMMUNOLOGICAL DISORDERS,1,Minor,Moderate,Medical,Medicare,,,,,true,159122.58,22122.78
New York City,Manhattan,7002053,001463,NYU Langone Hospitals,30 to 49,103,F,Other Race,Spanish/Hispanic,1,Emergency,Home or Self Care,2019,BLD006,COAGULATION AND HEMORRHAGIC DISORDERS,ADM003,ADMINISTRATION OF ALBUMIN AND GLOBULIN,661,COAGULATION & PLATELET DISORDERS,16,DISEASES AND DISORDERS OF THE BLOOD AND BLOOD FORMING ORGANS AND IMMUNOLOGICAL DISORDERS,2,Moderate,Minor,Medical,Private Health Insurance,,,,,true,62273.91,6072.05
New York City,Manhattan,7002053,001463,NYU Langone Hospitals,70 or Older,100,F,Other Race,Not Span/Hispanic,2,Emergency,Home or Self Care,2019,BLD006,COAGULATION AND HEMORRHAGIC DISORDERS,EST001,PHERESIS THERAPY,661,COAGULATION & PLATELET DISORDERS,16,DISEASES AND DISORDERS OF THE BLOOD AND BLOOD FORMING ORGANS AND IMMUNOLOGICAL DISORDERS,2,Moderate,Minor,Medical,Medicare,Medicare,,,,true,146973.83,11920.52
New York City,Manhattan,7002053,001463,NYU Langone Hospitals,50 to 69,100,F,White,Not Span/Hispanic,6,Emergency,Psychiatric Hospital or Unit of Hosp,2019,BLD006,COAGULATION AND HEMORRHAGIC DISORDERS,ADM001,TRANSFUSION OF BLOOD AND BLOOD PRODUCTS,661,COAGULATION & PLATELET DISORDERS,16,DISEASES AND DISORDERS OF THE BLOOD AND BLOOD FORMING ORGANS AND IMMUNOLOGICAL DISORDERS,3,Major,Major,Medical,Private Health Insurance,,,,,true,212796.94,29046.02
New York City,Manhattan,7002053,001463,NYU Langone Hospitals,50 to 69,113,F,White,Not Span/Hispanic,2,Emergency,Home or Self Care,2019,BLD006,COAGULATION AND HEMORRHAGIC DISORDERS,ADM003,ADMINISTRATION OF ALBUMIN AND GLOBULIN,661,COAGULATION & PLATELET DISORDERS,16,DISEASES AND DISORDERS OF THE BLOOD AND BLOOD FORMING ORGANS AND IMMUNOLOGICAL DISORDERS,1,Minor,Minor,Medical,Medicare,,,,,true,143672.94,13644.88
New York City,Manhattan,7002053,001463,NYU Langone Hospitals,0 to 17,113,F,Other Race,Unknown,1,Emergency,Home or Self Care,2019,BLD006,COAGULATION AND HEMORRHAGIC DISORDERS,ADM003,ADMINISTRATION OF ALBUMIN AND GLOBULIN,661,COAGULATION & PLATELET DISORDERS,16,DISEASES AND DISORDERS OF THE BLOOD AND BLOOD FORMING ORGANS AND IMMUNOLOGICAL DISORDERS,1,Minor,Minor,Medical,Blue Cross/Blue Shield,,,,,true,71117.51,5640.64
New York City,Manhattan,7002053,001463,NYU Langone Hospitals,50 to 69,112,F,White,Not Span/Hispanic,2,Emergency,Home or Self Care,2019,BLD006,COAGULATION AND HEMORRHAGIC DISORDERS,ADM001,TRANSFUSION OF BLOOD AND BLOOD PRODUCTS,661,COAGULATION & PLATELET DISORDERS,16,DISEASES AND DISORDERS OF THE BLOOD AND BLOOD FORMING ORGANS AND IMMUNOLOGICAL DISORDERS,4,Extreme,Extreme,Medical,Medicaid,,,,,true,58052.1,12860.71
New York City,Manhattan,7002053,001463,NYU Langone Hospitals,30 to 49,100,F,Other Race,Not Span/Hispanic,2,Emergency,Home or Self Care,2019,BLD006,COAGULATION AND HEMORRHAGIC DISORDERS,EST001,PHERESIS THERAPY,661,COAGULATION & PLATELET DISORDERS,16,DISEASES AND DISORDERS OF THE BLOOD AND BLOOD FORMING ORGANS AND IMMUNOLOGICAL DISORDERS,3,Major,Minor,Medical,Private Health Insurance,,,,,true,163347.96,12779.93
New York City,Manhattan,7002053,001463,NYU Langone Hospitals,70 or Older,100,F,Other Race,Not Span/Hispanic,5,Emergency,Home w/ Home Health Services,2019,BLD006,COAGULATION AND HEMORRHAGIC DISORDERS,ADM001,TRANSFUSION OF BLOOD AND BLOOD PRODUCTS,661,COAGULATION & PLATELET DISORDERS,16,DISEASES AND DISORDERS OF THE BLOOD AND BLOOD FORMING ORGANS AND IMMUNOLOGICAL DISORDERS,3,Major,Moderate,Medical,Medicare,Medicaid,,,,true,111048.21,21674.89
New York City,Manhattan,7002053,001463,NYU Langone Hospitals,0 to 17,112,M,Other Race,Spanish/Hispanic,1,Emergency,Home or Self Care,2019,BLD006,COAGULATION AND HEMORRHAGIC DISORDERS,,,661,COAGULATION & PLATELET DISORDERS,16,DISEASES AND DISORDERS OF THE BLOOD AND BLOOD FORMING ORGANS AND IMMUNOLOGICAL DISORDERS,1,Minor,Minor,Medical,Medicaid,,,,,true,14625.52,3973.61
New York City,Manhattan,7002053,001463,NYU Langone Hospitals,30 to 49,103,F,Other Race,Spanish/Hispanic,1,Emergency,Home or Self Care,2019,BLD006,COAGULATION AND HEMORRHAGIC DISORDERS,ADM001,TRANSFUSION OF BLOOD AND BLOOD PRODUCTS,661,COAGULATION & PLATELET DISORDERS,16,DISEASES AND DISORDERS OF THE BLOOD AND BLOOD FORMING ORGANS AND IMMUNOLOGICAL DISORDERS,2,Moderate,Minor,Medical,Private Health Insurance,,,,,true,20823.46,5319.49
New York City,Manhattan,7002053,001463,NYU Langone Hospitals,70 or Older,103,M,White,Not Span/Hispanic,2,Emergency,Home w/ Home Health Services,2019,BLD006,COAGULATION AND HEMORRHAGIC DISORDERS,IMG008,ULTRASONOGRAPHY,661,COAGULATION & PLATELET DISORDERS,16,DISEASES AND DISORDERS OF THE BLOOD AND BLOOD FORMING ORGANS AND IMMUNOLOGICAL DISORDERS,1,Minor,Minor,Medical,Medicare,Medicare,,,,true,32571.64,9513.96
New York City,Manhattan,7002053,001463,NYU Langone Hospitals,50 to 69,100,M,White,Not Span/Hispanic,2,Emergency,Left Against Medical Advice,2019,BLD006,COAGULATION AND HEMORRHAGIC DISORDERS,GIS001,ESOPHAGOGASTRODUODENOSCOPY (EGD) WITH BIOPSY,661,COAGULATION & PLATELET DISORDERS,16,DISEASES AND DISORDERS OF THE BLOOD AND BLOOD FORMING ORGANS AND IMMUNOLOGICAL DISORDERS,3,Major,Major,Medical,Medicare,Medicare,,,,true,96485.79,12903.84
New York City,Manhattan,7002053,001463,NYU Langone Hospitals,50 to 69,117,M,White,Not Span/Hispanic,3,Urgent,Home or Self Care,2019,BLD006,COAGULATION AND HEMORRHAGIC DISORDERS,ADM001,TRANSFUSION OF BLOOD AND BLOOD PRODUCTS,661,COAGULATION & PLATELET DISORDERS,16,DISEASES AND DISORDERS OF THE BLOOD AND BLOOD FORMING ORGANS AND IMMUNOLOGICAL DISORDERS,2,Moderate,Moderate,Medical,Medicaid,,,,,false,27115.79,10981.12
New York City,Manhattan,7002053,001463,NYU Langone Hospitals,18 to 29,112,M,Other Race,Unknown,7,Emergency,Home or Self Care,2019,BLD006,COAGULATION AND HEMORRHAGIC DISORDERS,LYM007,BONE MARROW BIOPSY,661,COAGULATION & PLATELET DISORDERS,16,DISEASES AND DISORDERS OF THE BLOOD AND BLOOD FORMING ORGANS AND IMMUNOLOGICAL DISORDERS,2,Moderate,Minor,Medical,Private Health Insurance,,,,,true,326908.2,37780.74
New York City,Manhattan,7002053,001463,NYU Langone Hospitals,18 to 29,100,F,Other Race,Not Span/Hispanic,2,Emergency,Home or Self Care,2019,BLD006,COAGULATION AND HEMORRHAGIC DISORDERS,,,661,COAGULATION & PLATELET DISORDERS,16,DISEASES AND DISORDERS OF THE BLOOD AND BLOOD FORMING ORGANS AND IMMUNOLOGICAL DISORDERS,1,Minor,Minor,Medical,Blue Cross/Blue Shield,,,,,true,25127.36,8114.39
New York City,Manhattan,7002053,001463,NYU Langone Hospitals,50 to 69,112,F,Black/African American,Not Span/Hispanic,2,Emergency,Home or Self Care,2019,BLD006,COAGULATION AND HEMORRHAGIC DISORDERS,ADM001,TRANSFUSION OF BLOOD AND BLOOD PRODUCTS,661,COAGULATION & PLATELET DISORDERS,16,DISEASES AND DISORDERS OF THE BLOOD AND BLOOD FORMING ORGANS AND IMMUNOLOGICAL DISORDERS,1,Minor,Minor,Medical,Private Health Insurance,,,,,true,101164.91,12821.09
New York City,Manhattan,7002053,001463,NYU Langone Hospitals,0 to 17,112,M,Other Race,Not Span/Hispanic,2,Emergency,Home or Self Care,2019,BLD006,COAGULATION AND HEMORRHAGIC DISORDERS,ADM003,ADMINISTRATION OF ALBUMIN AND GLOBULIN,661,COAGULATION & PLATELET DISORDERS,16,DISEASES AND DISORDERS OF THE BLOOD AND BLOOD FORMING ORGANS AND IMMUNOLOGICAL DISORDERS,1,Minor,Minor,Medical,Private Health Insurance,,,,,true,52031.45,9276.58
New York City,Manhattan,7002053,001463,NYU Langone Hospitals,0 to 17,112,F,Other Race,Not Span/Hispanic,1,Emergency,Home or Self Care,2019,BLD006,COAGULATION AND HEMORRHAGIC DISORDERS,ADM003,ADMINISTRATION OF ALBUMIN AND GLOBULIN,661,COAGULATION & PLATELET DISORDERS,16,DISEASES AND DISORDERS OF THE BLOOD AND BLOOD FORMING ORGANS AND IMMUNOLOGICAL DISORDERS,2,Moderate,Minor,Medical,Medicaid,,,,,true,42572.56,5197.03
New York City,Manhattan,7002053,001463,NYU Langone Hospitals,0 to 17,112,M,White,Not Span/Hispanic,4,Emergency,Home or Self Care,2019,BLD006,COAGULATION AND HEMORRHAGIC DISORDERS,ADM016,ADMINISTRATION OF ANTI-INFLAMMATORY AGENTS,661,COAGULATION & PLATELET DISORDERS,16,DISEASES AND DISORDERS OF THE BLOOD AND BLOOD FORMING ORGANS AND IMMUNOLOGICAL DISORDERS,2,Moderate,Minor,Medical,Medicaid,,,,,true,66563.8,14456.28
New York City,Manhattan,7002053,001463,NYU Langone Hospitals,50 to 69,100,M,White,Not Span/Hispanic,3,Emergency,Home w/ Home Health Services,2019,BLD006,COAGULATION AND HEMORRHAGIC DISORDERS,ADM001,TRANSFUSION OF BLOOD AND BLOOD PRODUCTS,661,COAGULATION & PLATELET DISORDERS,16,DISEASES AND DISORDERS OF THE BLOOD AND BLOOD FORMING ORGANS AND IMMUNOLOGICAL DISORDERS,3,Major,Major,Medical,Medicare,,,,,true,46451.15,12646.31
New York City,Manhattan,7002053,001463,NYU Langone Hospitals,30 to 49,109,M,Black/African American,Not Span/Hispanic,6,Emergency,Home or Self Care,2019,BLD006,COAGULATION AND HEMORRHAGIC DISORDERS,,,661,COAGULATION & PLATELET DISORDERS,16,DISEASES AND DISORDERS OF THE BLOOD AND BLOOD FORMING ORGANS AND IMMUNOLOGICAL DISORDERS,4,Extreme,Moderate,Medical,Private Health Insurance,,,,,true,96385.11,26902.73
New York City,Manhattan,7002053,001463,NYU Langone Hospitals,70 or Older,100,M,Other Race,Spanish/Hispanic,1,Emergency,Home w/ Home Health Services,2019,BLD006,COAGULATION AND HEMORRHAGIC DISORDERS,GIS001,ESOPHAGOGASTRODUODENOSCOPY (EGD) WITH BIOPSY,661,COAGULATION & PLATELET DISORDERS,16,DISEASES AND DISORDERS OF THE BLOOD AND BLOOD FORMING ORGANS AND IMMUNOLOGICAL DISORDERS,1,Minor,Moderate,Medical,Medicare,Medicaid,,,,true,60066.91,15467.09
New York City,Manhattan,7002053,001463,NYU Langone Hospitals,50 to 69,113,F,White,Not Span/Hispanic,7,Emergency,Skilled Nursing Home,2019,BLD006,COAGULATION AND HEMORRHAGIC DISORDERS,CAR028,INFERIOR VENA CAVA (IVC) FILTER PROCEDURES,661,COAGULATION & PLATELET DISORDERS,16,DISEASES AND DISORDERS OF THE BLOOD AND BLOOD FORMING ORGANS AND IMMUNOLOGICAL DISORDERS,3,Major,Moderate,Medical,Medicare,Medicaid,,,,true,113342.37,33377.98
New York City,Manhattan,7002053,001463,NYU Langone Hospitals,70 or Older,103,F,White,Not Span/Hispanic,2,Emergency,Hospice - Home,2019,BLD006,COAGULATION AND HEMORRHAGIC DISORDERS,ADM001,TRANSFUSION OF BLOOD AND BLOOD PRODUCTS,661,COAGULATION & PLATELET DISORDERS,16,DISEASES AND DISORDERS OF THE BLOOD AND BLOOD FORMING ORGANS AND IMMUNOLOGICAL DISORDERS,3,Major,Major,Medical,Medicare,Medicare,,,,true,39879.56,10623.06
New York City,Manhattan,7002053,001463,NYU Langone Hospitals,50 to 69,OOS,F,Other Race,Unknown,2,Emergency,Home or Self Care,2019,BLD006,COAGULATION AND HEMORRHAGIC DISORDERS,ADM003,ADMINISTRATION OF ALBUMIN AND GLOBULIN,661,COAGULATION & PLATELET DISORDERS,16,DISEASES AND DISORDERS OF THE BLOOD AND BLOOD FORMING ORGANS AND IMMUNOLOGICAL DISORDERS,1,Minor,Minor,Medical,Blue Cross/Blue Shield,,,,,true,144988.13,11405.37
New York City,Manhattan,7002053,001463,NYU Langone Hospitals,70 or Older,103,F,White,Not Span/Hispanic,2,Emergency,Hospice - Home,2019,BLD006,COAGULATION AND HEMORRHAGIC DISORDERS,ADM001,TRANSFUSION OF BLOOD AND BLOOD PRODUCTS,661,COAGULATION & PLATELET DISORDERS,16,DISEASES AND DISORDERS OF THE BLOOD AND BLOOD FORMING ORGANS AND IMMUNOLOGICAL DISORDERS,3,Major,Major,Medical,Medicare,Medicare,,,,true,53107.3,12655.59
New York City,Manhattan,7002053,001463,NYU Langone Hospitals,50 to 69,109,F,White,Not Span/Hispanic,9,Emergency,Skilled Nursing Home,2019,BLD006,COAGULATION AND HEMORRHAGIC DISORDERS,CAR028,INFERIOR VENA CAVA (IVC) FILTER PROCEDURES,661,COAGULATION & PLATELET DISORDERS,16,DISEASES AND DISORDERS OF THE BLOOD AND BLOOD FORMING ORGANS AND IMMUNOLOGICAL DISORDERS,3,Major,Extreme,Medical,Medicaid,,,,,true,207633.99,68999.98
New York City,Manhattan,7002053,001463,NYU Langone Hospitals,50 to 69,114,F,Other Race,Spanish/Hispanic,3,Emergency,Home w/ Home Health Services,2019,BLD006,COAGULATION AND HEMORRHAGIC DISORDERS,EST001,PHERESIS THERAPY,661,COAGULATION & PLATELET DISORDERS,16,DISEASES AND DISORDERS OF THE BLOOD AND BLOOD FORMING ORGANS AND IMMUNOLOGICAL DISORDERS,2,Moderate,Minor,Medical,Medicare,Medicaid,,,,true,37028.81,12307.64
New York City,Manhattan,7002053,001463,NYU Langone Hospitals,70 or Older,110,M,White,Not Span/Hispanic,2,Elective,Home w/ Home Health Services,2019,BLD006,COAGULATION AND HEMORRHAGIC DISORDERS,URN002,KIDNEY AND OTHER URINARY TRACT BIOPSY (NON-ENDOSCOPIC),661,COAGULATION & PLATELET DISORDERS,16,DISEASES AND DISORDERS OF THE BLOOD AND BLOOD FORMING ORGANS AND IMMUNOLOGICAL DISORDERS,3,Major,Moderate,Medical,Medicare,Private Health Insurance,Blue Cross/Blue Shield,,,false,68755.41,22413.7
New York City,Manhattan,7002053,001463,NYU Langone Hospitals,50 to 69,112,M,White,Not Span/Hispanic,2,Emergency,Home or Self Care,2019,BLD006,COAGULATION AND HEMORRHAGIC DISORDERS,ADM001,TRANSFUSION OF BLOOD AND BLOOD PRODUCTS,661,COAGULATION & PLATELET DISORDERS,16,DISEASES AND DISORDERS OF THE BLOOD AND BLOOD FORMING ORGANS AND IMMUNOLOGICAL DISORDERS,1,Minor,Moderate,Medical,Private Health Insurance,,,,,true,27697.09,8707.11
New York City,Manhattan,7002053,001463,NYU Langone Hospitals,50 to 69,114,M,Other Race,Not Span/Hispanic,1,Emergency,Home or Self Care,2019,BLD006,COAGULATION AND HEMORRHAGIC DISORDERS,ADM001,TRANSFUSION OF BLOOD AND BLOOD PRODUCTS,661,COAGULATION & PLATELET DISORDERS,16,DISEASES AND DISORDERS OF THE BLOOD AND BLOOD FORMING ORGANS AND IMMUNOLOGICAL DISORDERS,3,Major,Moderate,Medical,Medicaid,,,,,true,39990.13,14151.92
New York City,Manhattan,7002053,001463,NYU Langone Hospitals,70 or Older,112,F,Other Race,Not Span/Hispanic,3,Urgent,Home or Self Care,2019,BLD006,COAGULATION AND HEMORRHAGIC DISORDERS,,,661,COAGULATION & PLATELET DISORDERS,16,DISEASES AND DISORDERS OF THE BLOOD AND BLOOD FORMING ORGANS AND IMMUNOLOGICAL DISORDERS,2,Moderate,Moderate,Medical,Medicare,Blue Cross/Blue Shield,,,,false,36091.29,10556.59
New York City,Manhattan,7002053,001463,NYU Langone Hospitals,50 to 69,112,F,Black/African American,Not Span/Hispanic,1,Emergency,Home or Self Care,2019,BLD006,COAGULATION AND HEMORRHAGIC DISORDERS,,,661,COAGULATION & PLATELET DISORDERS,16,DISEASES AND DISORDERS OF THE BLOOD AND BLOOD FORMING ORGANS AND IMMUNOLOGICAL DISORDERS,1,Minor,Minor,Medical,Private Health Insurance,,,,,true,10545.79,3890.35
New York City,Manhattan,7002053,001463,NYU Langone Hospitals,50 to 69,103,M,Other Race,Spanish/Hispanic,6,Emergency,Home or Self Care,2019,BLD006,COAGULATION AND HEMORRHAGIC DISORDERS,MAM010,OTHER CARDIOVASCULAR SYSTEM MEASUREMENT AND MONITORING,661,COAGULATION & PLATELET DISORDERS,16,DISEASES AND DISORDERS OF THE BLOOD AND BLOOD FORMING ORGANS AND IMMUNOLOGICAL DISORDERS,3,Major,Major,Medical,Private Health Insurance,Medicare,,,,false,151399.17,36274.71
New York City,Manhattan,7002053,001463,NYU Langone Hospitals,70 or Older,100,M,White,Not Span/Hispanic,5,Emergency,Skilled Nursing Home,2019,BLD006,COAGULATION AND HEMORRHAGIC DISORDERS,,,661,COAGULATION & PLATELET DISORDERS,16,DISEASES AND DISORDERS OF THE BLOOD AND BLOOD FORMING ORGANS AND IMMUNOLOGICAL DISORDERS,2,Moderate,Moderate,Medical,Medicare,Medicare,,,,true,96119.56,30248.38
New York City,Manhattan,7002053,001463,NYU Langone Hospitals,70 or Older,112,F,White,Not Span/Hispanic,16,Emergency,Home w/ Home Health Services,2019,BLD006,COAGULATION AND HEMORRHAGIC DISORDERS,PLC002,PACKING AND DRESSING PROCEDURES,661,COAGULATION & PLATELET DISORDERS,16,DISEASES AND DISORDERS OF THE BLOOD AND BLOOD FORMING ORGANS AND IMMUNOLOGICAL DISORDERS,4,Extreme,Extreme,Medical,Medicare,Medicare,,,,true,137367.88,54192.44
New York City,Manhattan,7002053,001463,NYU Langone Hospitals,30 to 49,103,F,White,Not Span/Hispanic,2,Emergency,Home or Self Care,2019,BLD006,COAGULATION AND HEMORRHAGIC DISORDERS,,,661,COAGULATION & PLATELET DISORDERS,16,DISEASES AND DISORDERS OF THE BLOOD AND BLOOD FORMING ORGANS AND IMMUNOLOGICAL DISORDERS,3,Major,Major,Medical,Blue Cross/Blue Shield,Medicare,,,,true,24283.48,8098.1
New York City,Manhattan,7002053,001463,NYU Langone Hospitals,30 to 49,100,M,White,Not Span/Hispanic,1,Emergency,Home or Self Care,2019,BLD006,COAGULATION AND HEMORRHAGIC DISORDERS,,,661,COAGULATION & PLATELET DISORDERS,16,DISEASES AND DISORDERS OF THE BLOOD AND BLOOD FORMING ORGANS AND IMMUNOLOGICAL DISORDERS,2,Moderate,Minor,Medical,Private Health Insurance,,,,,true,15414.4,4681.83
New York City,Manhattan,7002053,001463,NYU Langone Hospitals,70 or Older,112,F,Other Race,Not Span/Hispanic,3,Emergency,Home or Self Care,2019,BLD006,COAGULATION AND HEMORRHAGIC DISORDERS,EST001,PHERESIS THERAPY,661,COAGULATION & PLATELET DISORDERS,16,DISEASES AND DISORDERS OF THE BLOOD AND BLOOD FORMING ORGANS AND IMMUNOLOGICAL DISORDERS,2,Moderate,Minor,Medical,Medicare,Blue Cross/Blue Shield,,,,false,28844.13,11311.55
New York City,Manhattan,7002053,001463,NYU Langone Hospitals,0 to 17,112,M,White,Not Span/Hispanic,1,Emergency,Home or Self Care,2019,BLD006,COAGULATION AND HEMORRHAGIC DISORDERS,ADM003,ADMINISTRATION OF ALBUMIN AND GLOBULIN,661,COAGULATION & PLATELET DISORDERS,16,DISEASES AND DISORDERS OF THE BLOOD AND BLOOD FORMING ORGANS AND IMMUNOLOGICAL DISORDERS,1,Minor,Minor,Medical,Medicaid,,,,,true,34210.11,5141.28
New York City,Manhattan,7002053,001463,NYU Langone Hospitals,30 to 49,100,F,Multi-racial,Not Span/Hispanic,4,Emergency,Left Against Medical Advice,2019,BLD006,COAGULATION AND HEMORRHAGIC DISORDERS,,,661,COAGULATION & PLATELET DISORDERS,16,DISEASES AND DISORDERS OF THE BLOOD AND BLOOD FORMING ORGANS AND IMMUNOLOGICAL DISORDERS,3,Major,Moderate,Medical,Medicare,Medicaid,,,,true,37474.5,14367.33
New York City,Manhattan,7002053,001463,NYU Langone Hospitals,18 to 29,115,M,Other Race,Not Span/Hispanic,4,Emergency,Home or Self Care,2019,BLD007,DISEASES OF WHITE BLOOD CELLS,LYM007,BONE MARROW BIOPSY,661,COAGULATION & PLATELET DISORDERS,16,DISEASES AND DISORDERS OF THE BLOOD AND BLOOD FORMING ORGANS AND IMMUNOLOGICAL DISORDERS,3,Major,Major,Medical,Private Health Insurance,,,,,false,101021.28,29029.24
New York City,Manhattan,7002053,001463,NYU Langone Hospitals,70 or Older,100,F,Other Race,Not Span/Hispanic,3,Emergency,Home or Self Care,2019,BLD006,COAGULATION AND HEMORRHAGIC DISORDERS,ADM001,TRANSFUSION OF BLOOD AND BLOOD PRODUCTS,661,COAGULATION & PLATELET DISORDERS,16,DISEASES AND DISORDERS OF THE BLOOD AND BLOOD FORMING ORGANS AND IMMUNOLOGICAL DISORDERS,1,Minor,Minor,Medical,Medicare,Medicare,,,,true,142031.72,15547.05