Hospital Service Area,Hospital County,Operating Certificate Number,Permanent Facility Id,Facility Name,Age Group,Zip Code - 3 digits,Gender,Race,Ethnicity,Length of Stay,Type of Admission,Patient Disposition,Discharge Year,CCS Diagnosis Code,CCS Diagnosis Description,CCS Procedure Code,CCS Procedure Description,APR DRG Code,APR DRG Description,APR MDC Code,APR MDC Description,APR Severity of Illness Code,APR Severity of Illness Description,APR Risk of Mortality,APR Medical Surgical Description,Payment Typology 1,Payment Typology 2,Payment Typology 3,Birth Weight,Abortion Edit Indicator,Emergency Department Indicator,Total Charges,Total Costs
New York City,Manhattan,7002024,001456,Mount Sinai Hospital,18 to 29,100,M,Black/African American,Not Span/Hispanic,2,Emergency,Left Against Medical Advice,2017,061,Sickle cell anemia,000,NO PROC,662,Sickle cell anemia crisis,16,"Diseases and Disorders of Blood, Blood Forming Organs and Immunological Disorders",1,Minor,Minor,Medical,Medicaid,Medicaid,Self-Pay,,N,Y,29496.92,10143.58
New York City,Manhattan,7002032,001466,Mount Sinai West,18 to 29,100,F,Black/African American,Not Span/Hispanic,4,Emergency,Home or Self Care,2017,061,Sickle cell anemia,222,BLOOD TRANSFUSION,662,Sickle cell anemia crisis,16,"Diseases and Disorders of Blood, Blood Forming Organs and Immunological Disorders",3,Major,Major,Medical,Private Health Insurance,Self-Pay,,,N,Y,38072.53,9456.53
New York City,Bronx,7000006,001168,Montefiore Medical Center-Wakefield Hospital,30 to 49,105,F,Black/African American,Not Span/Hispanic,1,Emergency,Home or Self Care,2017,061,Sickle cell anemia,000,NO PROC,662,Sickle cell anemia crisis,16,"Diseases and Disorders of Blood, Blood Forming Organs and Immunological Disorders",2,Moderate,Minor,Medical,Medicaid,,,,N,Y,18099.57,3223.15
New York City,Bronx,7000006,001168,Montefiore Medical Center-Wakefield Hospital,0 to 17,104,M,Black/African American,Not Span/Hispanic,2,Emergency,Home or Self Care,2017,061,Sickle cell anemia,000,NO PROC,662,Sickle cell anemia crisis,16,"Diseases and Disorders of Blood, Blood Forming Organs and Immunological Disorders",1,Minor,Minor,Medical,Medicaid,,,,N,Y,20474.46,5527.26
New York City,Bronx,7000006,001169,Montefiore Medical Center - Henry & Lucy Moses Div,18 to 29,100,M,Black/African American,Not Span/Hispanic,13,Emergency,Psychiatric Hospital or Unit of Hosp,2017,061,Sickle cell anemia,231,OTHER THERAPEUTIC PRCS,662,Sickle cell anemia crisis,16,"Diseases and Disorders of Blood, Blood Forming Organs and Immunological Disorders",1,Minor,Minor,Medical,Medicare,Medicaid,,,N,Y,107295.33,24051.97
New York City,Bronx,7000006,001169,Montefiore Medical Center - Henry & Lucy Moses Div,30 to 49,104,F,Other Race,Not Span/Hispanic,10,Emergency,Home w/ Home Health Services,2017,061,Sickle cell anemia,054,OT VASC CATH; NOT HEART,662,Sickle cell anemia crisis,16,"Diseases and Disorders of Blood, Blood Forming Organs and Immunological Disorders",3,Major,Moderate,Medical,Medicaid,,,,N,Y,122886.70,26350.05
New York City,Bronx,7000006,001169,Montefiore Medical Center - Henry & Lucy Moses Div,30 to 49,104,F,Black/African American,Not Span/Hispanic,5,Emergency,Home or Self Care,2017,061,Sickle cell anemia,231,OTHER THERAPEUTIC PRCS,662,Sickle cell anemia crisis,16,"Diseases and Disorders of Blood, Blood Forming Organs and Immunological Disorders",3,Major,Minor,Medical,Medicare,Medicaid,,,N,Y,54672.21,11518.22
New York City,Bronx,7000006,001169,Montefiore Medical Center - Henry & Lucy Moses Div,30 to 49,104,M,Black/African American,Not Span/Hispanic,4,Emergency,Home or Self Care,2017,061,Sickle cell anemia,222,BLOOD TRANSFUSION,662,Sickle cell anemia crisis,16,"Diseases and Disorders of Blood, Blood Forming Organs and Immunological Disorders",3,Major,Minor,Medical,Medicare,Medicaid,,,N,Y,60879.23,9807.55
New York City,Bronx,7000006,001169,Montefiore Medical Center - Henry & Lucy Moses Div,18 to 29,104,M,Black/African American,Not Span/Hispanic,7,Emergency,Home or Self Care,2017,061,Sickle cell anemia,041,OT NON-OR THER PRC RESP,662,Sickle cell anemia crisis,16,"Diseases and Disorders of Blood, Blood Forming Organs and Immunological Disorders",3,Major,Minor,Medical,Private Health Insurance,Blue Cross/Blue Shield,Medicaid,,N,Y,60093.68,13400.12
New York City,Bronx,7000006,001169,Montefiore Medical Center - Henry & Lucy Moses Div,30 to 49,116,M,Black/African American,Not Span/Hispanic,1,Emergency,Left Against Medical Advice,2017,061,Sickle cell anemia,000,NO PROC,662,Sickle cell anemia crisis,16,"Diseases and Disorders of Blood, Blood Forming Organs and Immunological Disorders",1,Minor,Minor,Medical,Medicaid,,,,N,Y,14250.28,2728.54
New York City,Bronx,7000006,001169,Montefiore Medical Center - Henry & Lucy Moses Div,18 to 29,104,M,Black/African American,Not Span/Hispanic,1,Emergency,Home or Self Care,2017,061,Sickle cell anemia,000,NO PROC,662,Sickle cell anemia crisis,16,"Diseases and Disorders of Blood, Blood Forming Organs and Immunological Disorders",1,Minor,Minor,Medical,Blue Cross/Blue Shield,,,,N,Y,16371.17,2959.13
New York City,Bronx,7000006,001169,Montefiore Medical Center - Henry & Lucy Moses Div,30 to 49,104,M,Black/African American,Not Span/Hispanic,2,Emergency,Home or Self Care,2017,061,Sickle cell anemia,231,OTHER THERAPEUTIC PRCS,662,Sickle cell anemia crisis,16,"Diseases and Disorders of Blood, Blood Forming Organs and Immunological Disorders",2,Moderate,Minor,Medical,Medicare,Medicaid,,,N,Y,24403.26,4525.57
New York City,Bronx,7000006,001169,Montefiore Medical Center - Henry & Lucy Moses Div,0 to 17,104,M,Black/African American,Not Span/Hispanic,3,Emergency,Home or Self Care,2017,061,Sickle cell anemia,222,BLOOD TRANSFUSION,662,Sickle cell anemia crisis,16,"Diseases and Disorders of Blood, Blood Forming Organs and Immunological Disorders",1,Minor,Minor,Medical,Private Health Insurance,,,,N,Y,48182.90,11988.47
New York City,Bronx,7000006,001169,Montefiore Medical Center - Henry & Lucy Moses Div,0 to 17,104,F,Black/African American,Not Span/Hispanic,4,Emergency,Home or Self Care,2017,061,Sickle cell anemia,231,OTHER THERAPEUTIC PRCS,662,Sickle cell anemia crisis,16,"Diseases and Disorders of Blood, Blood Forming Organs and Immunological Disorders",1,Minor,Minor,Medical,Private Health Insurance,,,,N,Y,30134.87,8249.20
New York City,Bronx,7000006,001169,Montefiore Medical Center - Henry & Lucy Moses Div,0 to 17,104,F,Black/African American,Not Span/Hispanic,5,Emergency,Home or Self Care,2017,061,Sickle cell anemia,231,OTHER THERAPEUTIC PRCS,662,Sickle cell anemia crisis,16,"Diseases and Disorders of Blood, Blood Forming Organs and Immunological Disorders",2,Moderate,Minor,Medical,Private Health Insurance,,,,N,Y,52225.81,14019.05
New York City,Bronx,7000006,001169,Montefiore Medical Center - Henry & Lucy Moses Div,0 to 17,104,M,Black/African American,Not Span/Hispanic,3,Emergency,Home or Self Care,2017,061,Sickle cell anemia,000,NO PROC,662,Sickle cell anemia crisis,16,"Diseases and Disorders of Blood, Blood Forming Organs and Immunological Disorders",2,Moderate,Minor,Medical,Private Health Insurance,,,,N,Y,34479.18,9051.67
New York City,Bronx,7000006,001169,Montefiore Medical Center - Henry & Lucy Moses Div,0 to 17,104,F,Other Race,Not Span/Hispanic,2,Emergency,Home or Self Care,2017,061,Sickle cell anemia,000,NO PROC,662,Sickle cell anemia crisis,16,"Diseases and Disorders of Blood, Blood Forming Organs and Immunological Disorders",1,Minor,Minor,Medical,Medicaid,,,,N,Y,26227.56,6451.28
New York City,Bronx,7000006,001169,Montefiore Medical Center - Henry & Lucy Moses Div,0 to 17,104,F,Black/African American,Not Span/Hispanic,1,Emergency,Home or Self Care,2017,061,Sickle cell anemia,000,NO PROC,662,Sickle cell anemia crisis,16,"Diseases and Disorders of Blood, Blood Forming Organs and Immunological Disorders",1,Minor,Minor,Medical,Medicaid,,,,N,Y,14059.49,3242.32
New York City,Bronx,7000006,001169,Montefiore Medical Center - Henry & Lucy Moses Div,0 to 17,104,F,Black/African American,Not Span/Hispanic,2,Emergency,Home or Self Care,2017,061,Sickle cell anemia,000,NO PROC,662,Sickle cell anemia crisis,16,"Diseases and Disorders of Blood, Blood Forming Organs and Immunological Disorders",1,Minor,Minor,Medical,Medicaid,,,,N,Y,22078.14,5652.95
New York City,Bronx,7000006,001169,Montefiore Medical Center - Henry & Lucy Moses Div,0 to 17,104,M,Other Race,Spanish/Hispanic,3,Emergency,Home or Self Care,2017,061,Sickle cell anemia,231,OTHER THERAPEUTIC PRCS,662,Sickle cell anemia crisis,16,"Diseases and Disorders of Blood, Blood Forming Organs and Immunological Disorders",1,Minor,Minor,Medical,Medicaid,,,,N,Y,27983.32,7825.91
New York City,Bronx,7000006,001169,Montefiore Medical Center - Henry & Lucy Moses Div,0 to 17,104,F,Black/African American,Not Span/Hispanic,3,Emergency,Home or Self Care,2017,061,Sickle cell anemia,000,NO PROC,662,Sickle cell anemia crisis,16,"Diseases and Disorders of Blood, Blood Forming Organs and Immunological Disorders",1,Minor,Minor,Medical,Medicaid,,,,N,Y,27890.43,7824.54
New York City,Bronx,7000006,001169,Montefiore Medical Center - Henry & Lucy Moses Div,0 to 17,104,M,Black/African American,Not Span/Hispanic,1,Emergency,Home or Self Care,2017,061,Sickle cell anemia,000,NO PROC,662,Sickle cell anemia crisis,16,"Diseases and Disorders of Blood, Blood Forming Organs and Immunological Disorders",2,Moderate,Moderate,Medical,Medicaid,,,,N,Y,13612.94,3163.48
New York City,Bronx,7000006,003058,Montefiore Med Center - Jack D Weiler Hosp of A Einstein College Div,18 to 29,104,F,Black/African American,Not Span/Hispanic,15,Emergency,Home or Self Care,2017,061,Sickle cell anemia,222,BLOOD TRANSFUSION,662,Sickle cell anemia crisis,16,"Diseases and Disorders of Blood, Blood Forming Organs and Immunological Disorders",1,Minor,Minor,Medical,Medicaid,,,,N,Y,142950.01,30387.79
New York City,Bronx,7000006,003058,Montefiore Med Center - Jack D Weiler Hosp of A Einstein College Div,18 to 29,104,F,Black/African American,Not Span/Hispanic,8,Emergency,Home or Self Care,2017,061,Sickle cell anemia,222,BLOOD TRANSFUSION,662,Sickle cell anemia crisis,16,"Diseases and Disorders of Blood, Blood Forming Organs and Immunological Disorders",3,Major,Moderate,Medical,Medicaid,,,,N,Y,74278.79,15877.01
New York City,Bronx,7000006,003058,Montefiore Med Center - Jack D Weiler Hosp of A Einstein College Div,30 to 49,104,F,Black/African American,Not Span/Hispanic,3,Emergency,Home or Self Care,2017,061,Sickle cell anemia,000,NO PROC,662,Sickle cell anemia crisis,16,"Diseases and Disorders of Blood, Blood Forming Organs and Immunological Disorders",3,Major,Minor,Medical,Private Health Insurance,,,,N,Y,32324.79,6449.15
New York City,Bronx,7000006,003058,Montefiore Med Center - Jack D Weiler Hosp of A Einstein College Div,18 to 29,100,F,Black/African American,Not Span/Hispanic,6,Emergency,Home or Self Care,2017,061,Sickle cell anemia,000,NO PROC,662,Sickle cell anemia crisis,16,"Diseases and Disorders of Blood, Blood Forming Organs and Immunological Disorders",3,Major,Minor,Medical,Medicaid,,,,N,Y,49269.30,10608.10
New York City,Kings,7001033,001315,Kingsbrook Jewish Medical Center,50 to 69,112,F,Black/African American,Not Span/Hispanic,9,Emergency,Home or Self Care,2017,061,Sickle cell anemia,000,NO PROC,662,Sickle cell anemia crisis,16,"Diseases and Disorders of Blood, Blood Forming Organs and Immunological Disorders",3,Major,Minor,Medical,Medicare,Medicare,Self-Pay,,N,Y,58035.00,17599.36
New York City,Kings,7001033,001315,Kingsbrook Jewish Medical Center,18 to 29,112,F,Black/African American,Not Span/Hispanic,8,Emergency,Home or Self Care,2017,061,Sickle cell anemia,222,BLOOD TRANSFUSION,662,Sickle cell anemia crisis,16,"Diseases and Disorders of Blood, Blood Forming Organs and Immunological Disorders",2,Moderate,Minor,Medical,Medicaid,Medicaid,Self-Pay,,N,Y,44965.00,14860.78
New York City,Kings,7002002,001324,Mount Sinai Brooklyn,50 to 69,112,F,Black/African American,Not Span/Hispanic,1,Emergency,Home w/ Home Health Services,2017,061,Sickle cell anemia,222,BLOOD TRANSFUSION,662,Sickle cell anemia crisis,16,"Diseases and Disorders of Blood, Blood Forming Organs and Immunological Disorders",2,Moderate,Moderate,Medical,Medicare,Medicaid,Self-Pay,,N,Y,15468.45,3650.51
New York City,Kings,7002002,001324,Mount Sinai Brooklyn,30 to 49,112,M,Black/African American,Not Span/Hispanic,4,Emergency,Home or Self Care,2017,061,Sickle cell anemia,231,OTHER THERAPEUTIC PRCS,662,Sickle cell anemia crisis,16,"Diseases and Disorders of Blood, Blood Forming Organs and Immunological Disorders",2,Moderate,Minor,Medical,Medicaid,Medicaid,Self-Pay,,N,N,27057.66,4524.67
New York City,Manhattan,7002002,001439,Mount Sinai Beth Israel,30 to 49,100,M,Black/African American,Not Span/Hispanic,1,Emergency,Left Against Medical Advice,2017,061,Sickle cell anemia,000,NO PROC,662,Sickle cell anemia crisis,16,"Diseases and Disorders of Blood, Blood Forming Organs and Immunological Disorders",1,Minor,Minor,Medical,Medicare,Miscellaneous/Other,Medicaid,,N,Y,12574.94,4024.03
New York City,Manhattan,7002024,001456,Mount Sinai Hospital,30 to 49,104,F,Black/African American,Not Span/Hispanic,3,Emergency,Home or Self Care,2017,061,Sickle cell anemia,222,BLOOD TRANSFUSION,662,Sickle cell anemia crisis,16,"Diseases and Disorders of Blood, Blood Forming Organs and Immunological Disorders",2,Moderate,Minor,Medical,Medicaid,Medicaid,Self-Pay,,N,Y,30400.29,10774.18
New York City,Manhattan,7002024,001456,Mount Sinai Hospital,0 to 17,100,M,Black/African American,Not Span/Hispanic,4,Emergency,Home or Self Care,2017,061,Sickle cell anemia,008,OT NON-OR THER NERV SYS,662,Sickle cell anemia crisis,16,"Diseases and Disorders of Blood, Blood Forming Organs and Immunological Disorders",2,Moderate,Minor,Medical,Medicaid,Medicaid,Self-Pay,,N,Y,31093.82,22319.25
New York City,Manhattan,7002024,001456,Mount Sinai Hospital,18 to 29,114,M,Other Race,Not Span/Hispanic,4,Emergency,Home or Self Care,2017,061,Sickle cell anemia,000,NO PROC,662,Sickle cell anemia crisis,16,"Diseases and Disorders of Blood, Blood Forming Organs and Immunological Disorders",2,Moderate,Minor,Medical,Private Health Insurance,Self-Pay,,,N,Y,36295.89,11977.95
New York City,Manhattan,7002024,001456,Mount Sinai Hospital,30 to 49,112,M,Other Race,Not Span/Hispanic,6,Emergency,Home or Self Care,2017,061,Sickle cell anemia,000,NO PROC,662,Sickle cell anemia crisis,16,"Diseases and Disorders of Blood, Blood Forming Organs and Immunological Disorders",3,Major,Minor,Medical,Medicare,Self-Pay,,,N,Y,45380.20,15133.32
New York City,Manhattan,7002032,001466,Mount Sinai West,30 to 49,OOS,F,Black/African American,Not Span/Hispanic,2,Emergency,Left Against Medical Advice,2017,061,Sickle cell anemia,222,BLOOD TRANSFUSION,662,Sickle cell anemia crisis,16,"Diseases and Disorders of Blood, Blood Forming Organs and Immunological Disorders",2,Moderate,Minor,Medical,Medicaid,Self-Pay,,,N,Y,15856.56,4299.08
New York City,Manhattan,7002032,001469,Mount Sinai St. Luke's,30 to 49,100,M,Black/African American,Not Span/Hispanic,3,Emergency,Home or Self Care,2017,061,Sickle cell anemia,183,ROUTINE CHEST X-RAY,662,Sickle cell anemia crisis,16,"Diseases and Disorders of Blood, Blood Forming Organs and Immunological Disorders",2,Moderate,Minor,Medical,Medicaid,Medicaid,Self-Pay,,N,Y,22920.36,6294.83
New York City,Manhattan,7002032,001469,Mount Sinai St. Luke's,18 to 29,104,F,Black/African American,Spanish/Hispanic,3,Emergency,Home or Self Care,2017,061,Sickle cell anemia,183,ROUTINE CHEST X-RAY,662,Sickle cell anemia crisis,16,"Diseases and Disorders of Blood, Blood Forming Organs and Immunological Disorders",3,Major,Moderate,Medical,Medicaid,Medicaid,Self-Pay,,N,Y,25727.80,6974.85
New York City,Manhattan,7002032,001469,Mount Sinai St. Luke's,18 to 29,104,F,Black/African American,Not Span/Hispanic,5,Emergency,Left Against Medical Advice,2017,061,Sickle cell anemia,054,OT VASC CATH; NOT HEART,662,Sickle cell anemia crisis,16,"Diseases and Disorders of Blood, Blood Forming Organs and Immunological Disorders",3,Major,Minor,Medical,Medicaid,Medicaid,Self-Pay,,N,Y,54977.05,16056.08
New York City,Manhattan,7002032,001469,Mount Sinai St. Luke's,18 to 29,100,F,Black/African American,Not Span/Hispanic,6,Emergency,Home or Self Care,2017,061,Sickle cell anemia,231,OTHER THERAPEUTIC PRCS,662,Sickle cell anemia crisis,16,"Diseases and Disorders of Blood, Blood Forming Organs and Immunological Disorders",1,Minor,Minor,Medical,Medicare,Medicaid,Self-Pay,,N,Y,40915.16,11718.78
New York City,Manhattan,7002032,001469,Mount Sinai St. Luke's,30 to 49,100,F,Black/African American,Not Span/Hispanic,1,Emergency,Expired,2017,061,Sickle cell anemia,216,RESP INTUB/MECH VENTIL,662,Sickle cell anemia crisis,16,"Diseases and Disorders of Blood, Blood Forming Organs and Immunological Disorders",4,Extreme,Extreme,Medical,Medicaid,Medicaid,Self-Pay,,N,Y,34195.70,10270.67
New York City,Manhattan,7002032,001469,Mount Sinai St. Luke's,18 to 29,100,M,Black/African American,Not Span/Hispanic,1,Emergency,Left Against Medical Advice,2017,061,Sickle cell anemia,231,OTHER THERAPEUTIC PRCS,662,Sickle cell anemia crisis,16,"Diseases and Disorders of Blood, Blood Forming Organs and Immunological Disorders",1,Minor,Minor,Medical,Medicaid,Self-Pay,,,N,Y,10436.79,3034.34
Hudson Valley,Orange,3523000,000699,Orange Regional Medical Center,0 to 17,127,M,Black/African American,Not Span/Hispanic,10,Emergency,Home or Self Care,2017,061,Sickle cell anemia,000,NO PROC,662,Sickle cell anemia crisis,16,"Diseases and Disorders of Blood, Blood Forming Organs and Immunological Disorders",2,Moderate,Minor,Medical,Blue Cross/Blue Shield,,,,N,Y,64188.46,14745.87
Hudson Valley,Orange,3523000,000699,Orange Regional Medical Center,18 to 29,109,M,Black/African American,Not Span/Hispanic,2,Emergency,Home or Self Care,2017,061,Sickle cell anemia,000,NO PROC,662,Sickle cell anemia crisis,16,"Diseases and Disorders of Blood, Blood Forming Organs and Immunological Disorders",1,Minor,Minor,Medical,Medicaid,,,,N,Y,14215.77,3215.63
Hudson Valley,Rockland,4329000,000779,Good Samaritan Hospital of Suffern,30 to 49,125,M,Black/African American,Not Span/Hispanic,4,Emergency,Home or Self Care,2017,061,Sickle cell anemia,000,NO PROC,662,Sickle cell anemia crisis,16,"Diseases and Disorders of Blood, Blood Forming Organs and Immunological Disorders",1,Minor,Minor,Medical,Medicare,,,,N,Y,37191.58,9192.68
New York City,Bronx,7000006,001169,Montefiore Medical Center - Henry & Lucy Moses Div,30 to 49,104,M,Black/African American,Not Span/Hispanic,14,Emergency,Home or Self Care,2017,061,Sickle cell anemia,000,NO PROC,662,Sickle cell anemia crisis,16,"Diseases and Disorders of Blood, Blood Forming Organs and Immunological Disorders",3,Major,Minor,Medical,Medicaid,,,,N,Y,121279.66,26785.95
New York City,Bronx,7000006,001169,Montefiore Medical Center - Henry & Lucy Moses Div,30 to 49,104,M,Black/African American,Not Span/Hispanic,14,Emergency,Home or Self Care,2017,061,Sickle cell anemia,231,OTHER THERAPEUTIC PRCS,662,Sickle cell anemia crisis,16,"Diseases and Disorders of Blood, Blood Forming Organs and Immunological Disorders",2,Moderate,Minor,Medical,Medicare,Medicaid,,,N,Y,138654.71,27492.30
New York City,Bronx,7000006,001169,Montefiore Medical Center - Henry & Lucy Moses Div,18 to 29,104,M,Black/African American,Not Span/Hispanic,7,Emergency,Home or Self Care,2017,061,Sickle cell anemia,222,BLOOD TRANSFUSION,662,Sickle cell anemia crisis,16,"Diseases and Disorders of Blood, Blood Forming Organs and Immunological Disorders",3,Major,Minor,Medical,Private Health Insurance,,,,N,Y,70327.09,14090.91
New York City,Bronx,7000006,001169,Montefiore Medical Center - Henry & Lucy Moses Div,18 to 29,104,M,Other Race,Spanish/Hispanic,7,Emergency,Home or Self Care,2017,061,Sickle cell anemia,231,OTHER THERAPEUTIC PRCS,662,Sickle cell anemia crisis,16,"Diseases and Disorders of Blood, Blood Forming Organs and Immunological Disorders",2,Moderate,Minor,Medical,Medicaid,,,,N,Y,72411.72,15125.13
New York City,Bronx,7000006,001169,Montefiore Medical Center - Henry & Lucy Moses Div,50 to 69,104,M,Black/African American,Not Span/Hispanic,1,Emergency,Left Against Medical Advice,2017,061,Sickle cell anemia,000,NO PROC,662,Sickle cell anemia crisis,16,"Diseases and Disorders of Blood, Blood Forming Organs and Immunological Disorders",3,Major,Moderate,Medical,Medicaid,,,,N,Y,13892.51,2580.42
New York City,Bronx,7000006,001169,Montefiore Medical Center - Henry & Lucy Moses Div,30 to 49,104,F,Black/African American,Not Span/Hispanic,2,Emergency,Home or Self Care,2017,061,Sickle cell anemia,000,NO PROC,662,Sickle cell anemia crisis,16,"Diseases and Disorders of Blood, Blood Forming Organs and Immunological Disorders",1,Minor,Minor,Medical,Medicare,Blue Cross/Blue Shield,,,N,Y,21867.52,4447.45
New York City,Bronx,7000006,001169,Montefiore Medical Center - Henry & Lucy Moses Div,0 to 17,104,M,Black/African American,Not Span/Hispanic,5,Emergency,Home or Self Care,2017,061,Sickle cell anemia,231,OTHER THERAPEUTIC PRCS,662,Sickle cell anemia crisis,16,"Diseases and Disorders of Blood, Blood Forming Organs and Immunological Disorders",2,Moderate,Moderate,Medical,Private Health Insurance,,,,N,Y,47107.02,13196.89
New York City,Bronx,7000006,001169,Montefiore Medical Center - Henry & Lucy Moses Div,18 to 29,104,M,Other Race,Not Span/Hispanic,1,Elective,Home or Self Care,2017,061,Sickle cell anemia,000,NO PROC,662,Sickle cell anemia crisis,16,"Diseases and Disorders of Blood, Blood Forming Organs and Immunological Disorders",2,Moderate,Minor,Medical,Private Health Insurance,,,,N,N,13884.65,3454.54
New York City,Bronx,7000006,001169,Montefiore Medical Center - Henry & Lucy Moses Div,0 to 17,104,M,Other Race,Spanish/Hispanic,2,Emergency,Home or Self Care,2017,061,Sickle cell anemia,000,NO PROC,662,Sickle cell anemia crisis,16,"Diseases and Disorders of Blood, Blood Forming Organs and Immunological Disorders",1,Minor,Minor,Medical,Medicaid,,,,N,Y,26221.99,6096.05
New York City,Bronx,7000006,001169,Montefiore Medical Center - Henry & Lucy Moses Div,0 to 17,104,F,Black/African American,Not Span/Hispanic,2,Emergency,Home or Self Care,2017,061,Sickle cell anemia,000,NO PROC,662,Sickle cell anemia crisis,16,"Diseases and Disorders of Blood, Blood Forming Organs and Immunological Disorders",1,Minor,Minor,Medical,Medicaid,,,,N,Y,21865.39,5698.01
New York City,Bronx,7000006,003058,Montefiore Med Center - Jack D Weiler Hosp of A Einstein College Div,50 to 69,104,M,Black/African American,Not Span/Hispanic,10,Emergency,Home or Self Care,2017,061,Sickle cell anemia,222,BLOOD TRANSFUSION,662,Sickle cell anemia crisis,16,"Diseases and Disorders of Blood, Blood Forming Organs and Immunological Disorders",4,Extreme,Extreme,Medical,Private Health Insurance,,,,N,Y,157510.71,37941.19
New York City,Bronx,7000006,003058,Montefiore Med Center - Jack D Weiler Hosp of A Einstein College Div,30 to 49,104,M,Black/African American,Not Span/Hispanic,3,Emergency,Home or Self Care,2017,061,Sickle cell anemia,058,HEMODIALYSIS,662,Sickle cell anemia crisis,16,"Diseases and Disorders of Blood, Blood Forming Organs and Immunological Disorders",3,Major,Moderate,Medical,Medicare,Medicaid,,,N,Y,41857.00,8279.50
New York City,Kings,7002002,001324,Mount Sinai Brooklyn,30 to 49,112,F,Black/African American,Not Span/Hispanic,10,Emergency,Home or Self Care,2017,061,Sickle cell anemia,222,BLOOD TRANSFUSION,662,Sickle cell anemia crisis,16,"Diseases and Disorders of Blood, Blood Forming Organs and Immunological Disorders",2,Moderate,Minor,Medical,Medicaid,Medicaid,Self-Pay,,N,Y,72001.55,13592.48