Hospital Service Area,Hospital County,Operating Certificate Number,Permanent Facility Id,Facility Name,Age Group,Zip Code - 3 digits,Gender,Race,Ethnicity,Length of Stay,Type of Admission,Patient Disposition,Discharge Year,CCS Diagnosis Code,CCS Diagnosis Description,CCS Procedure Code,CCS Procedure Description,APR DRG Code,APR DRG Description,APR MDC Code,APR MDC Description,APR Severity of Illness Code,APR Severity of Illness Description,APR Risk of Mortality,APR Medical Surgical Description,Payment Typology 1,Payment Typology 2,Payment Typology 3,Birth Weight,Abortion Edit Indicator,Emergency Department Indicator,Total Charges,Total Costs
Long Island,Nassau,2908000,000511,NYU Winthrop Hospital,0 to 17,115,F,Black/African American,Not Span/Hispanic,6,Emergency,Home or Self Care,2017,061,Sickle cell anemia,222,BLOOD TRANSFUSION,662,Sickle cell anemia crisis,16,"Diseases and Disorders of Blood, Blood Forming Organs and Immunological Disorders",1,Minor,Minor,Medical,Medicaid,Medicaid,,,N,Y,50516.26,10901.72
Long Island,Nassau,2908000,000511,NYU Winthrop Hospital,18 to 29,110,M,Black/African American,Not Span/Hispanic,2,Emergency,Home or Self Care,2017,061,Sickle cell anemia,000,NO PROC,662,Sickle cell anemia crisis,16,"Diseases and Disorders of Blood, Blood Forming Organs and Immunological Disorders",1,Minor,Minor,Medical,Medicaid,Medicaid,,,N,Y,17112.85,4149.08
Long Island,Nassau,2908000,000511,NYU Winthrop Hospital,0 to 17,114,M,Black/African American,Not Span/Hispanic,3,Emergency,Home or Self Care,2017,061,Sickle cell anemia,000,NO PROC,662,Sickle cell anemia crisis,16,"Diseases and Disorders of Blood, Blood Forming Organs and Immunological Disorders",1,Minor,Minor,Medical,Blue Cross/Blue Shield,,,,N,Y,20156.68,5000.35
Long Island,Nassau,2908000,000511,NYU Winthrop Hospital,30 to 49,115,F,Black/African American,Not Span/Hispanic,3,Emergency,Home or Self Care,2017,061,Sickle cell anemia,000,NO PROC,662,Sickle cell anemia crisis,16,"Diseases and Disorders of Blood, Blood Forming Organs and Immunological Disorders",2,Moderate,Minor,Medical,Medicare,Medicare,Medicaid,,N,Y,35235.36,6572.51
Long Island,Nassau,2908000,000511,NYU Winthrop Hospital,18 to 29,115,F,Black/African American,Not Span/Hispanic,3,Emergency,Home or Self Care,2017,061,Sickle cell anemia,000,NO PROC,662,Sickle cell anemia crisis,16,"Diseases and Disorders of Blood, Blood Forming Organs and Immunological Disorders",1,Minor,Minor,Medical,Medicare,Medicare,Medicaid,,N,Y,26958.74,5734.67
Long Island,Nassau,2908000,000511,NYU Winthrop Hospital,30 to 49,115,M,White,Spanish/Hispanic,2,Emergency,Home or Self Care,2017,061,Sickle cell anemia,054,OT VASC CATH; NOT HEART,662,Sickle cell anemia crisis,16,"Diseases and Disorders of Blood, Blood Forming Organs and Immunological Disorders",2,Moderate,Minor,Medical,Medicaid,Medicaid,Medicaid,,N,Y,66485.99,11917.42
Long Island,Nassau,2908000,000511,NYU Winthrop Hospital,70 or Older,115,F,Black/African American,Not Span/Hispanic,2,Emergency,Home or Self Care,2017,061,Sickle cell anemia,000,NO PROC,662,Sickle cell anemia crisis,16,"Diseases and Disorders of Blood, Blood Forming Organs and Immunological Disorders",2,Moderate,Minor,Medical,Medicare,Medicare,,,N,N,19230.00,5848.72
Long Island,Nassau,2908000,000511,NYU Winthrop Hospital,50 to 69,115,F,Black/African American,Not Span/Hispanic,4,Emergency,Home or Self Care,2017,061,Sickle cell anemia,222,BLOOD TRANSFUSION,662,Sickle cell anemia crisis,16,"Diseases and Disorders of Blood, Blood Forming Organs and Immunological Disorders",2,Moderate,Minor,Medical,Medicare,Medicare,Blue Cross/Blue Shield,,N,Y,35631.13,8055.91
Long Island,Nassau,2908000,000511,NYU Winthrop Hospital,0 to 17,114,M,Black/African American,Not Span/Hispanic,4,Emergency,Home or Self Care,2017,061,Sickle cell anemia,222,BLOOD TRANSFUSION,662,Sickle cell anemia crisis,16,"Diseases and Disorders of Blood, Blood Forming Organs and Immunological Disorders",1,Minor,Minor,Medical,Blue Cross/Blue Shield,,,,N,Y,44342.77,9130.35
Long Island,Nassau,2908000,000511,NYU Winthrop Hospital,0 to 17,115,F,White,Spanish/Hispanic,2,Emergency,Home or Self Care,2017,061,Sickle cell anemia,000,NO PROC,662,Sickle cell anemia crisis,16,"Diseases and Disorders of Blood, Blood Forming Organs and Immunological Disorders",1,Minor,Minor,Medical,Blue Cross/Blue Shield,,,,N,Y,18748.80,4472.01
Long Island,Nassau,2908000,000511,NYU Winthrop Hospital,50 to 69,115,M,Black/African American,Not Span/Hispanic,1,Emergency,Home or Self Care,2017,061,Sickle cell anemia,222,BLOOD TRANSFUSION,662,Sickle cell anemia crisis,16,"Diseases and Disorders of Blood, Blood Forming Organs and Immunological Disorders",1,Minor,Minor,Medical,Medicare,Medicare,,,N,Y,23460.79,4606.75
Long Island,Nassau,2908000,000511,NYU Winthrop Hospital,0 to 17,113,M,Black/African American,Spanish/Hispanic,6,Urgent,Home or Self Care,2017,061,Sickle cell anemia,222,BLOOD TRANSFUSION,662,Sickle cell anemia crisis,16,"Diseases and Disorders of Blood, Blood Forming Organs and Immunological Disorders",2,Moderate,Moderate,Medical,Medicaid,Medicaid,,,N,N,40956.51,9139.66
Long Island,Nassau,2908000,000511,NYU Winthrop Hospital,0 to 17,115,F,White,Spanish/Hispanic,1,Emergency,Home or Self Care,2017,061,Sickle cell anemia,000,NO PROC,662,Sickle cell anemia crisis,16,"Diseases and Disorders of Blood, Blood Forming Organs and Immunological Disorders",1,Minor,Minor,Medical,Medicaid,Medicaid,,,N,Y,15770.39,2945.00
Long Island,Nassau,2908000,000511,NYU Winthrop Hospital,0 to 17,115,F,White,Spanish/Hispanic,2,Emergency,Home or Self Care,2017,061,Sickle cell anemia,222,BLOOD TRANSFUSION,662,Sickle cell anemia crisis,16,"Diseases and Disorders of Blood, Blood Forming Organs and Immunological Disorders",1,Minor,Minor,Medical,Medicaid,Medicaid,,,N,Y,32624.27,6294.14
Long Island,Nassau,2908000,000511,NYU Winthrop Hospital,30 to 49,OOS,M,Black/African American,Spanish/Hispanic,4,Emergency,Home or Self Care,2017,061,Sickle cell anemia,222,BLOOD TRANSFUSION,662,Sickle cell anemia crisis,16,"Diseases and Disorders of Blood, Blood Forming Organs and Immunological Disorders",1,Minor,Minor,Medical,Medicare,Medicare,,,N,Y,40096.83,8440.56
Long Island,Nassau,2908000,000511,NYU Winthrop Hospital,0 to 17,115,F,Black/African American,Not Span/Hispanic,3,Emergency,Home or Self Care,2017,061,Sickle cell anemia,000,NO PROC,662,Sickle cell anemia crisis,16,"Diseases and Disorders of Blood, Blood Forming Organs and Immunological Disorders",1,Minor,Minor,Medical,Private Health Insurance,,,,N,Y,22123.50,5649.66
Long Island,Nassau,2908000,000511,NYU Winthrop Hospital,18 to 29,110,M,Black/African American,Not Span/Hispanic,3,Emergency,Home or Self Care,2017,061,Sickle cell anemia,000,NO PROC,662,Sickle cell anemia crisis,16,"Diseases and Disorders of Blood, Blood Forming Organs and Immunological Disorders",1,Minor,Minor,Medical,Medicaid,Medicaid,,,N,Y,30963.99,6912.23
Long Island,Nassau,2908000,000511,NYU Winthrop Hospital,30 to 49,115,F,Black/African American,Not Span/Hispanic,21,Emergency,Home or Self Care,2017,061,Sickle cell anemia,222,BLOOD TRANSFUSION,662,Sickle cell anemia crisis,16,"Diseases and Disorders of Blood, Blood Forming Organs and Immunological Disorders",1,Minor,Minor,Medical,Medicare,Medicare,Medicaid,,N,Y,129611.79,29439.38
Long Island,Nassau,2908000,000511,NYU Winthrop Hospital,0 to 17,114,M,Black/African American,Not Span/Hispanic,6,Emergency,Home or Self Care,2017,061,Sickle cell anemia,000,NO PROC,662,Sickle cell anemia crisis,16,"Diseases and Disorders of Blood, Blood Forming Organs and Immunological Disorders",1,Minor,Minor,Medical,Blue Cross/Blue Shield,,,,N,Y,48130.89,10427.95
Long Island,Nassau,2908000,000511,NYU Winthrop Hospital,30 to 49,115,M,White,Spanish/Hispanic,5,Emergency,Home or Self Care,2017,061,Sickle cell anemia,222,BLOOD TRANSFUSION,662,Sickle cell anemia crisis,16,"Diseases and Disorders of Blood, Blood Forming Organs and Immunological Disorders",2,Moderate,Minor,Medical,Medicaid,Medicaid,,,N,Y,43841.64,9324.29
Long Island,Nassau,2908000,000511,NYU Winthrop Hospital,0 to 17,115,F,Black/African American,Not Span/Hispanic,3,Emergency,Home or Self Care,2017,061,Sickle cell anemia,000,NO PROC,662,Sickle cell anemia crisis,16,"Diseases and Disorders of Blood, Blood Forming Organs and Immunological Disorders",1,Minor,Minor,Medical,Medicaid,Medicaid,,,N,Y,26399.80,6256.52
Long Island,Nassau,2908000,000511,NYU Winthrop Hospital,0 to 17,115,F,Black/African American,Not Span/Hispanic,2,Emergency,Home or Self Care,2017,061,Sickle cell anemia,000,NO PROC,662,Sickle cell anemia crisis,16,"Diseases and Disorders of Blood, Blood Forming Organs and Immunological Disorders",2,Moderate,Minor,Medical,Medicaid,Medicaid,,,N,Y,17352.12,4282.82
Long Island,Nassau,2908000,000511,NYU Winthrop Hospital,30 to 49,115,F,White,Spanish/Hispanic,7,Emergency,Home or Self Care,2017,061,Sickle cell anemia,000,NO PROC,662,Sickle cell anemia crisis,16,"Diseases and Disorders of Blood, Blood Forming Organs and Immunological Disorders",1,Minor,Minor,Medical,Blue Cross/Blue Shield,,,,N,Y,54651.25,12106.88
Long Island,Nassau,2908000,000511,NYU Winthrop Hospital,18 to 29,104,F,Black/African American,Not Span/Hispanic,11,Emergency,Home w/ Home Health Services,2017,061,Sickle cell anemia,231,OTHER THERAPEUTIC PRCS,662,Sickle cell anemia crisis,16,"Diseases and Disorders of Blood, Blood Forming Organs and Immunological Disorders",3,Major,Major,Medical,Medicaid,Medicaid,,,N,Y,161143.04,32267.67
Long Island,Nassau,2908000,000511,NYU Winthrop Hospital,0 to 17,114,F,Black/African American,Not Span/Hispanic,3,Emergency,Home or Self Care,2017,061,Sickle cell anemia,222,BLOOD TRANSFUSION,662,Sickle cell anemia crisis,16,"Diseases and Disorders of Blood, Blood Forming Organs and Immunological Disorders",1,Minor,Minor,Medical,Private Health Insurance,,,,N,Y,32973.46,6650.94
Long Island,Nassau,2908000,000511,NYU Winthrop Hospital,18 to 29,117,M,Black/African American,Not Span/Hispanic,1,Emergency,Home or Self Care,2017,061,Sickle cell anemia,000,NO PROC,662,Sickle cell anemia crisis,16,"Diseases and Disorders of Blood, Blood Forming Organs and Immunological Disorders",2,Moderate,Minor,Medical,Medicaid,Medicaid,,,N,Y,21453.57,4443.04
Long Island,Nassau,2908000,000511,NYU Winthrop Hospital,18 to 29,115,M,Black/African American,Not Span/Hispanic,6,Emergency,Home or Self Care,2017,061,Sickle cell anemia,054,OT VASC CATH; NOT HEART,662,Sickle cell anemia crisis,16,"Diseases and Disorders of Blood, Blood Forming Organs and Immunological Disorders",3,Major,Major,Medical,Medicaid,Medicaid,,,N,Y,88197.92,15775.61
Long Island,Nassau,2908000,000511,NYU Winthrop Hospital,18 to 29,117,M,Black/African American,Not Span/Hispanic,1,Emergency,Home or Self Care,2017,061,Sickle cell anemia,000,NO PROC,662,Sickle cell anemia crisis,16,"Diseases and Disorders of Blood, Blood Forming Organs and Immunological Disorders",1,Minor,Minor,Medical,Medicaid,Medicaid,,,N,Y,15677.82,3290.80
Long Island,Nassau,2908000,000511,NYU Winthrop Hospital,18 to 29,115,F,Black/African American,Not Span/Hispanic,11,Emergency,Home or Self Care,2017,061,Sickle cell anemia,222,BLOOD TRANSFUSION,662,Sickle cell anemia crisis,16,"Diseases and Disorders of Blood, Blood Forming Organs and Immunological Disorders",1,Minor,Minor,Medical,Blue Cross/Blue Shield,Medicaid,,,N,Y,82592.87,18389.40
Long Island,Nassau,2908000,000511,NYU Winthrop Hospital,18 to 29,117,M,Black/African American,Not Span/Hispanic,3,Emergency,Home or Self Care,2017,061,Sickle cell anemia,222,BLOOD TRANSFUSION,662,Sickle cell anemia crisis,16,"Diseases and Disorders of Blood, Blood Forming Organs and Immunological Disorders",1,Minor,Minor,Medical,Medicaid,Medicaid,,,N,Y,31643.23,7198.46
Long Island,Nassau,2908000,000511,NYU Winthrop Hospital,18 to 29,110,M,Black/African American,Not Span/Hispanic,5,Emergency,Home or Self Care,2017,061,Sickle cell anemia,000,NO PROC,662,Sickle cell anemia crisis,16,"Diseases and Disorders of Blood, Blood Forming Organs and Immunological Disorders",1,Minor,Minor,Medical,Medicaid,Medicaid,,,N,Y,34667.04,8544.77
Long Island,Nassau,2908000,000511,NYU Winthrop Hospital,18 to 29,115,F,Black/African American,Not Span/Hispanic,2,Emergency,Home or Self Care,2017,061,Sickle cell anemia,222,BLOOD TRANSFUSION,662,Sickle cell anemia crisis,16,"Diseases and Disorders of Blood, Blood Forming Organs and Immunological Disorders",1,Minor,Minor,Medical,Medicaid,Medicaid,,,N,Y,26191.18,5875.27
Long Island,Nassau,2908000,000511,NYU Winthrop Hospital,0 to 17,115,F,Black/African American,Not Span/Hispanic,1,Emergency,Home or Self Care,2017,061,Sickle cell anemia,000,NO PROC,662,Sickle cell anemia crisis,16,"Diseases and Disorders of Blood, Blood Forming Organs and Immunological Disorders",2,Moderate,Minor,Medical,Medicaid,Medicaid,,,N,Y,23217.36,4197.62
Long Island,Nassau,2908000,000511,NYU Winthrop Hospital,0 to 17,113,M,Black/African American,Spanish/Hispanic,2,Urgent,Home or Self Care,2017,061,Sickle cell anemia,000,NO PROC,662,Sickle cell anemia crisis,16,"Diseases and Disorders of Blood, Blood Forming Organs and Immunological Disorders",1,Minor,Minor,Medical,Medicaid,Medicaid,,,N,N,6862.89,2075.00
Long Island,Nassau,2908000,000511,NYU Winthrop Hospital,18 to 29,104,F,Black/African American,Not Span/Hispanic,1,Emergency,Left Against Medical Advice,2017,061,Sickle cell anemia,000,NO PROC,662,Sickle cell anemia crisis,16,"Diseases and Disorders of Blood, Blood Forming Organs and Immunological Disorders",3,Major,Moderate,Medical,Medicaid,,,,N,Y,32584.51,5833.21
Long Island,Nassau,2908000,000511,NYU Winthrop Hospital,0 to 17,115,M,Black/African American,Not Span/Hispanic,1,Emergency,Home or Self Care,2017,061,Sickle cell anemia,000,NO PROC,662,Sickle cell anemia crisis,16,"Diseases and Disorders of Blood, Blood Forming Organs and Immunological Disorders",1,Minor,Minor,Medical,Medicaid,Medicaid,,,N,Y,25824.66,5478.73
Long Island,Nassau,2908000,000511,NYU Winthrop Hospital,30 to 49,115,F,White,Spanish/Hispanic,12,Emergency,Home or Self Care,2017,061,Sickle cell anemia,222,BLOOD TRANSFUSION,662,Sickle cell anemia crisis,16,"Diseases and Disorders of Blood, Blood Forming Organs and Immunological Disorders",3,Major,Moderate,Medical,Blue Cross/Blue Shield,,,,N,Y,96822.01,20516.91
Long Island,Nassau,2908000,000511,NYU Winthrop Hospital,0 to 17,115,F,Black/African American,Not Span/Hispanic,1,Emergency,Home or Self Care,2017,061,Sickle cell anemia,000,NO PROC,662,Sickle cell anemia crisis,16,"Diseases and Disorders of Blood, Blood Forming Organs and Immunological Disorders",1,Minor,Minor,Medical,Medicaid,Medicaid,,,N,Y,14606.18,3214.47
Long Island,Nassau,2908000,000511,NYU Winthrop Hospital,30 to 49,115,F,White,Spanish/Hispanic,7,Urgent,Home w/ Home Health Services,2017,061,Sickle cell anemia,000,NO PROC,662,Sickle cell anemia crisis,16,"Diseases and Disorders of Blood, Blood Forming Organs and Immunological Disorders",3,Major,Major,Medical,Blue Cross/Blue Shield,,,,N,N,62519.56,10988.75
Long Island,Nassau,2908000,000511,NYU Winthrop Hospital,18 to 29,115,F,Black/African American,Not Span/Hispanic,4,Emergency,Home or Self Care,2017,061,Sickle cell anemia,222,BLOOD TRANSFUSION,662,Sickle cell anemia crisis,16,"Diseases and Disorders of Blood, Blood Forming Organs and Immunological Disorders",2,Moderate,Minor,Medical,Blue Cross/Blue Shield,Medicaid,,,N,Y,43200.41,9260.23
Long Island,Nassau,2908000,000511,NYU Winthrop Hospital,0 to 17,115,F,White,Spanish/Hispanic,4,Emergency,Home or Self Care,2017,061,Sickle cell anemia,000,NO PROC,662,Sickle cell anemia crisis,16,"Diseases and Disorders of Blood, Blood Forming Organs and Immunological Disorders",1,Minor,Minor,Medical,Medicaid,,,,N,Y,30777.48,7680.38
Long Island,Nassau,2908000,000511,NYU Winthrop Hospital,0 to 17,114,M,Black/African American,Not Span/Hispanic,1,Emergency,Home or Self Care,2017,061,Sickle cell anemia,000,NO PROC,662,Sickle cell anemia crisis,16,"Diseases and Disorders of Blood, Blood Forming Organs and Immunological Disorders",2,Moderate,Minor,Medical,Blue Cross/Blue Shield,,,,N,Y,21061.55,4833.00
Long Island,Nassau,2908000,000511,NYU Winthrop Hospital,0 to 17,115,F,Black/African American,Not Span/Hispanic,2,Emergency,Home or Self Care,2017,061,Sickle cell anemia,000,NO PROC,662,Sickle cell anemia crisis,16,"Diseases and Disorders of Blood, Blood Forming Organs and Immunological Disorders",1,Minor,Minor,Medical,Medicaid,Medicaid,,,N,Y,24412.61,5508.64
Long Island,Nassau,2908000,000511,NYU Winthrop Hospital,0 to 17,117,F,Black/African American,Not Span/Hispanic,1,Urgent,Home or Self Care,2017,061,Sickle cell anemia,222,BLOOD TRANSFUSION,662,Sickle cell anemia crisis,16,"Diseases and Disorders of Blood, Blood Forming Organs and Immunological Disorders",2,Moderate,Minor,Medical,Private Health Insurance,,,,N,N,23523.08,4114.44
Long Island,Nassau,2908000,000511,NYU Winthrop Hospital,0 to 17,115,F,Black/African American,Not Span/Hispanic,4,Emergency,Home or Self Care,2017,061,Sickle cell anemia,222,BLOOD TRANSFUSION,662,Sickle cell anemia crisis,16,"Diseases and Disorders of Blood, Blood Forming Organs and Immunological Disorders",3,Major,Moderate,Medical,Medicaid,Medicaid,,,N,Y,67938.49,12479.69
Long Island,Nassau,2908000,000511,NYU Winthrop Hospital,30 to 49,100,F,Black/African American,Not Span/Hispanic,1,Emergency,Left Against Medical Advice,2017,061,Sickle cell anemia,000,NO PROC,662,Sickle cell anemia crisis,16,"Diseases and Disorders of Blood, Blood Forming Organs and Immunological Disorders",2,Moderate,Moderate,Medical,Medicaid,,,,N,Y,24373.73,5759.28
Long Island,Nassau,2908000,000511,NYU Winthrop Hospital,30 to 49,100,F,Black/African American,Not Span/Hispanic,1,Emergency,Left Against Medical Advice,2017,061,Sickle cell anemia,000,NO PROC,662,Sickle cell anemia crisis,16,"Diseases and Disorders of Blood, Blood Forming Organs and Immunological Disorders",3,Major,Moderate,Medical,Self-Pay,,,,N,Y,44241.77,8250.21
Long Island,Nassau,2908000,000511,NYU Winthrop Hospital,18 to 29,115,F,Black/African American,Not Span/Hispanic,1,Emergency,Home or Self Care,2017,061,Sickle cell anemia,000,NO PROC,662,Sickle cell anemia crisis,16,"Diseases and Disorders of Blood, Blood Forming Organs and Immunological Disorders",2,Moderate,Minor,Medical,Medicaid,Medicaid,,,N,Y,23139.18,4875.67
Long Island,Nassau,2908000,000511,NYU Winthrop Hospital,18 to 29,115,M,Black/African American,Not Span/Hispanic,3,Emergency,Home or Self Care,2017,061,Sickle cell anemia,000,NO PROC,662,Sickle cell anemia crisis,16,"Diseases and Disorders of Blood, Blood Forming Organs and Immunological Disorders",2,Moderate,Minor,Medical,Federal/State/Local/VA,,,,N,Y,47742.58,10158.80
Long Island,Nassau,2908000,000511,NYU Winthrop Hospital,0 to 17,115,F,Black/African American,Not Span/Hispanic,3,Emergency,Home or Self Care,2017,061,Sickle cell anemia,000,NO PROC,662,Sickle cell anemia crisis,16,"Diseases and Disorders of Blood, Blood Forming Organs and Immunological Disorders",1,Minor,Minor,Medical,Medicaid,Medicaid,,,N,Y,36975.72,8721.56
Long Island,Nassau,2908000,000511,NYU Winthrop Hospital,18 to 29,115,F,Black/African American,Not Span/Hispanic,3,Emergency,Home or Self Care,2017,061,Sickle cell anemia,000,NO PROC,662,Sickle cell anemia crisis,16,"Diseases and Disorders of Blood, Blood Forming Organs and Immunological Disorders",1,Minor,Minor,Medical,Medicaid,Medicaid,,,N,Y,23733.12,5773.78
Long Island,Nassau,2908000,000511,NYU Winthrop Hospital,18 to 29,117,F,Black/African American,Not Span/Hispanic,3,Emergency,Home or Self Care,2017,061,Sickle cell anemia,222,BLOOD TRANSFUSION,662,Sickle cell anemia crisis,16,"Diseases and Disorders of Blood, Blood Forming Organs and Immunological Disorders",2,Moderate,Moderate,Medical,Private Health Insurance,,,,N,Y,42369.87,8606.96
Long Island,Nassau,2908000,000511,NYU Winthrop Hospital,30 to 49,114,F,Black/African American,Not Span/Hispanic,3,Emergency,Home or Self Care,2017,061,Sickle cell anemia,222,BLOOD TRANSFUSION,662,Sickle cell anemia crisis,16,"Diseases and Disorders of Blood, Blood Forming Organs and Immunological Disorders",1,Minor,Minor,Medical,Medicaid,Medicaid,,,N,Y,41278.16,8662.43
Long Island,Nassau,2908000,000511,NYU Winthrop Hospital,50 to 69,110,F,Black/African American,Not Span/Hispanic,9,Emergency,Expired,2017,061,Sickle cell anemia,216,RESP INTUB/MECH VENTIL,662,Sickle cell anemia crisis,16,"Diseases and Disorders of Blood, Blood Forming Organs and Immunological Disorders",4,Extreme,Extreme,Medical,Medicaid,Medicaid,,,N,Y,508754.78,89449.79
Long Island,Nassau,2908000,000511,NYU Winthrop Hospital,18 to 29,115,F,Black/African American,Not Span/Hispanic,2,Emergency,Home or Self Care,2017,061,Sickle cell anemia,000,NO PROC,662,Sickle cell anemia crisis,16,"Diseases and Disorders of Blood, Blood Forming Organs and Immunological Disorders",1,Minor,Minor,Medical,Medicare,Medicaid,Medicare,,N,Y,30768.88,6383.80
Long Island,Nassau,2908000,000511,NYU Winthrop Hospital,0 to 17,114,M,Black/African American,Not Span/Hispanic,2,Emergency,Home or Self Care,2017,061,Sickle cell anemia,000,NO PROC,662,Sickle cell anemia crisis,16,"Diseases and Disorders of Blood, Blood Forming Organs and Immunological Disorders",1,Minor,Minor,Medical,Blue Cross/Blue Shield,,,,N,Y,25610.45,6056.78
Long Island,Nassau,2908000,000511,NYU Winthrop Hospital,0 to 17,115,F,Black/African American,Not Span/Hispanic,1,Emergency,Home or Self Care,2017,061,Sickle cell anemia,000,NO PROC,662,Sickle cell anemia crisis,16,"Diseases and Disorders of Blood, Blood Forming Organs and Immunological Disorders",2,Moderate,Minor,Medical,Medicaid,Medicaid,,,N,Y,18929.27,3577.78
Long Island,Nassau,2908000,000511,NYU Winthrop Hospital,30 to 49,115,M,Black/African American,Not Span/Hispanic,5,Emergency,Home or Self Care,2017,061,Sickle cell anemia,054,OT VASC CATH; NOT HEART,662,Sickle cell anemia crisis,16,"Diseases and Disorders of Blood, Blood Forming Organs and Immunological Disorders",3,Major,Major,Medical,Blue Cross/Blue Shield,,,,N,Y,130767.64,23262.20
Long Island,Nassau,2908000,000511,NYU Winthrop Hospital,0 to 17,114,F,Black/African American,Not Span/Hispanic,5,Emergency,Home or Self Care,2017,061,Sickle cell anemia,222,BLOOD TRANSFUSION,662,Sickle cell anemia crisis,16,"Diseases and Disorders of Blood, Blood Forming Organs and Immunological Disorders",1,Minor,Minor,Medical,Medicaid,Medicaid,,,N,Y,43030.38,9505.68
Long Island,Nassau,2908000,000511,NYU Winthrop Hospital,0 to 17,114,M,Black/African American,Not Span/Hispanic,3,Emergency,Home or Self Care,2017,061,Sickle cell anemia,000,NO PROC,662,Sickle cell anemia crisis,16,"Diseases and Disorders of Blood, Blood Forming Organs and Immunological Disorders",1,Minor,Minor,Medical,Blue Cross/Blue Shield,,,,N,Y,24879.30,6305.35
