Hospital Service Area,Hospital County,Operating Certificate Number,Permanent Facility Id,Facility Name,Age Group,Zip Code - 3 digits,Gender,Race,Ethnicity,Length of Stay,Type of Admission,Patient Disposition,Discharge Year,CCS Diagnosis Code,CCS Diagnosis Description,CCS Procedure Code,CCS Procedure Description,APR DRG Code,APR DRG Description,APR MDC Code,APR MDC Description,APR Severity of Illness Code,APR Severity of Illness Description,APR Risk of Mortality,APR Medical Surgical Description,Payment Typology 1,Payment Typology 2,Payment Typology 3,Birth Weight,Abortion Edit Indicator,Emergency Department Indicator,Total Charges,Total Costs
New York City,Kings,7002053,001304,NYU Langone Hospital-Brooklyn,30 to 49,112,F,Black/African American,Not Span/Hispanic,6,Emergency,Home or Self Care,2019,BLD005,SICKLE CELL TRAIT/ANEMIA,ADM001,TRANSFUSION OF BLOOD AND BLOOD PRODUCTS,662,SICKLE CELL ANEMIA CRISIS,16,DISEASES AND DISORDERS OF THE BLOOD AND BLOOD FORMING ORGANS AND IMMUNOLOGICAL DISORDERS,2,Moderate,Minor,Medical,Blue Cross/Blue Shield,,,,,true,83684.63,24059.82
New York City,Kings,7002053,001304,NYU Langone Hospital-Brooklyn,18 to 29,112,F,Black/African American,Not Span/Hispanic,1,Emergency,Home or Self Care,2019,BLD005,SICKLE CELL TRAIT/ANEMIA,,,662,SICKLE CELL ANEMIA CRISIS,16,DISEASES AND DISORDERS OF THE BLOOD AND BLOOD FORMING ORGANS AND IMMUNOLOGICAL DISORDERS,3,Major,Minor,Medical,Medicaid,,,,,true,14924.25,4489.23
New York City,Kings,7002053,001304,NYU Langone Hospital-Brooklyn,30 to 49,112,F,Other Race,Unknown,1,Emergency,Home or Self Care,2019,BLD005,SICKLE CELL TRAIT/ANEMIA,ADM001,TRANSFUSION OF BLOOD AND BLOOD PRODUCTS,662,SICKLE CELL ANEMIA CRISIS,16,DISEASES AND DISORDERS OF THE BLOOD AND BLOOD FORMING ORGANS AND IMMUNOLOGICAL DISORDERS,1,Minor,Minor,Medical,Private Health Insurance,,,,,true,24711.73,5625.39
New York City,Kings,7002053,001304,NYU Langone Hospital-Brooklyn,30 to 49,112,F,Other Race,Unknown,1,Emergency,Home or Self Care,2019,BLD005,SICKLE CELL TRAIT/ANEMIA,,,662,SICKLE CELL ANEMIA CRISIS,16,DISEASES AND DISORDERS OF THE BLOOD AND BLOOD FORMING ORGANS AND IMMUNOLOGICAL DISORDERS,1,Minor,Minor,Medical,Private Health Insurance,,,,,true,19171.1,5044.78
New York City,Kings,7002053,001304,NYU Langone Hospital-Brooklyn,30 to 49,112,M,Other Race,Spanish/Hispanic,5,Emergency,Home w/ Home Health Services,2019,BLD005,SICKLE CELL TRAIT/ANEMIA,ADM001,TRANSFUSION OF BLOOD AND BLOOD PRODUCTS,662,SICKLE CELL ANEMIA CRISIS,16,DISEASES AND DISORDERS OF THE BLOOD AND BLOOD FORMING ORGANS AND IMMUNOLOGICAL DISORDERS,3,Major,Minor,Medical,Medicaid,,,,,true,49964.14,18035.1
New York City,Kings,7002053,001304,NYU Langone Hospital-Brooklyn,18 to 29,112,F,Black/African American,Not Span/Hispanic,6,Emergency,Home or Self Care,2019,BLD005,SICKLE CELL TRAIT/ANEMIA,CAR024,VENOUS AND ARTERIAL CATHETER PLACEMENT,662,SICKLE CELL ANEMIA CRISIS,16,DISEASES AND DISORDERS OF THE BLOOD AND BLOOD FORMING ORGANS AND IMMUNOLOGICAL DISORDERS,2,Moderate,Minor,Medical,Private Health Insurance,,,,,true,84909.45,22432.76
New York City,Kings,7002053,001304,NYU Langone Hospital-Brooklyn,18 to 29,112,F,Black/African American,Not Span/Hispanic,2,Emergency,Home or Self Care,2019,BLD005,SICKLE CELL TRAIT/ANEMIA,ADM001,TRANSFUSION OF BLOOD AND BLOOD PRODUCTS,662,SICKLE CELL ANEMIA CRISIS,16,DISEASES AND DISORDERS OF THE BLOOD AND BLOOD FORMING ORGANS AND IMMUNOLOGICAL DISORDERS,2,Moderate,Minor,Medical,Private Health Insurance,,,,,true,30555.57,8543.97
New York City,Kings,7002053,001304,NYU Langone Hospital-Brooklyn,18 to 29,112,F,Black/African American,Not Span/Hispanic,3,Emergency,Home or Self Care,2019,BLD005,SICKLE CELL TRAIT/ANEMIA,ADM001,TRANSFUSION OF BLOOD AND BLOOD PRODUCTS,662,SICKLE CELL ANEMIA CRISIS,16,DISEASES AND DISORDERS OF THE BLOOD AND BLOOD FORMING ORGANS AND IMMUNOLOGICAL DISORDERS,2,Moderate,Minor,Medical,Medicaid,,,,,true,46543.14,13015.79
New York City,Kings,7002053,001304,NYU Langone Hospital-Brooklyn,18 to 29,112,F,Black/African American,Not Span/Hispanic,1,Emergency,Left Against Medical Advice,2019,BLD005,SICKLE CELL TRAIT/ANEMIA,,,662,SICKLE CELL ANEMIA CRISIS,16,DISEASES AND DISORDERS OF THE BLOOD AND BLOOD FORMING ORGANS AND IMMUNOLOGICAL DISORDERS,2,Moderate,Minor,Medical,Medicaid,,,,,true,18785.62,5010.29
New York City,Kings,7002053,001304,NYU Langone Hospital-Brooklyn,18 to 29,112,M,Other Race,Not Span/Hispanic,7,Emergency,Home or Self Care,2019,BLD005,SICKLE CELL TRAIT/ANEMIA,,,662,SICKLE CELL ANEMIA CRISIS,16,DISEASES AND DISORDERS OF THE BLOOD AND BLOOD FORMING ORGANS AND IMMUNOLOGICAL DISORDERS,4,Extreme,Major,Medical,Medicaid,,,,,true,83231.44,26096.97
New York City,Kings,7002053,001304,NYU Langone Hospital-Brooklyn,30 to 49,114,F,Black/African American,Not Span/Hispanic,1,Emergency,Left Against Medical Advice,2019,BLD005,SICKLE CELL TRAIT/ANEMIA,,,662,SICKLE CELL ANEMIA CRISIS,16,DISEASES AND DISORDERS OF THE BLOOD AND BLOOD FORMING ORGANS AND IMMUNOLOGICAL DISORDERS,2,Moderate,Minor,Medical,Medicaid,,,,,true,19121.68,5004.68
New York City,Kings,7002053,001304,NYU Langone Hospital-Brooklyn,30 to 49,112,F,Black/African American,Not Span/Hispanic,9,Emergency,Home or Self Care,2019,BLD005,SICKLE CELL TRAIT/ANEMIA,ADM010,VACCINATIONS,662,SICKLE CELL ANEMIA CRISIS,16,DISEASES AND DISORDERS OF THE BLOOD AND BLOOD FORMING ORGANS AND IMMUNOLOGICAL DISORDERS,4,Extreme,Major,Medical,Medicare,,,,,true,88442.24,31987.15
