Hospital Service Area,Hospital County,Operating Certificate Number,Permanent Facility Id,Facility Name,Age Group,Zip Code - 3 digits,Gender,Race,Ethnicity,Length of Stay,Type of Admission,Patient Disposition,Discharge Year,CCS Diagnosis Code,CCS Diagnosis Description,CCS Procedure Code,CCS Procedure Description,APR DRG Code,APR DRG Description,APR MDC Code,APR MDC Description,APR Severity of Illness Code,APR Severity of Illness Description,APR Risk of Mortality,APR Medical Surgical Description,Payment Typology 1,Payment Typology 2,Payment Typology 3,Birth Weight,Abortion Edit Indicator,Emergency Department Indicator,Total Charges,Total Costs
Long Island,Nassau,2908000,000511,NYU Langone Hospital-Long Island,18 to 29,110,M,Black/African American,Not Span/Hispanic,2,Emergency,Home or Self Care,2019,BLD005,SICKLE CELL TRAIT/ANEMIA,,,662,SICKLE CELL ANEMIA CRISIS,16,DISEASES AND DISORDERS OF THE BLOOD AND BLOOD FORMING ORGANS AND IMMUNOLOGICAL DISORDERS,2,Moderate,Minor,Medical,Private Health Insurance,Medicaid,,,,true,26207.92,5124.46
Long Island,Nassau,2908000,000511,NYU Langone Hospital-Long Island,30 to 49,115,M,Black/African American,Not Span/Hispanic,1,Emergency,Left Against Medical Advice,2019,BLD005,SICKLE CELL TRAIT/ANEMIA,,,662,SICKLE CELL ANEMIA CRISIS,16,DISEASES AND DISORDERS OF THE BLOOD AND BLOOD FORMING ORGANS AND IMMUNOLOGICAL DISORDERS,2,Moderate,Minor,Medical,Medicaid,Medicaid,,,,true,30592.95,4694.42
Long Island,Nassau,2908000,000511,NYU Langone Hospital-Long Island,0 to 17,114,F,Black/African American,Not Span/Hispanic,3,Urgent,Home or Self Care,2019,BLD005,SICKLE CELL TRAIT/ANEMIA,ADM001,TRANSFUSION OF BLOOD AND BLOOD PRODUCTS,662,SICKLE CELL ANEMIA CRISIS,16,DISEASES AND DISORDERS OF THE BLOOD AND BLOOD FORMING ORGANS AND IMMUNOLOGICAL DISORDERS,1,Minor,Minor,Medical,Private Health Insurance,Private Health Insurance,,,,false,38796.25,7169.76
Long Island,Nassau,2908000,000511,NYU Langone Hospital-Long Island,0 to 17,,M,Black/African American,Spanish/Hispanic,8,Emergency,Home or Self Care,2019,BLD005,SICKLE CELL TRAIT/ANEMIA,ADM001,TRANSFUSION OF BLOOD AND BLOOD PRODUCTS,662,SICKLE CELL ANEMIA CRISIS,16,DISEASES AND DISORDERS OF THE BLOOD AND BLOOD FORMING ORGANS AND IMMUNOLOGICAL DISORDERS,4,Extreme,Major,Medical,Private Health Insurance,,,,,true,129271.65,23502.18
Long Island,Nassau,2908000,000511,NYU Langone Hospital-Long Island,0 to 17,115,F,Black/African American,Not Span/Hispanic,3,Emergency,Home or Self Care,2019,BLD005,SICKLE CELL TRAIT/ANEMIA,,,662,SICKLE CELL ANEMIA CRISIS,16,DISEASES AND DISORDERS OF THE BLOOD AND BLOOD FORMING ORGANS AND IMMUNOLOGICAL DISORDERS,2,Moderate,Minor,Medical,Medicaid,Medicaid,,,,true,29254.11,6296.07
Long Island,Nassau,2908000,000511,NYU Langone Hospital-Long Island,50 to 69,114,M,Black/African American,Not Span/Hispanic,3,Emergency,Home or Self Care,2019,BLD005,SICKLE CELL TRAIT/ANEMIA,ADM001,TRANSFUSION OF BLOOD AND BLOOD PRODUCTS,662,SICKLE CELL ANEMIA CRISIS,16,DISEASES AND DISORDERS OF THE BLOOD AND BLOOD FORMING ORGANS AND IMMUNOLOGICAL DISORDERS,2,Moderate,Moderate,Medical,Medicare,Medicare,Medicaid,,,true,49780.65,8543.95
Long Island,Nassau,2908000,000511,NYU Langone Hospital-Long Island,0 to 17,115,F,Black/African American,Not Span/Hispanic,7,Emergency,Home or Self Care,2019,BLD005,SICKLE CELL TRAIT/ANEMIA,ADM001,TRANSFUSION OF BLOOD AND BLOOD PRODUCTS,662,SICKLE CELL ANEMIA CRISIS,16,DISEASES AND DISORDERS OF THE BLOOD AND BLOOD FORMING ORGANS AND IMMUNOLOGICAL DISORDERS,2,Moderate,Minor,Medical,Medicaid,Medicaid,,,,true,75043.32,14733.03
Long Island,Nassau,2908000,000511,NYU Langone Hospital-Long Island,18 to 29,115,M,Black/African American,Not Span/Hispanic,2,Emergency,Home or Self Care,2019,BLD005,SICKLE CELL TRAIT/ANEMIA,ADM001,TRANSFUSION OF BLOOD AND BLOOD PRODUCTS,662,SICKLE CELL ANEMIA CRISIS,16,DISEASES AND DISORDERS OF THE BLOOD AND BLOOD FORMING ORGANS AND IMMUNOLOGICAL DISORDERS,1,Minor,Minor,Medical,Medicaid,Medicaid,,,,true,37475.21,6480.36
Long Island,Nassau,2908000,000511,NYU Langone Hospital-Long Island,0 to 17,115,M,Black/African American,Not Span/Hispanic,5,Emergency,Home or Self Care,2019,BLD005,SICKLE CELL TRAIT/ANEMIA,,,662,SICKLE CELL ANEMIA CRISIS,16,DISEASES AND DISORDERS OF THE BLOOD AND BLOOD FORMING ORGANS AND IMMUNOLOGICAL DISORDERS,2,Moderate,Minor,Medical,Private Health Insurance,Blue Cross/Blue Shield,,,,true,57391.03,12056.41
Long Island,Nassau,2908000,000511,NYU Langone Hospital-Long Island,0 to 17,114,M,Black/African American,Not Span/Hispanic,3,Emergency,Home or Self Care,2019,BLD005,SICKLE CELL TRAIT/ANEMIA,,,662,SICKLE CELL ANEMIA CRISIS,16,DISEASES AND DISORDERS OF THE BLOOD AND BLOOD FORMING ORGANS AND IMMUNOLOGICAL DISORDERS,2,Moderate,Minor,Medical,Blue Cross/Blue Shield,,,,,true,33706.28,6902.98
Long Island,Nassau,2908000,000511,NYU Langone Hospital-Long Island,30 to 49,115,M,Black/African American,Not Span/Hispanic,1,Emergency,Left Against Medical Advice,2019,BLD005,SICKLE CELL TRAIT/ANEMIA,ADM001,TRANSFUSION OF BLOOD AND BLOOD PRODUCTS,662,SICKLE CELL ANEMIA CRISIS,16,DISEASES AND DISORDERS OF THE BLOOD AND BLOOD FORMING ORGANS AND IMMUNOLOGICAL DISORDERS,3,Major,Moderate,Medical,Medicaid,Medicaid,,,,true,32185.54,4445.7
Long Island,Nassau,2908000,000511,NYU Langone Hospital-Long Island,30 to 49,115,M,Black/African American,Not Span/Hispanic,1,Emergency,Home or Self Care,2019,BLD005,SICKLE CELL TRAIT/ANEMIA,,,662,SICKLE CELL ANEMIA CRISIS,16,DISEASES AND DISORDERS OF THE BLOOD AND BLOOD FORMING ORGANS AND IMMUNOLOGICAL DISORDERS,2,Moderate,Moderate,Medical,Medicaid,Medicaid,,,,true,17803.99,2882.24
Long Island,Nassau,2908000,000511,NYU Langone Hospital-Long Island,0 to 17,115,F,Black/African American,Not Span/Hispanic,3,Emergency,Home or Self Care,2019,BLD005,SICKLE CELL TRAIT/ANEMIA,ADM001,TRANSFUSION OF BLOOD AND BLOOD PRODUCTS,662,SICKLE CELL ANEMIA CRISIS,16,DISEASES AND DISORDERS OF THE BLOOD AND BLOOD FORMING ORGANS AND IMMUNOLOGICAL DISORDERS,2,Moderate,Minor,Medical,Medicaid,Medicaid,,,,true,45467.75,8097.36
Long Island,Nassau,2908000,000511,NYU Langone Hospital-Long Island,18 to 29,110,M,Black/African American,Not Span/Hispanic,4,Emergency,Home or Self Care,2019,BLD005,SICKLE CELL TRAIT/ANEMIA,,,662,SICKLE CELL ANEMIA CRISIS,16,DISEASES AND DISORDERS OF THE BLOOD AND BLOOD FORMING ORGANS AND IMMUNOLOGICAL DISORDERS,1,Minor,Minor,Medical,Private Health Insurance,Medicaid,,,,true,38798.3,8602.47
Long Island,Nassau,2908000,000511,NYU Langone Hospital-Long Island,30 to 49,117,M,White,Spanish/Hispanic,3,Emergency,Home or Self Care,2019,BLD005,SICKLE CELL TRAIT/ANEMIA,,,662,SICKLE CELL ANEMIA CRISIS,16,DISEASES AND DISORDERS OF THE BLOOD AND BLOOD FORMING ORGANS AND IMMUNOLOGICAL DISORDERS,2,Moderate,Minor,Medical,Medicaid,Medicaid,,,,true,46996.57,8368.27
Long Island,Nassau,2908000,000511,NYU Langone Hospital-Long Island,18 to 29,115,F,Black/African American,Not Span/Hispanic,5,Emergency,Home or Self Care,2019,BLD005,SICKLE CELL TRAIT/ANEMIA,,,662,SICKLE CELL ANEMIA CRISIS,16,DISEASES AND DISORDERS OF THE BLOOD AND BLOOD FORMING ORGANS AND IMMUNOLOGICAL DISORDERS,2,Moderate,Minor,Medical,Federal/State/Local/VA,,,,,true,67096.67,12100.99
Long Island,Nassau,2908000,000511,NYU Langone Hospital-Long Island,0 to 17,117,F,Other Race,Spanish/Hispanic,1,Urgent,Home or Self Care,2019,BLD005,SICKLE CELL TRAIT/ANEMIA,,,662,SICKLE CELL ANEMIA CRISIS,16,DISEASES AND DISORDERS OF THE BLOOD AND BLOOD FORMING ORGANS AND IMMUNOLOGICAL DISORDERS,1,Minor,Minor,Medical,Private Health Insurance,,,,,false,5890.96,1669.03
Long Island,Nassau,2908000,000511,NYU Langone Hospital-Long Island,18 to 29,115,M,Black/African American,Not Span/Hispanic,4,Emergency,Home or Self Care,2019,BLD005,SICKLE CELL TRAIT/ANEMIA,,,662,SICKLE CELL ANEMIA CRISIS,16,DISEASES AND DISORDERS OF THE BLOOD AND BLOOD FORMING ORGANS AND IMMUNOLOGICAL DISORDERS,1,Minor,Minor,Medical,Medicaid,Medicaid,,,,true,51157.7,9920.42
Long Island,Nassau,2908000,000511,NYU Langone Hospital-Long Island,0 to 17,115,M,Black/African American,Not Span/Hispanic,6,Emergency,Home or Self Care,2019,BLD005,SICKLE CELL TRAIT/ANEMIA,ADM001,TRANSFUSION OF BLOOD AND BLOOD PRODUCTS,662,SICKLE CELL ANEMIA CRISIS,16,DISEASES AND DISORDERS OF THE BLOOD AND BLOOD FORMING ORGANS AND IMMUNOLOGICAL DISORDERS,4,Extreme,Moderate,Medical,Medicaid,,,,,true,123025.59,20792.79
Long Island,Nassau,2908000,000511,NYU Langone Hospital-Long Island,18 to 29,117,F,Black/African American,Not Span/Hispanic,1,Emergency,Home or Self Care,2019,BLD005,SICKLE CELL TRAIT/ANEMIA,,,662,SICKLE CELL ANEMIA CRISIS,16,DISEASES AND DISORDERS OF THE BLOOD AND BLOOD FORMING ORGANS AND IMMUNOLOGICAL DISORDERS,1,Minor,Minor,Medical,Medicaid,Medicaid,,,,true,22164.21,3256.76
Long Island,Nassau,2908000,000511,NYU Langone Hospital-Long Island,18 to 29,110,M,Black/African American,Not Span/Hispanic,5,Emergency,Home or Self Care,2019,BLD005,SICKLE CELL TRAIT/ANEMIA,,,662,SICKLE CELL ANEMIA CRISIS,16,DISEASES AND DISORDERS OF THE BLOOD AND BLOOD FORMING ORGANS AND IMMUNOLOGICAL DISORDERS,1,Minor,Minor,Medical,Private Health Insurance,Medicaid,,,,true,40431.11,9621.44
Long Island,Nassau,2908000,000511,NYU Langone Hospital-Long Island,0 to 17,115,M,Black/African American,Not Span/Hispanic,22,Emergency,Home or Self Care,2019,BLD005,SICKLE CELL TRAIT/ANEMIA,ADM001,TRANSFUSION OF BLOOD AND BLOOD PRODUCTS,662,SICKLE CELL ANEMIA CRISIS,16,DISEASES AND DISORDERS OF THE BLOOD AND BLOOD FORMING ORGANS AND IMMUNOLOGICAL DISORDERS,3,Major,Moderate,Medical,Medicaid,Medicaid,,,,true,245698.89,47838.36
Long Island,Nassau,2908000,000511,NYU Langone Hospital-Long Island,18 to 29,117,F,Black/African American,Not Span/Hispanic,1,Emergency,Home or Self Care,2019,BLD005,SICKLE CELL TRAIT/ANEMIA,ADM001,TRANSFUSION OF BLOOD AND BLOOD PRODUCTS,662,SICKLE CELL ANEMIA CRISIS,16,DISEASES AND DISORDERS OF THE BLOOD AND BLOOD FORMING ORGANS AND IMMUNOLOGICAL DISORDERS,2,Moderate,Minor,Medical,Medicaid,Medicaid,,,,true,29235.5,4683.57
Long Island,Nassau,2908000,000511,NYU Langone Hospital-Long Island,0 to 17,115,F,Black/African American,Not Span/Hispanic,16,Emergency,Home w/ Home Health Services,2019,BLD005,SICKLE CELL TRAIT/ANEMIA,ADM001,TRANSFUSION OF BLOOD AND BLOOD PRODUCTS,662,SICKLE CELL ANEMIA CRISIS,16,DISEASES AND DISORDERS OF THE BLOOD AND BLOOD FORMING ORGANS AND IMMUNOLOGICAL DISORDERS,2,Moderate,Minor,Medical,Medicaid,Medicaid,,,,true,131478.96,31525.13
Long Island,Nassau,2908000,000511,NYU Langone Hospital-Long Island,18 to 29,115,M,Black/African American,Not Span/Hispanic,2,Emergency,Home or Self Care,2019,BLD005,SICKLE CELL TRAIT/ANEMIA,,,662,SICKLE CELL ANEMIA CRISIS,16,DISEASES AND DISORDERS OF THE BLOOD AND BLOOD FORMING ORGANS AND IMMUNOLOGICAL DISORDERS,1,Minor,Minor,Medical,Medicaid,Medicaid,,,,true,32847.37,5718.37
Long Island,Nassau,2908000,000511,NYU Langone Hospital-Long Island,0 to 17,114,M,Black/African American,Not Span/Hispanic,3,Emergency,Home or Self Care,2019,BLD005,SICKLE CELL TRAIT/ANEMIA,,,662,SICKLE CELL ANEMIA CRISIS,16,DISEASES AND DISORDERS OF THE BLOOD AND BLOOD FORMING ORGANS AND IMMUNOLOGICAL DISORDERS,1,Minor,Minor,Medical,Blue Cross/Blue Shield,,,,,true,38103.45,7628.53
Long Island,Nassau,2908000,000511,NYU Langone Hospital-Long Island,18 to 29,110,M,Black/African American,Not Span/Hispanic,3,Emergency,Home or Self Care,2019,BLD005,SICKLE CELL TRAIT/ANEMIA,,,662,SICKLE CELL ANEMIA CRISIS,16,DISEASES AND DISORDERS OF THE BLOOD AND BLOOD FORMING ORGANS AND IMMUNOLOGICAL DISORDERS,1,Minor,Minor,Medical,Private Health Insurance,Medicaid,,,,true,33438.38,6862.4
Long Island,Nassau,2908000,000511,NYU Langone Hospital-Long Island,30 to 49,117,M,White,Spanish/Hispanic,2,Emergency,Home or Self Care,2019,BLD005,SICKLE CELL TRAIT/ANEMIA,,,662,SICKLE CELL ANEMIA CRISIS,16,DISEASES AND DISORDERS OF THE BLOOD AND BLOOD FORMING ORGANS AND IMMUNOLOGICAL DISORDERS,2,Moderate,Moderate,Medical,Medicaid,Medicaid,,,,true,33754.36,6010.94
Long Island,Nassau,2908000,000511,NYU Langone Hospital-Long Island,50 to 69,110,F,Black/African American,Not Span/Hispanic,5,Emergency,Home or Self Care,2019,BLD005,SICKLE CELL TRAIT/ANEMIA,ADM001,TRANSFUSION OF BLOOD AND BLOOD PRODUCTS,662,SICKLE CELL ANEMIA CRISIS,16,DISEASES AND DISORDERS OF THE BLOOD AND BLOOD FORMING ORGANS AND IMMUNOLOGICAL DISORDERS,2,Moderate,Moderate,Medical,Medicaid,Medicaid,,,,true,72248.63,12844.48
Long Island,Nassau,2908000,000511,NYU Langone Hospital-Long Island,50 to 69,114,M,Black/African American,Not Span/Hispanic,7,Emergency,Home or Self Care,2019,BLD005,SICKLE CELL TRAIT/ANEMIA,,,662,SICKLE CELL ANEMIA CRISIS,16,DISEASES AND DISORDERS OF THE BLOOD AND BLOOD FORMING ORGANS AND IMMUNOLOGICAL DISORDERS,3,Major,Major,Medical,Medicare,Medicaid,Medicare,,,true,103192.35,18641.69
Long Island,Nassau,2908000,000511,NYU Langone Hospital-Long Island,30 to 49,115,M,White,Not Span/Hispanic,1,Emergency,Home or Self Care,2019,BLD005,SICKLE CELL TRAIT/ANEMIA,,,662,SICKLE CELL ANEMIA CRISIS,16,DISEASES AND DISORDERS OF THE BLOOD AND BLOOD FORMING ORGANS AND IMMUNOLOGICAL DISORDERS,2,Moderate,Minor,Medical,Private Health Insurance,,,,,true,36128.93,4005.94
Long Island,Nassau,2908000,000511,NYU Langone Hospital-Long Island,50 to 69,115,M,Black/African American,Not Span/Hispanic,2,Emergency,Home or Self Care,2019,BLD005,SICKLE CELL TRAIT/ANEMIA,ADM001,TRANSFUSION OF BLOOD AND BLOOD PRODUCTS,662,SICKLE CELL ANEMIA CRISIS,16,DISEASES AND DISORDERS OF THE BLOOD AND BLOOD FORMING ORGANS AND IMMUNOLOGICAL DISORDERS,3,Major,Minor,Medical,Medicare,Medicare,Medicaid,,,true,41091.71,6123.61
Long Island,Nassau,2908000,000511,NYU Langone Hospital-Long Island,0 to 17,114,M,Black/African American,Not Span/Hispanic,4,Emergency,Home or Self Care,2019,BLD005,SICKLE CELL TRAIT/ANEMIA,ADM001,TRANSFUSION OF BLOOD AND BLOOD PRODUCTS,662,SICKLE CELL ANEMIA CRISIS,16,DISEASES AND DISORDERS OF THE BLOOD AND BLOOD FORMING ORGANS AND IMMUNOLOGICAL DISORDERS,1,Minor,Minor,Medical,Blue Cross/Blue Shield,,,,,true,55106.7,10303.44
Long Island,Nassau,2908000,000511,NYU Langone Hospital-Long Island,30 to 49,115,F,Black/African American,Not Span/Hispanic,12,Emergency,Home or Self Care,2019,BLD005,SICKLE CELL TRAIT/ANEMIA,ADM001,TRANSFUSION OF BLOOD AND BLOOD PRODUCTS,662,SICKLE CELL ANEMIA CRISIS,16,DISEASES AND DISORDERS OF THE BLOOD AND BLOOD FORMING ORGANS AND IMMUNOLOGICAL DISORDERS,3,Major,Minor,Medical,Medicare,Medicare,Medicaid,,,true,117079.46,24522.56
Long Island,Nassau,2908000,000511,NYU Langone Hospital-Long Island,30 to 49,117,F,Black/African American,Not Span/Hispanic,7,Emergency,Home or Self Care,2019,BLD005,SICKLE CELL TRAIT/ANEMIA,ADM001,TRANSFUSION OF BLOOD AND BLOOD PRODUCTS,662,SICKLE CELL ANEMIA CRISIS,16,DISEASES AND DISORDERS OF THE BLOOD AND BLOOD FORMING ORGANS AND IMMUNOLOGICAL DISORDERS,3,Major,Moderate,Medical,Medicare,Medicare,,,,true,127025.23,20988.91
Long Island,Nassau,2908000,000511,NYU Langone Hospital-Long Island,0 to 17,OOS,F,Black/African American,Not Span/Hispanic,2,Urgent,Home or Self Care,2019,BLD005,SICKLE CELL TRAIT/ANEMIA,ADM001,TRANSFUSION OF BLOOD AND BLOOD PRODUCTS,662,SICKLE CELL ANEMIA CRISIS,16,DISEASES AND DISORDERS OF THE BLOOD AND BLOOD FORMING ORGANS AND IMMUNOLOGICAL DISORDERS,2,Moderate,Minor,Medical,Private Health Insurance,Private Health Insurance,,,,false,48108.35,7872
Long Island,Nassau,2908000,000511,NYU Langone Hospital-Long Island,18 to 29,115,F,Black/African American,Not Span/Hispanic,4,Emergency,Home or Self Care,2019,BLD005,SICKLE CELL TRAIT/ANEMIA,ADM001,TRANSFUSION OF BLOOD AND BLOOD PRODUCTS,662,SICKLE CELL ANEMIA CRISIS,16,DISEASES AND DISORDERS OF THE BLOOD AND BLOOD FORMING ORGANS AND IMMUNOLOGICAL DISORDERS,2,Moderate,Minor,Medical,Medicaid,Medicaid,,,,true,72332.76,11962.25
Long Island,Nassau,2908000,000511,NYU Langone Hospital-Long Island,30 to 49,117,F,Black/African American,Not Span/Hispanic,7,Emergency,Home or Self Care,2019,BLD005,SICKLE CELL TRAIT/ANEMIA,ADM001,TRANSFUSION OF BLOOD AND BLOOD PRODUCTS,662,SICKLE CELL ANEMIA CRISIS,16,DISEASES AND DISORDERS OF THE BLOOD AND BLOOD FORMING ORGANS AND IMMUNOLOGICAL DISORDERS,4,Extreme,Moderate,Medical,Blue Cross/Blue Shield,,,,,true,82306.91,15020.8
Long Island,Nassau,2908000,000511,NYU Langone Hospital-Long Island,50 to 69,115,M,Black/African American,Not Span/Hispanic,2,Emergency,Home or Self Care,2019,BLD005,SICKLE CELL TRAIT/ANEMIA,ADM001,TRANSFUSION OF BLOOD AND BLOOD PRODUCTS,662,SICKLE CELL ANEMIA CRISIS,16,DISEASES AND DISORDERS OF THE BLOOD AND BLOOD FORMING ORGANS AND IMMUNOLOGICAL DISORDERS,3,Major,Moderate,Medical,Medicare,Medicare,,,,true,35935.63,6251.93
Long Island,Nassau,2908000,000511,NYU Langone Hospital-Long Island,0 to 17,114,M,Black/African American,Not Span/Hispanic,2,Emergency,Home or Self Care,2019,BLD005,SICKLE CELL TRAIT/ANEMIA,,,662,SICKLE CELL ANEMIA CRISIS,16,DISEASES AND DISORDERS OF THE BLOOD AND BLOOD FORMING ORGANS AND IMMUNOLOGICAL DISORDERS,1,Minor,Minor,Medical,Blue Cross/Blue Shield,,,,,true,26761.21,5046.07
Long Island,Nassau,2908000,000511,NYU Langone Hospital-Long Island,30 to 49,115,F,Black/African American,Not Span/Hispanic,6,Emergency,Home or Self Care,2019,BLD005,SICKLE CELL TRAIT/ANEMIA,ADM001,TRANSFUSION OF BLOOD AND BLOOD PRODUCTS,662,SICKLE CELL ANEMIA CRISIS,16,DISEASES AND DISORDERS OF THE BLOOD AND BLOOD FORMING ORGANS AND IMMUNOLOGICAL DISORDERS,2,Moderate,Minor,Medical,Medicare,Medicare,Medicaid,,,true,62597.97,13073.54
Long Island,Nassau,2908000,000511,NYU Langone Hospital-Long Island,30 to 49,117,M,Other Race,Spanish/Hispanic,6,Emergency,Home or Self Care,2019,BLD005,SICKLE CELL TRAIT/ANEMIA,,,662,SICKLE CELL ANEMIA CRISIS,16,DISEASES AND DISORDERS OF THE BLOOD AND BLOOD FORMING ORGANS AND IMMUNOLOGICAL DISORDERS,3,Major,Moderate,Medical,Medicaid,,,,,true,97536.02,16927.68
Long Island,Nassau,2908000,000511,NYU Langone Hospital-Long Island,18 to 29,112,F,Other Race,Spanish/Hispanic,3,Elective,Home or Self Care,2019,BLD005,SICKLE CELL TRAIT/ANEMIA,,,662,SICKLE CELL ANEMIA CRISIS,16,DISEASES AND DISORDERS OF THE BLOOD AND BLOOD FORMING ORGANS AND IMMUNOLOGICAL DISORDERS,1,Minor,Minor,Medical,Medicaid,,,,,true,34798.4,6877.58
Long Island,Nassau,2908000,000511,NYU Langone Hospital-Long Island,0 to 17,115,F,Black/African American,Not Span/Hispanic,5,Emergency,Home w/ Home Health Services,2019,BLD005,SICKLE CELL TRAIT/ANEMIA,ADM001,TRANSFUSION OF BLOOD AND BLOOD PRODUCTS,662,SICKLE CELL ANEMIA CRISIS,16,DISEASES AND DISORDERS OF THE BLOOD AND BLOOD FORMING ORGANS AND IMMUNOLOGICAL DISORDERS,2,Moderate,Minor,Medical,Medicaid,,,,,true,61394.21,8334.73
Long Island,Nassau,2908000,000511,NYU Langone Hospital-Long Island,0 to 17,115,F,Black/African American,Not Span/Hispanic,5,Emergency,Home w/ Home Health Services,2019,BLD005,SICKLE CELL TRAIT/ANEMIA,ADM001,TRANSFUSION OF BLOOD AND BLOOD PRODUCTS,662,SICKLE CELL ANEMIA CRISIS,16,DISEASES AND DISORDERS OF THE BLOOD AND BLOOD FORMING ORGANS AND IMMUNOLOGICAL DISORDERS,3,Major,Moderate,Medical,Medicaid,,,,,true,58970.01,7522.16
Long Island,Nassau,2908000,000511,NYU Langone Hospital-Long Island,0 to 17,117,M,Black/African American,Not Span/Hispanic,4,Emergency,Home or Self Care,2019,BLD005,SICKLE CELL TRAIT/ANEMIA,ADM001,TRANSFUSION OF BLOOD AND BLOOD PRODUCTS,662,SICKLE CELL ANEMIA CRISIS,16,DISEASES AND DISORDERS OF THE BLOOD AND BLOOD FORMING ORGANS AND IMMUNOLOGICAL DISORDERS,1,Minor,Minor,Medical,Private Health Insurance,,,,,true,50024.74,6321.31
Long Island,Nassau,2908000,000511,NYU Langone Hospital-Long Island,30 to 49,117,F,Black/African American,Not Span/Hispanic,4,Emergency,Home or Self Care,2019,BLD005,SICKLE CELL TRAIT/ANEMIA,,,662,SICKLE CELL ANEMIA CRISIS,16,DISEASES AND DISORDERS OF THE BLOOD AND BLOOD FORMING ORGANS AND IMMUNOLOGICAL DISORDERS,2,Moderate,Minor,Medical,Medicare,Medicaid,,,,true,36364.38,8035.9
Long Island,Nassau,2908000,000511,NYU Langone Hospital-Long Island,18 to 29,117,F,Black/African American,Not Span/Hispanic,3,Emergency,Home or Self Care,2019,BLD005,SICKLE CELL TRAIT/ANEMIA,ADM001,TRANSFUSION OF BLOOD AND BLOOD PRODUCTS,662,SICKLE CELL ANEMIA CRISIS,16,DISEASES AND DISORDERS OF THE BLOOD AND BLOOD FORMING ORGANS AND IMMUNOLOGICAL DISORDERS,2,Moderate,Minor,Medical,Medicaid,,,,,true,39419.81,4653.41
Long Island,Nassau,2908000,000511,NYU Langone Hospital-Long Island,0 to 17,115,M,Black/African American,Not Span/Hispanic,2,Emergency,Home or Self Care,2019,BLD005,SICKLE CELL TRAIT/ANEMIA,ADM001,TRANSFUSION OF BLOOD AND BLOOD PRODUCTS,662,SICKLE CELL ANEMIA CRISIS,16,DISEASES AND DISORDERS OF THE BLOOD AND BLOOD FORMING ORGANS AND IMMUNOLOGICAL DISORDERS,2,Moderate,Minor,Medical,Medicaid,,,,,true,29555.7,3631.21
Long Island,Nassau,2908000,000511,NYU Langone Hospital-Long Island,18 to 29,115,M,Black/African American,Not Span/Hispanic,1,Emergency,Home or Self Care,2019,BLD005,SICKLE CELL TRAIT/ANEMIA,,,662,SICKLE CELL ANEMIA CRISIS,16,DISEASES AND DISORDERS OF THE BLOOD AND BLOOD FORMING ORGANS AND IMMUNOLOGICAL DISORDERS,1,Minor,Minor,Medical,Private Health Insurance,,,,,true,21262.88,3240.3
Long Island,Nassau,2908000,000511,NYU Langone Hospital-Long Island,0 to 17,117,F,Black/African American,Not Span/Hispanic,2,Emergency,Home or Self Care,2019,BLD005,SICKLE CELL TRAIT/ANEMIA,ADM001,TRANSFUSION OF BLOOD AND BLOOD PRODUCTS,662,SICKLE CELL ANEMIA CRISIS,16,DISEASES AND DISORDERS OF THE BLOOD AND BLOOD FORMING ORGANS AND IMMUNOLOGICAL DISORDERS,3,Major,Minor,Medical,Blue Cross/Blue Shield,,,,,true,29762.76,3520.31
Long Island,Nassau,2908000,000511,NYU Langone Hospital-Long Island,30 to 49,OOS,F,Black/African American,Not Span/Hispanic,6,Emergency,Left Against Medical Advice,2019,BLD005,SICKLE CELL TRAIT/ANEMIA,CAR024,VENOUS AND ARTERIAL CATHETER PLACEMENT,662,SICKLE CELL ANEMIA CRISIS,16,DISEASES AND DISORDERS OF THE BLOOD AND BLOOD FORMING ORGANS AND IMMUNOLOGICAL DISORDERS,3,Major,Minor,Medical,Self-Pay,,,,,true,65990.05,13506.87
Long Island,Nassau,2908000,000511,NYU Langone Hospital-Long Island,18 to 29,115,F,Black/African American,Not Span/Hispanic,6,Emergency,Home or Self Care,2019,BLD005,SICKLE CELL TRAIT/ANEMIA,ADM001,TRANSFUSION OF BLOOD AND BLOOD PRODUCTS,662,SICKLE CELL ANEMIA CRISIS,16,DISEASES AND DISORDERS OF THE BLOOD AND BLOOD FORMING ORGANS AND IMMUNOLOGICAL DISORDERS,2,Moderate,Minor,Medical,Medicaid,,,,,true,60411.91,12403.69
Long Island,Nassau,2908000,000511,NYU Langone Hospital-Long Island,18 to 29,110,M,Black/African American,Not Span/Hispanic,4,Emergency,Home or Self Care,2019,BLD005,SICKLE CELL TRAIT/ANEMIA,,,662,SICKLE CELL ANEMIA CRISIS,16,DISEASES AND DISORDERS OF THE BLOOD AND BLOOD FORMING ORGANS AND IMMUNOLOGICAL DISORDERS,1,Minor,Minor,Medical,Medicaid,,,,,true,35028.79,4411.07
