Hospital Service Area,Hospital County,Operating Certificate Number,Permanent Facility Id,Facility Name,Age Group,Zip Code - 3 digits,Gender,Race,Ethnicity,Length of Stay,Type of Admission,Patient Disposition,Discharge Year,CCS Diagnosis Code,CCS Diagnosis Description,CCS Procedure Code,CCS Procedure Description,APR DRG Code,APR DRG Description,APR MDC Code,APR MDC Description,APR Severity of Illness Code,APR Severity of Illness Description,APR Risk of Mortality,APR Medical Surgical Description,Payment Typology 1,Payment Typology 2,Payment Typology 3,Birth Weight,Abortion Edit Indicator,Emergency Department Indicator,Total Charges,Total Costs
New York City,Bronx,7000006,001169,Montefiore Medical Center - Henry & Lucy Moses Div,0 to 17,104,F,Black/African American,Not Span/Hispanic,2,Emergency,Home or Self Care,2020,BLD005,SICKLE CELL TRAIT/ANEMIA,,,662,SICKLE CELL ANEMIA CRISIS,16,DISEASES AND DISORDERS OF THE BLOOD AND BLOOD FORMING ORGANS AND IMMUNOLOGICAL DISORDERS,2,Moderate,Minor,Medical,Medicaid,,,,,Y,27364.55,6705.05
New York City,Bronx,7000006,001169,Montefiore Medical Center - Henry & Lucy Moses Div,0 to 17,104,M,Other Race,Spanish/Hispanic,1,Emergency,Home or Self Care,2020,BLD005,SICKLE CELL TRAIT/ANEMIA,ADM021,"ADMINISTRATION OF THERAPEUTIC SUBSTANCES, NEC",662,SICKLE CELL ANEMIA CRISIS,16,DISEASES AND DISORDERS OF THE BLOOD AND BLOOD FORMING ORGANS AND IMMUNOLOGICAL DISORDERS,1,Minor,Minor,Medical,Medicaid,,,,,Y,16036.19,3608.24
New York City,Bronx,7000006,001169,Montefiore Medical Center - Henry & Lucy Moses Div,18 to 29,104,M,Black/African American,Not Span/Hispanic,2,Emergency,Home or Self Care,2020,BLD005,SICKLE CELL TRAIT/ANEMIA,,,662,SICKLE CELL ANEMIA CRISIS,16,DISEASES AND DISORDERS OF THE BLOOD AND BLOOD FORMING ORGANS AND IMMUNOLOGICAL DISORDERS,2,Moderate,Minor,Medical,Medicaid,,,,,Y,37112.42,6137.6
New York City,Bronx,7000006,001169,Montefiore Medical Center - Henry & Lucy Moses Div,30 to 49,104,M,Black/African American,Not Span/Hispanic,5,Emergency,Home or Self Care,2020,BLD005,SICKLE CELL TRAIT/ANEMIA,ADM015,ADMINISTRATION OF ANTIBIOTICS,662,SICKLE CELL ANEMIA CRISIS,16,DISEASES AND DISORDERS OF THE BLOOD AND BLOOD FORMING ORGANS AND IMMUNOLOGICAL DISORDERS,1,Minor,Moderate,Medical,Medicare,Medicaid,,,,Y,69255.57,12136.61
New York City,Bronx,7000006,001169,Montefiore Medical Center - Henry & Lucy Moses Div,18 to 29,104,M,Black/African American,Not Span/Hispanic,4,Emergency,Home or Self Care,2020,BLD005,SICKLE CELL TRAIT/ANEMIA,,,662,SICKLE CELL ANEMIA CRISIS,16,DISEASES AND DISORDERS OF THE BLOOD AND BLOOD FORMING ORGANS AND IMMUNOLOGICAL DISORDERS,2,Moderate,Minor,Medical,Medicaid,,,,,Y,45364.43,11580.58
New York City,Bronx,7000006,001169,Montefiore Medical Center - Henry & Lucy Moses Div,30 to 49,104,F,Black/African American,Not Span/Hispanic,2,Emergency,Home or Self Care,2020,BLD005,SICKLE CELL TRAIT/ANEMIA,,,662,SICKLE CELL ANEMIA CRISIS,16,DISEASES AND DISORDERS OF THE BLOOD AND BLOOD FORMING ORGANS AND IMMUNOLOGICAL DISORDERS,2,Moderate,Minor,Medical,Medicaid,,,,,Y,23958.61,3800.45
New York City,Bronx,7000006,001168,Montefiore Medical Center-Wakefield Hospital,30 to 49,104,F,Black/African American,Not Span/Hispanic,4,Emergency,Home or Self Care,2020,BLD005,SICKLE CELL TRAIT/ANEMIA,,,662,SICKLE CELL ANEMIA CRISIS,16,DISEASES AND DISORDERS OF THE BLOOD AND BLOOD FORMING ORGANS AND IMMUNOLOGICAL DISORDERS,3,Major,Minor,Medical,Medicaid,,,,,Y,40033.23,7494.89
New York City,Bronx,7000006,001169,Montefiore Medical Center - Henry & Lucy Moses Div,18 to 29,100,F,Black/African American,Unknown,3,Emergency,Home or Self Care,2020,BLD005,SICKLE CELL TRAIT/ANEMIA,,,662,SICKLE CELL ANEMIA CRISIS,16,DISEASES AND DISORDERS OF THE BLOOD AND BLOOD FORMING ORGANS AND IMMUNOLOGICAL DISORDERS,2,Moderate,Minor,Medical,Medicare,,,,,Y,36740,6258.97
New York City,Bronx,7000006,001169,Montefiore Medical Center - Henry & Lucy Moses Div,18 to 29,104,F,Other Race,Spanish/Hispanic,4,Emergency,Home or Self Care,2020,BLD005,SICKLE CELL TRAIT/ANEMIA,,,662,SICKLE CELL ANEMIA CRISIS,16,DISEASES AND DISORDERS OF THE BLOOD AND BLOOD FORMING ORGANS AND IMMUNOLOGICAL DISORDERS,3,Major,Minor,Medical,Medicaid,,,,,Y,61173.87,13124.86
New York City,Bronx,7000006,003058,Montefiore Med Center - Jack D Weiler Hosp of A Einstein College Div,18 to 29,104,F,Black/African American,Not Span/Hispanic,5,Emergency,Home or Self Care,2020,BLD005,SICKLE CELL TRAIT/ANEMIA,ADM017,ADMINISTRATION OF NUTRITIONAL AND ELECTROLYTIC SUBSTANCES,662,SICKLE CELL ANEMIA CRISIS,16,DISEASES AND DISORDERS OF THE BLOOD AND BLOOD FORMING ORGANS AND IMMUNOLOGICAL DISORDERS,2,Moderate,Minor,Medical,Private Health Insurance,Medicaid,,,,Y,59446.78,10152.8
New York City,Bronx,7000006,001169,Montefiore Medical Center - Henry & Lucy Moses Div,18 to 29,104,F,Other Race,Spanish/Hispanic,7,Emergency,Home or Self Care,2020,BLD005,SICKLE CELL TRAIT/ANEMIA,ADM015,ADMINISTRATION OF ANTIBIOTICS,662,SICKLE CELL ANEMIA CRISIS,16,DISEASES AND DISORDERS OF THE BLOOD AND BLOOD FORMING ORGANS AND IMMUNOLOGICAL DISORDERS,2,Moderate,Minor,Medical,Medicaid,,,,,Y,97290.62,17162.64
New York City,Bronx,7000006,001169,Montefiore Medical Center - Henry & Lucy Moses Div,30 to 49,104,F,Black/African American,Not Span/Hispanic,6,Emergency,Home or Self Care,2020,BLD005,SICKLE CELL TRAIT/ANEMIA,ADM021,"ADMINISTRATION OF THERAPEUTIC SUBSTANCES, NEC",662,SICKLE CELL ANEMIA CRISIS,16,DISEASES AND DISORDERS OF THE BLOOD AND BLOOD FORMING ORGANS AND IMMUNOLOGICAL DISORDERS,3,Major,Minor,Medical,Medicaid,,,,,Y,74859.57,13857.85
New York City,Manhattan,7002024,001456,Mount Sinai Hospital,18 to 29,100,F,Black/African American,Not Span/Hispanic,13,Emergency,Home or Self Care,2020,BLD005,SICKLE CELL TRAIT/ANEMIA,ADM001,TRANSFUSION OF BLOOD AND BLOOD PRODUCTS,662,SICKLE CELL ANEMIA CRISIS,16,DISEASES AND DISORDERS OF THE BLOOD AND BLOOD FORMING ORGANS AND IMMUNOLOGICAL DISORDERS,2,Moderate,Minor,Medical,Medicaid,Medicaid,Self-Pay,,,Y,142687.57,38809.11
New York City,Manhattan,7002024,001456,Mount Sinai Hospital,18 to 29,100,F,Multi-racial,Spanish/Hispanic,8,Emergency,Home or Self Care,2020,BLD005,SICKLE CELL TRAIT/ANEMIA,ADM001,TRANSFUSION OF BLOOD AND BLOOD PRODUCTS,662,SICKLE CELL ANEMIA CRISIS,16,DISEASES AND DISORDERS OF THE BLOOD AND BLOOD FORMING ORGANS AND IMMUNOLOGICAL DISORDERS,3,Major,Moderate,Medical,Medicaid,Medicaid,Self-Pay,,,Y,107746.76,30834.27
New York City,Manhattan,7002024,001456,Mount Sinai Hospital,30 to 49,100,F,Other Race,Not Span/Hispanic,6,Emergency,Home or Self Care,2020,BLD005,SICKLE CELL TRAIT/ANEMIA,ADM021,"ADMINISTRATION OF THERAPEUTIC SUBSTANCES, NEC",662,SICKLE CELL ANEMIA CRISIS,16,DISEASES AND DISORDERS OF THE BLOOD AND BLOOD FORMING ORGANS AND IMMUNOLOGICAL DISORDERS,1,Minor,Minor,Medical,Medicaid,Medicaid,Self-Pay,,,Y,69633.71,17755.8
New York City,Bronx,7000006,001169,Montefiore Medical Center - Henry & Lucy Moses Div,18 to 29,104,F,Other Race,Unknown,8,Emergency,Home or Self Care,2020,BLD005,SICKLE CELL TRAIT/ANEMIA,ADM021,"ADMINISTRATION OF THERAPEUTIC SUBSTANCES, NEC",662,SICKLE CELL ANEMIA CRISIS,16,DISEASES AND DISORDERS OF THE BLOOD AND BLOOD FORMING ORGANS AND IMMUNOLOGICAL DISORDERS,1,Minor,Minor,Medical,Medicaid,,,,,Y,83082.09,21869.91
New York City,Bronx,7000006,001169,Montefiore Medical Center - Henry & Lucy Moses Div,30 to 49,104,M,Black/African American,Not Span/Hispanic,4,Emergency,Home or Self Care,2020,BLD005,SICKLE CELL TRAIT/ANEMIA,OTR004,ISOLATION PROCEDURES,662,SICKLE CELL ANEMIA CRISIS,16,DISEASES AND DISORDERS OF THE BLOOD AND BLOOD FORMING ORGANS AND IMMUNOLOGICAL DISORDERS,2,Moderate,Minor,Medical,Medicaid,,,,,Y,51623.67,9432.33
New York City,Bronx,7000006,001169,Montefiore Medical Center - Henry & Lucy Moses Div,50 to 69,104,F,Other Race,Spanish/Hispanic,8,Emergency,Home or Self Care,2020,BLD005,SICKLE CELL TRAIT/ANEMIA,ADM001,TRANSFUSION OF BLOOD AND BLOOD PRODUCTS,662,SICKLE CELL ANEMIA CRISIS,16,DISEASES AND DISORDERS OF THE BLOOD AND BLOOD FORMING ORGANS AND IMMUNOLOGICAL DISORDERS,3,Major,Minor,Medical,Private Health Insurance,,,,,Y,104287.14,18726.66
New York City,Bronx,7000006,001169,Montefiore Medical Center - Henry & Lucy Moses Div,18 to 29,104,M,Black/African American,Not Span/Hispanic,5,Emergency,Home or Self Care,2020,BLD005,SICKLE CELL TRAIT/ANEMIA,,,662,SICKLE CELL ANEMIA CRISIS,16,DISEASES AND DISORDERS OF THE BLOOD AND BLOOD FORMING ORGANS AND IMMUNOLOGICAL DISORDERS,1,Minor,Minor,Medical,Private Health Insurance,,,,,Y,74556.29,16268.53
New York City,Bronx,7000006,001169,Montefiore Medical Center - Henry & Lucy Moses Div,0 to 17,104,M,Black/African American,Spanish/Hispanic,3,Emergency,Home or Self Care,2020,BLD005,SICKLE CELL TRAIT/ANEMIA,ADM014,REGIONAL ANESTHESIA,662,SICKLE CELL ANEMIA CRISIS,16,DISEASES AND DISORDERS OF THE BLOOD AND BLOOD FORMING ORGANS AND IMMUNOLOGICAL DISORDERS,2,Moderate,Minor,Medical,Blue Cross/Blue Shield,,,,,Y,37218.59,9494.3
New York City,Bronx,7000006,001168,Montefiore Medical Center-Wakefield Hospital,30 to 49,104,F,Black/African American,Unknown,2,Emergency,Home or Self Care,2020,BLD005,SICKLE CELL TRAIT/ANEMIA,,,662,SICKLE CELL ANEMIA CRISIS,16,DISEASES AND DISORDERS OF THE BLOOD AND BLOOD FORMING ORGANS AND IMMUNOLOGICAL DISORDERS,2,Moderate,Minor,Medical,Private Health Insurance,,,,,Y,25682.14,3863.74
New York City,Bronx,7000006,001169,Montefiore Medical Center - Henry & Lucy Moses Div,18 to 29,104,F,Black/African American,Not Span/Hispanic,4,Emergency,Home or Self Care,2020,BLD005,SICKLE CELL TRAIT/ANEMIA,ADM001,TRANSFUSION OF BLOOD AND BLOOD PRODUCTS,662,SICKLE CELL ANEMIA CRISIS,16,DISEASES AND DISORDERS OF THE BLOOD AND BLOOD FORMING ORGANS AND IMMUNOLOGICAL DISORDERS,1,Minor,Minor,Medical,Blue Cross/Blue Shield,,,,,Y,73526.37,11592.89
New York City,Bronx,7000006,001169,Montefiore Medical Center - Henry & Lucy Moses Div,0 to 17,104,F,Other Race,Unknown,4,Emergency,Home or Self Care,2020,BLD005,SICKLE CELL TRAIT/ANEMIA,ADM021,"ADMINISTRATION OF THERAPEUTIC SUBSTANCES, NEC",662,SICKLE CELL ANEMIA CRISIS,16,DISEASES AND DISORDERS OF THE BLOOD AND BLOOD FORMING ORGANS AND IMMUNOLOGICAL DISORDERS,2,Moderate,Minor,Medical,Medicaid,,,,,Y,61707.03,13505.74
New York City,Bronx,7000006,001169,Montefiore Medical Center - Henry & Lucy Moses Div,0 to 17,104,F,Black/African American,Not Span/Hispanic,4,Emergency,Home or Self Care,2020,BLD005,SICKLE CELL TRAIT/ANEMIA,ADM021,"ADMINISTRATION OF THERAPEUTIC SUBSTANCES, NEC",662,SICKLE CELL ANEMIA CRISIS,16,DISEASES AND DISORDERS OF THE BLOOD AND BLOOD FORMING ORGANS AND IMMUNOLOGICAL DISORDERS,1,Minor,Minor,Medical,Medicaid,,,,,Y,47430.86,12379.34
New York City,Bronx,7000006,001169,Montefiore Medical Center - Henry & Lucy Moses Div,18 to 29,104,F,Black/African American,Not Span/Hispanic,9,Emergency,Home or Self Care,2020,BLD005,SICKLE CELL TRAIT/ANEMIA,ADM001,TRANSFUSION OF BLOOD AND BLOOD PRODUCTS,662,SICKLE CELL ANEMIA CRISIS,16,DISEASES AND DISORDERS OF THE BLOOD AND BLOOD FORMING ORGANS AND IMMUNOLOGICAL DISORDERS,3,Major,Minor,Medical,Private Health Insurance,,,,,Y,117857.56,28819.85
New York City,Bronx,7000006,001169,Montefiore Medical Center - Henry & Lucy Moses Div,0 to 17,104,M,Other Race,Spanish/Hispanic,6,Emergency,Home or Self Care,2020,BLD005,SICKLE CELL TRAIT/ANEMIA,CAR024,VENOUS AND ARTERIAL CATHETER PLACEMENT,662,SICKLE CELL ANEMIA CRISIS,16,DISEASES AND DISORDERS OF THE BLOOD AND BLOOD FORMING ORGANS AND IMMUNOLOGICAL DISORDERS,2,Moderate,Minor,Medical,Medicaid,,,,,N,86132.39,22978.63
New York City,Bronx,7000006,001169,Montefiore Medical Center - Henry & Lucy Moses Div,18 to 29,104,M,Black/African American,Not Span/Hispanic,13,Emergency,Home or Self Care,2020,BLD005,SICKLE CELL TRAIT/ANEMIA,,,662,SICKLE CELL ANEMIA CRISIS,16,DISEASES AND DISORDERS OF THE BLOOD AND BLOOD FORMING ORGANS AND IMMUNOLOGICAL DISORDERS,2,Moderate,Minor,Medical,Medicaid,,,,,N,152692.84,39736.88
New York City,Bronx,7000006,003058,Montefiore Med Center - Jack D Weiler Hosp of A Einstein College Div,18 to 29,104,M,Black/African American,Not Span/Hispanic,1,Emergency,Home or Self Care,2020,BLD005,SICKLE CELL TRAIT/ANEMIA,ADM014,REGIONAL ANESTHESIA,662,SICKLE CELL ANEMIA CRISIS,16,DISEASES AND DISORDERS OF THE BLOOD AND BLOOD FORMING ORGANS AND IMMUNOLOGICAL DISORDERS,2,Moderate,Minor,Medical,Medicaid,,,,,Y,19761.5,2721.94
New York City,Bronx,7000006,001169,Montefiore Medical Center - Henry & Lucy Moses Div,18 to 29,104,F,Black/African American,Not Span/Hispanic,1,Emergency,Home or Self Care,2020,BLD005,SICKLE CELL TRAIT/ANEMIA,,,662,SICKLE CELL ANEMIA CRISIS,16,DISEASES AND DISORDERS OF THE BLOOD AND BLOOD FORMING ORGANS AND IMMUNOLOGICAL DISORDERS,3,Major,Minor,Medical,Medicaid,,,,,Y,22227.36,4060.91
New York City,Bronx,7000006,001169,Montefiore Medical Center - Henry & Lucy Moses Div,30 to 49,104,M,Black/African American,Not Span/Hispanic,7,Emergency,Home w/ Home Health Services,2020,BLD005,SICKLE CELL TRAIT/ANEMIA,ADM021,"ADMINISTRATION OF THERAPEUTIC SUBSTANCES, NEC",662,SICKLE CELL ANEMIA CRISIS,16,DISEASES AND DISORDERS OF THE BLOOD AND BLOOD FORMING ORGANS AND IMMUNOLOGICAL DISORDERS,3,Major,Minor,Medical,Medicaid,,,,,Y,91183.62,16233.44
New York City,Bronx,7000006,001169,Montefiore Medical Center - Henry & Lucy Moses Div,30 to 49,104,F,Black/African American,Not Span/Hispanic,14,Emergency,Home or Self Care,2020,BLD005,SICKLE CELL TRAIT/ANEMIA,ADM001,TRANSFUSION OF BLOOD AND BLOOD PRODUCTS,662,SICKLE CELL ANEMIA CRISIS,16,DISEASES AND DISORDERS OF THE BLOOD AND BLOOD FORMING ORGANS AND IMMUNOLOGICAL DISORDERS,2,Moderate,Moderate,Medical,Medicaid,,,,,Y,177303.98,31664.14
New York City,Manhattan,7002024,001456,Mount Sinai Hospital,30 to 49,112,M,Black/African American,Not Span/Hispanic,11,Elective,Home or Self Care,2020,BLD005,SICKLE CELL TRAIT/ANEMIA,ADM001,TRANSFUSION OF BLOOD AND BLOOD PRODUCTS,662,SICKLE CELL ANEMIA CRISIS,16,DISEASES AND DISORDERS OF THE BLOOD AND BLOOD FORMING ORGANS AND IMMUNOLOGICAL DISORDERS,3,Major,Moderate,Medical,"Managed Care, Unspecified",Medicaid,Self-Pay,,,N,150110.83,37830.79
New York City,Manhattan,7002024,001456,Mount Sinai Hospital,30 to 49,100,F,Other Race,Not Span/Hispanic,5,Emergency,Home or Self Care,2020,BLD005,SICKLE CELL TRAIT/ANEMIA,,,662,SICKLE CELL ANEMIA CRISIS,16,DISEASES AND DISORDERS OF THE BLOOD AND BLOOD FORMING ORGANS AND IMMUNOLOGICAL DISORDERS,1,Minor,Minor,Medical,Medicaid,Medicaid,Self-Pay,,,Y,55314.64,14962.29
New York City,Manhattan,7002024,001456,Mount Sinai Hospital,30 to 49,104,F,Black/African American,Not Span/Hispanic,6,Emergency,Home or Self Care,2020,BLD005,SICKLE CELL TRAIT/ANEMIA,IMG009,PLAIN RADIOGRAPHY,662,SICKLE CELL ANEMIA CRISIS,16,DISEASES AND DISORDERS OF THE BLOOD AND BLOOD FORMING ORGANS AND IMMUNOLOGICAL DISORDERS,2,Moderate,Minor,Medical,Medicare,Medicaid,Self-Pay,,,Y,84004,24840.93
New York City,Bronx,7000006,001169,Montefiore Medical Center - Henry & Lucy Moses Div,18 to 29,104,M,Black/African American,Not Span/Hispanic,3,Emergency,Left Against Medical Advice,2020,BLD005,SICKLE CELL TRAIT/ANEMIA,,,662,SICKLE CELL ANEMIA CRISIS,16,DISEASES AND DISORDERS OF THE BLOOD AND BLOOD FORMING ORGANS AND IMMUNOLOGICAL DISORDERS,2,Moderate,Minor,Medical,Medicaid,,,,,Y,61890.93,8853.99
New York City,Manhattan,7002024,001456,Mount Sinai Hospital,18 to 29,114,M,Other Race,Spanish/Hispanic,8,Emergency,Home or Self Care,2020,BLD005,SICKLE CELL TRAIT/ANEMIA,OTR004,ISOLATION PROCEDURES,662,SICKLE CELL ANEMIA CRISIS,16,DISEASES AND DISORDERS OF THE BLOOD AND BLOOD FORMING ORGANS AND IMMUNOLOGICAL DISORDERS,4,Extreme,Extreme,Medical,Medicaid,Medicaid,Self-Pay,,,Y,90260.74,23258.39
New York City,Manhattan,7002024,001456,Mount Sinai Hospital,30 to 49,104,F,Other Race,Spanish/Hispanic,5,Emergency,Home or Self Care,2020,BLD005,SICKLE CELL TRAIT/ANEMIA,ADM001,TRANSFUSION OF BLOOD AND BLOOD PRODUCTS,662,SICKLE CELL ANEMIA CRISIS,16,DISEASES AND DISORDERS OF THE BLOOD AND BLOOD FORMING ORGANS AND IMMUNOLOGICAL DISORDERS,3,Major,Minor,Medical,Medicaid,Medicaid,Self-Pay,,,Y,56881.39,14926.94
New York City,Manhattan,7002024,001456,Mount Sinai Hospital,18 to 29,112,F,Black/African American,Not Span/Hispanic,2,Urgent,Home or Self Care,2020,BLD005,SICKLE CELL TRAIT/ANEMIA,,,662,SICKLE CELL ANEMIA CRISIS,16,DISEASES AND DISORDERS OF THE BLOOD AND BLOOD FORMING ORGANS AND IMMUNOLOGICAL DISORDERS,2,Moderate,Moderate,Medical,Medicare,Medicaid,Self-Pay,,,N,23506.85,5835.2
New York City,Bronx,7000006,003058,Montefiore Med Center - Jack D Weiler Hosp of A Einstein College Div,30 to 49,OOS,F,Black/African American,Not Span/Hispanic,2,Emergency,Home or Self Care,2020,BLD005,SICKLE CELL TRAIT/ANEMIA,ADM014,REGIONAL ANESTHESIA,662,SICKLE CELL ANEMIA CRISIS,16,DISEASES AND DISORDERS OF THE BLOOD AND BLOOD FORMING ORGANS AND IMMUNOLOGICAL DISORDERS,2,Moderate,Minor,Medical,Private Health Insurance,,,,,Y,19097.67,3255.03
New York City,Bronx,7000006,001169,Montefiore Medical Center - Henry & Lucy Moses Div,0 to 17,104,F,Black/African American,Not Span/Hispanic,6,Emergency,Home or Self Care,2020,BLD005,SICKLE CELL TRAIT/ANEMIA,,,662,SICKLE CELL ANEMIA CRISIS,16,DISEASES AND DISORDERS OF THE BLOOD AND BLOOD FORMING ORGANS AND IMMUNOLOGICAL DISORDERS,2,Moderate,Minor,Medical,Medicaid,,,,,Y,82390.46,19940.98
New York City,Bronx,7000006,001168,Montefiore Medical Center-Wakefield Hospital,30 to 49,104,M,Black/African American,Not Span/Hispanic,3,Emergency,Home or Self Care,2020,BLD005,SICKLE CELL TRAIT/ANEMIA,ADM017,ADMINISTRATION OF NUTRITIONAL AND ELECTROLYTIC SUBSTANCES,662,SICKLE CELL ANEMIA CRISIS,16,DISEASES AND DISORDERS OF THE BLOOD AND BLOOD FORMING ORGANS AND IMMUNOLOGICAL DISORDERS,1,Minor,Moderate,Medical,Private Health Insurance,Medicare,,,,Y,41098.69,7314.83
New York City,Bronx,7000006,001169,Montefiore Medical Center - Henry & Lucy Moses Div,0 to 17,104,F,Black/African American,Not Span/Hispanic,1,Emergency,Home or Self Care,2020,BLD005,SICKLE CELL TRAIT/ANEMIA,ADM021,"ADMINISTRATION OF THERAPEUTIC SUBSTANCES, NEC",662,SICKLE CELL ANEMIA CRISIS,16,DISEASES AND DISORDERS OF THE BLOOD AND BLOOD FORMING ORGANS AND IMMUNOLOGICAL DISORDERS,1,Minor,Minor,Medical,Blue Cross/Blue Shield,,,,,Y,19582.74,3917.17
New York City,Bronx,7000006,001169,Montefiore Medical Center - Henry & Lucy Moses Div,0 to 17,,F,Black/African American,Not Span/Hispanic,4,Emergency,Home or Self Care,2020,BLD005,SICKLE CELL TRAIT/ANEMIA,,,662,SICKLE CELL ANEMIA CRISIS,16,DISEASES AND DISORDERS OF THE BLOOD AND BLOOD FORMING ORGANS AND IMMUNOLOGICAL DISORDERS,1,Minor,Minor,Medical,Private Health Insurance,,,,,N,67602.04,13217.91
New York City,Bronx,7000006,001169,Montefiore Medical Center - Henry & Lucy Moses Div,0 to 17,104,M,Multi-racial,Spanish/Hispanic,2,Emergency,Home or Self Care,2020,BLD005,SICKLE CELL TRAIT/ANEMIA,,,662,SICKLE CELL ANEMIA CRISIS,16,DISEASES AND DISORDERS OF THE BLOOD AND BLOOD FORMING ORGANS AND IMMUNOLOGICAL DISORDERS,1,Minor,Minor,Medical,Medicaid,,,,,Y,39581.65,7797.82
New York City,Bronx,7000006,001169,Montefiore Medical Center - Henry & Lucy Moses Div,18 to 29,104,F,Black/African American,Not Span/Hispanic,3,Emergency,Home or Self Care,2020,BLD005,SICKLE CELL TRAIT/ANEMIA,,,662,SICKLE CELL ANEMIA CRISIS,16,DISEASES AND DISORDERS OF THE BLOOD AND BLOOD FORMING ORGANS AND IMMUNOLOGICAL DISORDERS,3,Major,Minor,Medical,Medicaid,,,,,Y,40961.98,9769.95
New York City,Bronx,7000006,001169,Montefiore Medical Center - Henry & Lucy Moses Div,18 to 29,104,M,Black/African American,Not Span/Hispanic,1,Emergency,Home or Self Care,2020,BLD005,SICKLE CELL TRAIT/ANEMIA,ADM017,ADMINISTRATION OF NUTRITIONAL AND ELECTROLYTIC SUBSTANCES,662,SICKLE CELL ANEMIA CRISIS,16,DISEASES AND DISORDERS OF THE BLOOD AND BLOOD FORMING ORGANS AND IMMUNOLOGICAL DISORDERS,3,Major,Minor,Medical,Private Health Insurance,,,,,Y,16880.68,2975.01
New York City,Kings,7002002,001324,Mount Sinai Brooklyn,18 to 29,112,F,Black/African American,Not Span/Hispanic,3,Emergency,Short-term Hospital,2020,BLD005,SICKLE CELL TRAIT/ANEMIA,,,662,SICKLE CELL ANEMIA CRISIS,16,DISEASES AND DISORDERS OF THE BLOOD AND BLOOD FORMING ORGANS AND IMMUNOLOGICAL DISORDERS,3,Major,Major,Medical,Medicare,Medicaid,Self-Pay,,,Y,42943.89,9126.75
New York City,Kings,7002002,001324,Mount Sinai Brooklyn,30 to 49,112,F,Black/African American,Not Span/Hispanic,4,Emergency,Home or Self Care,2020,BLD005,SICKLE CELL TRAIT/ANEMIA,,,662,SICKLE CELL ANEMIA CRISIS,16,DISEASES AND DISORDERS OF THE BLOOD AND BLOOD FORMING ORGANS AND IMMUNOLOGICAL DISORDERS,2,Moderate,Minor,Medical,Medicare,Medicaid,Self-Pay,,,N,46985.16,5859.88
New York City,Manhattan,7002032,001469,Mount Sinai Morningside,30 to 49,100,M,Black/African American,Not Span/Hispanic,1,Emergency,Left Against Medical Advice,2020,BLD005,SICKLE CELL TRAIT/ANEMIA,ADM014,REGIONAL ANESTHESIA,662,SICKLE CELL ANEMIA CRISIS,16,DISEASES AND DISORDERS OF THE BLOOD AND BLOOD FORMING ORGANS AND IMMUNOLOGICAL DISORDERS,1,Minor,Minor,Medical,Medicaid,Medicaid,Self-Pay,,,N,10654.56,2235.34
New York City,Manhattan,7002032,001469,Mount Sinai Morningside,50 to 69,100,F,Black/African American,Not Span/Hispanic,2,Emergency,Home or Self Care,2020,BLD005,SICKLE CELL TRAIT/ANEMIA,ADM001,TRANSFUSION OF BLOOD AND BLOOD PRODUCTS,662,SICKLE CELL ANEMIA CRISIS,16,DISEASES AND DISORDERS OF THE BLOOD AND BLOOD FORMING ORGANS AND IMMUNOLOGICAL DISORDERS,2,Moderate,Minor,Medical,Medicaid,Medicaid,Self-Pay,,,Y,36406.54,9020.52
New York City,Manhattan,7002032,001469,Mount Sinai Morningside,30 to 49,100,M,Black/African American,Not Span/Hispanic,6,Emergency,Home or Self Care,2020,BLD005,SICKLE CELL TRAIT/ANEMIA,ADM001,TRANSFUSION OF BLOOD AND BLOOD PRODUCTS,662,SICKLE CELL ANEMIA CRISIS,16,DISEASES AND DISORDERS OF THE BLOOD AND BLOOD FORMING ORGANS AND IMMUNOLOGICAL DISORDERS,2,Moderate,Moderate,Medical,Medicare,Medicaid,Self-Pay,,,Y,70130.43,15596.51
New York City,Bronx,7000006,001169,Montefiore Medical Center - Henry & Lucy Moses Div,18 to 29,,M,Other Race,Not Span/Hispanic,7,Emergency,Home or Self Care,2020,BLD005,SICKLE CELL TRAIT/ANEMIA,,,662,SICKLE CELL ANEMIA CRISIS,16,DISEASES AND DISORDERS OF THE BLOOD AND BLOOD FORMING ORGANS AND IMMUNOLOGICAL DISORDERS,3,Major,Minor,Medical,Medicaid,,,,,N,76119.86,20916.98
New York City,Bronx,7000006,001169,Montefiore Medical Center - Henry & Lucy Moses Div,0 to 17,104,M,Other Race,Not Span/Hispanic,3,Emergency,Home or Self Care,2020,BLD005,SICKLE CELL TRAIT/ANEMIA,,,662,SICKLE CELL ANEMIA CRISIS,16,DISEASES AND DISORDERS OF THE BLOOD AND BLOOD FORMING ORGANS AND IMMUNOLOGICAL DISORDERS,1,Minor,Minor,Medical,Medicaid,,,,,Y,35787.58,9418.72
New York City,Bronx,7000006,001169,Montefiore Medical Center - Henry & Lucy Moses Div,30 to 49,104,M,Black/African American,Not Span/Hispanic,6,Emergency,Home or Self Care,2020,BLD005,SICKLE CELL TRAIT/ANEMIA,,,662,SICKLE CELL ANEMIA CRISIS,16,DISEASES AND DISORDERS OF THE BLOOD AND BLOOD FORMING ORGANS AND IMMUNOLOGICAL DISORDERS,3,Major,Minor,Medical,Private Health Insurance,,,,,Y,73894.9,13714.24
New York City,Bronx,7000006,001169,Montefiore Medical Center - Henry & Lucy Moses Div,18 to 29,104,F,Other Race,Not Span/Hispanic,10,Emergency,Home or Self Care,2020,BLD005,SICKLE CELL TRAIT/ANEMIA,CAR024,VENOUS AND ARTERIAL CATHETER PLACEMENT,662,SICKLE CELL ANEMIA CRISIS,16,DISEASES AND DISORDERS OF THE BLOOD AND BLOOD FORMING ORGANS AND IMMUNOLOGICAL DISORDERS,2,Moderate,Minor,Medical,Medicaid,,,,,Y,152510.28,24898.71
New York City,Manhattan,7002032,001466,Mount Sinai West,18 to 29,104,M,Black/African American,Not Span/Hispanic,1,Emergency,Home or Self Care,2020,BLD005,SICKLE CELL TRAIT/ANEMIA,ADM015,ADMINISTRATION OF ANTIBIOTICS,662,SICKLE CELL ANEMIA CRISIS,16,DISEASES AND DISORDERS OF THE BLOOD AND BLOOD FORMING ORGANS AND IMMUNOLOGICAL DISORDERS,2,Moderate,Moderate,Medical,Medicaid,Medicaid,Self-Pay,,,N,12489.24,2430.06