Hospital Service Area,Hospital County,Operating Certificate Number,Permanent Facility Id,Facility Name,Age Group,Zip Code - 3 digits,Gender,Race,Ethnicity,Length of Stay,Type of Admission,Patient Disposition,Discharge Year,CCS Diagnosis Code,CCS Diagnosis Description,CCS Procedure Code,CCS Procedure Description,APR DRG Code,APR DRG Description,APR MDC Code,APR MDC Description,APR Severity of Illness Code,APR Severity of Illness Description,APR Risk of Mortality,APR Medical Surgical Description,Payment Typology 1,Payment Typology 2,Payment Typology 3,Birth Weight,Abortion Edit Indicator,Emergency Department Indicator,Total Charges,Total Costs
Long Island,Nassau,2908000,000511,NYU Langone Hospital-Long Island,30 to 49,117,M,Other Race,Spanish/Hispanic,4,Emergency,Home or Self Care,2020,BLD005,SICKLE CELL TRAIT/ANEMIA,ADM001,TRANSFUSION OF BLOOD AND BLOOD PRODUCTS,662,SICKLE CELL ANEMIA CRISIS,16,DISEASES AND DISORDERS OF THE BLOOD AND BLOOD FORMING ORGANS AND IMMUNOLOGICAL DISORDERS,3,Major,Minor,Medical,Medicaid,,,,,Y,72951.5,15597.54
Long Island,Nassau,2908000,000511,NYU Langone Hospital-Long Island,18 to 29,110,M,Other Race,Unknown,3,Emergency,Left Against Medical Advice,2020,BLD005,SICKLE CELL TRAIT/ANEMIA,ENT002,ENT DIAGNOSTIC ENDOSCOPY (EXCLUDING LARYNGOSCOPY),662,SICKLE CELL ANEMIA CRISIS,16,DISEASES AND DISORDERS OF THE BLOOD AND BLOOD FORMING ORGANS AND IMMUNOLOGICAL DISORDERS,1,Minor,Minor,Medical,Private Health Insurance,,,,,Y,45327.91,12211.33
Long Island,Nassau,2908000,000511,NYU Langone Hospital-Long Island,18 to 29,115,M,Black/African American,Not Span/Hispanic,6,Emergency,Home or Self Care,2020,BLD005,SICKLE CELL TRAIT/ANEMIA,,,662,SICKLE CELL ANEMIA CRISIS,16,DISEASES AND DISORDERS OF THE BLOOD AND BLOOD FORMING ORGANS AND IMMUNOLOGICAL DISORDERS,3,Major,Minor,Medical,Self-Pay,,,,,Y,65358.73,18548.91
Long Island,Nassau,2908000,000511,NYU Langone Hospital-Long Island,30 to 49,117,F,Black/African American,Not Span/Hispanic,1,Emergency,Home or Self Care,2020,BLD005,SICKLE CELL TRAIT/ANEMIA,ADM001,TRANSFUSION OF BLOOD AND BLOOD PRODUCTS,662,SICKLE CELL ANEMIA CRISIS,16,DISEASES AND DISORDERS OF THE BLOOD AND BLOOD FORMING ORGANS AND IMMUNOLOGICAL DISORDERS,2,Moderate,Minor,Medical,Medicaid,,,,,Y,30220.47,5725.57
Long Island,Nassau,2908000,000511,NYU Langone Hospital-Long Island,30 to 49,115,F,Black/African American,Not Span/Hispanic,10,Emergency,Home or Self Care,2020,BLD005,SICKLE CELL TRAIT/ANEMIA,ADM001,TRANSFUSION OF BLOOD AND BLOOD PRODUCTS,662,SICKLE CELL ANEMIA CRISIS,16,DISEASES AND DISORDERS OF THE BLOOD AND BLOOD FORMING ORGANS AND IMMUNOLOGICAL DISORDERS,1,Minor,Minor,Medical,Medicare,Medicaid,,,,Y,153138.38,35840.52
Long Island,Nassau,2908000,000511,NYU Langone Hospital-Long Island,0 to 17,OOS,F,Black/African American,Not Span/Hispanic,4,Emergency,Home or Self Care,2020,BLD005,SICKLE CELL TRAIT/ANEMIA,ADM001,TRANSFUSION OF BLOOD AND BLOOD PRODUCTS,662,SICKLE CELL ANEMIA CRISIS,16,DISEASES AND DISORDERS OF THE BLOOD AND BLOOD FORMING ORGANS AND IMMUNOLOGICAL DISORDERS,2,Moderate,Minor,Medical,Blue Cross/Blue Shield,,,,,Y,49097.29,11042.26
Long Island,Nassau,2908000,000511,NYU Langone Hospital-Long Island,18 to 29,117,F,Black/African American,Not Span/Hispanic,1,Emergency,Home or Self Care,2020,BLD005,SICKLE CELL TRAIT/ANEMIA,,,662,SICKLE CELL ANEMIA CRISIS,16,DISEASES AND DISORDERS OF THE BLOOD AND BLOOD FORMING ORGANS AND IMMUNOLOGICAL DISORDERS,1,Minor,Minor,Medical,Self-Pay,,,,,Y,19747.94,4650.12
Long Island,Nassau,2908000,000511,NYU Langone Hospital-Long Island,0 to 17,OOS,F,Black/African American,Not Span/Hispanic,3,Emergency,Home or Self Care,2020,BLD005,SICKLE CELL TRAIT/ANEMIA,,,662,SICKLE CELL ANEMIA CRISIS,16,DISEASES AND DISORDERS OF THE BLOOD AND BLOOD FORMING ORGANS AND IMMUNOLOGICAL DISORDERS,2,Moderate,Minor,Medical,Blue Cross/Blue Shield,,,,,Y,36962.83,8544.39
Long Island,Nassau,2908000,000511,NYU Langone Hospital-Long Island,0 to 17,115,F,Black/African American,Not Span/Hispanic,2,Emergency,Home or Self Care,2020,BLD005,SICKLE CELL TRAIT/ANEMIA,OTR004,ISOLATION PROCEDURES,662,SICKLE CELL ANEMIA CRISIS,16,DISEASES AND DISORDERS OF THE BLOOD AND BLOOD FORMING ORGANS AND IMMUNOLOGICAL DISORDERS,2,Moderate,Minor,Medical,Private Health Insurance,,,,,Y,34352.39,6630.91
Long Island,Nassau,2908000,000511,NYU Langone Hospital-Long Island,0 to 17,117,M,Black/African American,Not Span/Hispanic,2,Urgent,Home or Self Care,2020,BLD005,SICKLE CELL TRAIT/ANEMIA,,,662,SICKLE CELL ANEMIA CRISIS,16,DISEASES AND DISORDERS OF THE BLOOD AND BLOOD FORMING ORGANS AND IMMUNOLOGICAL DISORDERS,2,Moderate,Minor,Medical,Medicaid,,,,,N,34578.26,6822.54
Long Island,Nassau,2908000,000511,NYU Langone Hospital-Long Island,0 to 17,115,F,Black/African American,Not Span/Hispanic,3,Emergency,Home or Self Care,2020,BLD005,SICKLE CELL TRAIT/ANEMIA,ADM001,TRANSFUSION OF BLOOD AND BLOOD PRODUCTS,662,SICKLE CELL ANEMIA CRISIS,16,DISEASES AND DISORDERS OF THE BLOOD AND BLOOD FORMING ORGANS AND IMMUNOLOGICAL DISORDERS,2,Moderate,Minor,Medical,Medicaid,,,,,Y,36714.94,9822.51
Long Island,Nassau,2908000,000511,NYU Langone Hospital-Long Island,50 to 69,117,F,Black/African American,Not Span/Hispanic,7,Emergency,Home or Self Care,2020,BLD005,SICKLE CELL TRAIT/ANEMIA,,,662,SICKLE CELL ANEMIA CRISIS,16,DISEASES AND DISORDERS OF THE BLOOD AND BLOOD FORMING ORGANS AND IMMUNOLOGICAL DISORDERS,3,Major,Moderate,Medical,Private Health Insurance,,,,,Y,89728.95,25621.69
Long Island,Nassau,2908000,000511,NYU Langone Hospital-Long Island,18 to 29,115,M,Black/African American,Not Span/Hispanic,1,Emergency,Home or Self Care,2020,BLD005,SICKLE CELL TRAIT/ANEMIA,,,662,SICKLE CELL ANEMIA CRISIS,16,DISEASES AND DISORDERS OF THE BLOOD AND BLOOD FORMING ORGANS AND IMMUNOLOGICAL DISORDERS,1,Minor,Minor,Medical,Medicaid,,,,,Y,17756.69,4486.64
Long Island,Nassau,2908000,000511,NYU Langone Hospital-Long Island,30 to 49,110,F,Black/African American,Not Span/Hispanic,1,Emergency,Home or Self Care,2020,BLD005,SICKLE CELL TRAIT/ANEMIA,,,662,SICKLE CELL ANEMIA CRISIS,16,DISEASES AND DISORDERS OF THE BLOOD AND BLOOD FORMING ORGANS AND IMMUNOLOGICAL DISORDERS,1,Minor,Minor,Medical,Private Health Insurance,,,,,Y,18059.36,4467.57
Long Island,Nassau,2908000,000511,NYU Langone Hospital-Long Island,18 to 29,110,M,Black/African American,Not Span/Hispanic,3,Emergency,Home or Self Care,2020,BLD005,SICKLE CELL TRAIT/ANEMIA,,,662,SICKLE CELL ANEMIA CRISIS,16,DISEASES AND DISORDERS OF THE BLOOD AND BLOOD FORMING ORGANS AND IMMUNOLOGICAL DISORDERS,1,Minor,Minor,Medical,Medicaid,,,,,Y,27997.04,7514.7
Long Island,Nassau,2908000,000511,NYU Langone Hospital-Long Island,18 to 29,110,M,Black/African American,Not Span/Hispanic,5,Emergency,Home or Self Care,2020,BLD005,SICKLE CELL TRAIT/ANEMIA,,,662,SICKLE CELL ANEMIA CRISIS,16,DISEASES AND DISORDERS OF THE BLOOD AND BLOOD FORMING ORGANS AND IMMUNOLOGICAL DISORDERS,2,Moderate,Minor,Medical,Medicaid,,,,,Y,38244.84,11008.96
Long Island,Nassau,2908000,000511,NYU Langone Hospital-Long Island,18 to 29,110,M,Black/African American,Not Span/Hispanic,4,Emergency,Left Against Medical Advice,2020,BLD005,SICKLE CELL TRAIT/ANEMIA,,,662,SICKLE CELL ANEMIA CRISIS,16,DISEASES AND DISORDERS OF THE BLOOD AND BLOOD FORMING ORGANS AND IMMUNOLOGICAL DISORDERS,2,Moderate,Minor,Medical,Medicaid,,,,,Y,50600.03,19506.83
Long Island,Nassau,2908000,000511,NYU Langone Hospital-Long Island,30 to 49,115,F,Black/African American,Not Span/Hispanic,7,Emergency,Home or Self Care,2020,BLD005,SICKLE CELL TRAIT/ANEMIA,ADM001,TRANSFUSION OF BLOOD AND BLOOD PRODUCTS,662,SICKLE CELL ANEMIA CRISIS,16,DISEASES AND DISORDERS OF THE BLOOD AND BLOOD FORMING ORGANS AND IMMUNOLOGICAL DISORDERS,3,Major,Moderate,Medical,Medicare,Medicaid,,,,Y,88014.45,26083.75
Long Island,Nassau,2908000,000511,NYU Langone Hospital-Long Island,30 to 49,117,M,Other Race,Spanish/Hispanic,5,Emergency,Home or Self Care,2020,BLD005,SICKLE CELL TRAIT/ANEMIA,ADM001,TRANSFUSION OF BLOOD AND BLOOD PRODUCTS,662,SICKLE CELL ANEMIA CRISIS,16,DISEASES AND DISORDERS OF THE BLOOD AND BLOOD FORMING ORGANS AND IMMUNOLOGICAL DISORDERS,3,Major,Minor,Medical,Medicaid,,,,,Y,80269.3,25626.14
Long Island,Nassau,2908000,000511,NYU Langone Hospital-Long Island,50 to 69,114,M,Black/African American,Not Span/Hispanic,4,Emergency,Home w/ Home Health Services,2020,BLD005,SICKLE CELL TRAIT/ANEMIA,ADM001,TRANSFUSION OF BLOOD AND BLOOD PRODUCTS,662,SICKLE CELL ANEMIA CRISIS,16,DISEASES AND DISORDERS OF THE BLOOD AND BLOOD FORMING ORGANS AND IMMUNOLOGICAL DISORDERS,3,Major,Major,Medical,Medicare,,,,,Y,88673.6,23206.82
Long Island,Nassau,2908000,000511,NYU Langone Hospital-Long Island,18 to 29,115,F,Black/African American,Not Span/Hispanic,13,Emergency,Home or Self Care,2020,BLD005,SICKLE CELL TRAIT/ANEMIA,ADM001,TRANSFUSION OF BLOOD AND BLOOD PRODUCTS,662,SICKLE CELL ANEMIA CRISIS,16,DISEASES AND DISORDERS OF THE BLOOD AND BLOOD FORMING ORGANS AND IMMUNOLOGICAL DISORDERS,2,Moderate,Moderate,Medical,Medicaid,,,,,Y,155153.55,61497.43
Long Island,Nassau,2908000,000511,NYU Langone Hospital-Long Island,18 to 29,117,F,Black/African American,Not Span/Hispanic,5,Emergency,Home or Self Care,2020,BLD005,SICKLE CELL TRAIT/ANEMIA,ADM001,TRANSFUSION OF BLOOD AND BLOOD PRODUCTS,662,SICKLE CELL ANEMIA CRISIS,16,DISEASES AND DISORDERS OF THE BLOOD AND BLOOD FORMING ORGANS AND IMMUNOLOGICAL DISORDERS,3,Major,Major,Medical,Medicaid,,,,,Y,72639.13,25192.19
Long Island,Nassau,2908000,000511,NYU Langone Hospital-Long Island,0 to 17,117,M,Other Race,Spanish/Hispanic,5,Emergency,Home or Self Care,2020,BLD005,SICKLE CELL TRAIT/ANEMIA,,,662,SICKLE CELL ANEMIA CRISIS,16,DISEASES AND DISORDERS OF THE BLOOD AND BLOOD FORMING ORGANS AND IMMUNOLOGICAL DISORDERS,2,Moderate,Minor,Medical,Medicaid,,,,,Y,50813.16,15152.39
Long Island,Nassau,2908000,000511,NYU Langone Hospital-Long Island,0 to 17,117,M,Other Race,Spanish/Hispanic,2,Emergency,Home or Self Care,2020,BLD005,SICKLE CELL TRAIT/ANEMIA,ADM001,TRANSFUSION OF BLOOD AND BLOOD PRODUCTS,662,SICKLE CELL ANEMIA CRISIS,16,DISEASES AND DISORDERS OF THE BLOOD AND BLOOD FORMING ORGANS AND IMMUNOLOGICAL DISORDERS,1,Minor,Minor,Medical,Medicaid,,,,,Y,38855.25,9407.95
Long Island,Nassau,2908000,000511,NYU Langone Hospital-Long Island,18 to 29,110,M,Black/African American,Not Span/Hispanic,3,Emergency,Home or Self Care,2020,BLD005,SICKLE CELL TRAIT/ANEMIA,,,662,SICKLE CELL ANEMIA CRISIS,16,DISEASES AND DISORDERS OF THE BLOOD AND BLOOD FORMING ORGANS AND IMMUNOLOGICAL DISORDERS,3,Major,Moderate,Medical,Medicaid,,,,,Y,42108.3,15146.39
Long Island,Nassau,2908000,000511,NYU Langone Hospital-Long Island,18 to 29,115,F,Black/African American,Not Span/Hispanic,1,Emergency,Left Against Medical Advice,2020,BLD005,SICKLE CELL TRAIT/ANEMIA,,,662,SICKLE CELL ANEMIA CRISIS,16,DISEASES AND DISORDERS OF THE BLOOD AND BLOOD FORMING ORGANS AND IMMUNOLOGICAL DISORDERS,3,Major,Minor,Medical,Private Health Insurance,,,,,Y,24418.68,6346.01
Long Island,Nassau,2908000,000511,NYU Langone Hospital-Long Island,30 to 49,115,M,Black/African American,Not Span/Hispanic,4,Emergency,Home or Self Care,2020,BLD005,SICKLE CELL TRAIT/ANEMIA,,,662,SICKLE CELL ANEMIA CRISIS,16,DISEASES AND DISORDERS OF THE BLOOD AND BLOOD FORMING ORGANS AND IMMUNOLOGICAL DISORDERS,2,Moderate,Minor,Medical,Medicaid,,,,,Y,62880.13,20856.24
Long Island,Nassau,2908000,000511,NYU Langone Hospital-Long Island,50 to 69,114,M,Black/African American,Not Span/Hispanic,3,Emergency,Home or Self Care,2020,BLD005,SICKLE CELL TRAIT/ANEMIA,,,662,SICKLE CELL ANEMIA CRISIS,16,DISEASES AND DISORDERS OF THE BLOOD AND BLOOD FORMING ORGANS AND IMMUNOLOGICAL DISORDERS,3,Major,Major,Medical,Medicare,,,,,Y,51709.07,16098.28
Long Island,Nassau,2908000,000511,NYU Langone Hospital-Long Island,18 to 29,115,M,Black/African American,Not Span/Hispanic,21,Emergency,Skilled Nursing Home,2020,BLD005,SICKLE CELL TRAIT/ANEMIA,RES007,AIRWAY INTUBATION,662,SICKLE CELL ANEMIA CRISIS,16,DISEASES AND DISORDERS OF THE BLOOD AND BLOOD FORMING ORGANS AND IMMUNOLOGICAL DISORDERS,3,Major,Extreme,Medical,Private Health Insurance,Medicaid,,,,Y,342606.34,121786.73
Long Island,Nassau,2908000,000511,NYU Langone Hospital-Long Island,0 to 17,115,M,Black/African American,Not Span/Hispanic,1,Emergency,Home or Self Care,2020,BLD005,SICKLE CELL TRAIT/ANEMIA,ADM001,TRANSFUSION OF BLOOD AND BLOOD PRODUCTS,662,SICKLE CELL ANEMIA CRISIS,16,DISEASES AND DISORDERS OF THE BLOOD AND BLOOD FORMING ORGANS AND IMMUNOLOGICAL DISORDERS,2,Moderate,Minor,Medical,Medicaid,,,,,Y,23106.28,4484.84
Long Island,Nassau,2908000,000511,NYU Langone Hospital-Long Island,0 to 17,114,M,Black/African American,Not Span/Hispanic,6,Emergency,Home or Self Care,2020,BLD005,SICKLE CELL TRAIT/ANEMIA,ADM001,TRANSFUSION OF BLOOD AND BLOOD PRODUCTS,662,SICKLE CELL ANEMIA CRISIS,16,DISEASES AND DISORDERS OF THE BLOOD AND BLOOD FORMING ORGANS AND IMMUNOLOGICAL DISORDERS,2,Moderate,Minor,Medical,Private Health Insurance,,,,,Y,83170.87,20402.88
Long Island,Nassau,2908000,000511,NYU Langone Hospital-Long Island,18 to 29,110,M,Black/African American,Not Span/Hispanic,8,Emergency,Home or Self Care,2020,BLD005,SICKLE CELL TRAIT/ANEMIA,,,662,SICKLE CELL ANEMIA CRISIS,16,DISEASES AND DISORDERS OF THE BLOOD AND BLOOD FORMING ORGANS AND IMMUNOLOGICAL DISORDERS,1,Minor,Minor,Medical,Medicaid,,,,,Y,101891.98,39033.77
Long Island,Nassau,2908000,000511,NYU Langone Hospital-Long Island,18 to 29,115,M,Black/African American,Not Span/Hispanic,1,Emergency,Left Against Medical Advice,2020,BLD005,SICKLE CELL TRAIT/ANEMIA,,,662,SICKLE CELL ANEMIA CRISIS,16,DISEASES AND DISORDERS OF THE BLOOD AND BLOOD FORMING ORGANS AND IMMUNOLOGICAL DISORDERS,1,Minor,Minor,Medical,Medicaid,,,,,Y,21217.05,5922.17
Long Island,Nassau,2908000,000511,NYU Langone Hospital-Long Island,0 to 17,115,F,Black/African American,Not Span/Hispanic,7,Emergency,Home or Self Care,2020,BLD005,SICKLE CELL TRAIT/ANEMIA,ADM001,TRANSFUSION OF BLOOD AND BLOOD PRODUCTS,662,SICKLE CELL ANEMIA CRISIS,16,DISEASES AND DISORDERS OF THE BLOOD AND BLOOD FORMING ORGANS AND IMMUNOLOGICAL DISORDERS,2,Moderate,Minor,Medical,Medicaid,,,,,Y,78099.29,21408.93
Long Island,Nassau,2908000,000511,NYU Langone Hospital-Long Island,0 to 17,115,M,Black/African American,Not Span/Hispanic,5,Emergency,Home or Self Care,2020,BLD005,SICKLE CELL TRAIT/ANEMIA,ADM001,TRANSFUSION OF BLOOD AND BLOOD PRODUCTS,662,SICKLE CELL ANEMIA CRISIS,16,DISEASES AND DISORDERS OF THE BLOOD AND BLOOD FORMING ORGANS AND IMMUNOLOGICAL DISORDERS,2,Moderate,Minor,Medical,Medicaid,,,,,Y,57120.74,15426.81
Long Island,Nassau,2908000,000511,NYU Langone Hospital-Long Island,30 to 49,115,F,Black/African American,Not Span/Hispanic,4,Emergency,Home or Self Care,2020,BLD005,SICKLE CELL TRAIT/ANEMIA,ADM001,TRANSFUSION OF BLOOD AND BLOOD PRODUCTS,662,SICKLE CELL ANEMIA CRISIS,16,DISEASES AND DISORDERS OF THE BLOOD AND BLOOD FORMING ORGANS AND IMMUNOLOGICAL DISORDERS,2,Moderate,Minor,Medical,Medicare,Medicaid,,,,Y,63337.42,20866.87
Long Island,Nassau,2908000,000511,NYU Langone Hospital-Long Island,18 to 29,110,M,Black/African American,Not Span/Hispanic,9,Emergency,Home or Self Care,2020,BLD005,SICKLE CELL TRAIT/ANEMIA,ADM001,TRANSFUSION OF BLOOD AND BLOOD PRODUCTS,662,SICKLE CELL ANEMIA CRISIS,16,DISEASES AND DISORDERS OF THE BLOOD AND BLOOD FORMING ORGANS AND IMMUNOLOGICAL DISORDERS,1,Minor,Minor,Medical,Medicaid,,,,,Y,133288.85,45257.32
Long Island,Nassau,2908000,000511,NYU Langone Hospital-Long Island,50 to 69,115,F,Black/African American,Not Span/Hispanic,2,Emergency,Home or Self Care,2020,BLD005,SICKLE CELL TRAIT/ANEMIA,,,662,SICKLE CELL ANEMIA CRISIS,16,DISEASES AND DISORDERS OF THE BLOOD AND BLOOD FORMING ORGANS AND IMMUNOLOGICAL DISORDERS,2,Moderate,Moderate,Medical,Private Health Insurance,,,,,Y,35627.21,10936.06
Long Island,Nassau,2908000,000511,NYU Langone Hospital-Long Island,18 to 29,,M,Black/African American,Spanish/Hispanic,2,Emergency,Home or Self Care,2020,BLD005,SICKLE CELL TRAIT/ANEMIA,,,662,SICKLE CELL ANEMIA CRISIS,16,DISEASES AND DISORDERS OF THE BLOOD AND BLOOD FORMING ORGANS AND IMMUNOLOGICAL DISORDERS,1,Minor,Minor,Medical,Medicaid,,,,,Y,29956.84,10385.2
Long Island,Nassau,2908000,000511,NYU Langone Hospital-Long Island,30 to 49,115,F,Black/African American,Not Span/Hispanic,6,Emergency,Left Against Medical Advice,2020,BLD005,SICKLE CELL TRAIT/ANEMIA,ADM001,TRANSFUSION OF BLOOD AND BLOOD PRODUCTS,662,SICKLE CELL ANEMIA CRISIS,16,DISEASES AND DISORDERS OF THE BLOOD AND BLOOD FORMING ORGANS AND IMMUNOLOGICAL DISORDERS,2,Moderate,Minor,Medical,Medicare,Medicaid,,,,Y,102045.52,32321.36
Long Island,Nassau,2908000,000511,NYU Langone Hospital-Long Island,0 to 17,110,F,Black/African American,Not Span/Hispanic,1,Elective,Home or Self Care,2020,BLD005,SICKLE CELL TRAIT/ANEMIA,,,662,SICKLE CELL ANEMIA CRISIS,16,DISEASES AND DISORDERS OF THE BLOOD AND BLOOD FORMING ORGANS AND IMMUNOLOGICAL DISORDERS,1,Minor,Minor,Medical,Private Health Insurance,Blue Cross/Blue Shield,,,,N,10320.84,2966.66
Long Island,Nassau,2908000,000511,NYU Langone Hospital-Long Island,50 to 69,115,F,Black/African American,Not Span/Hispanic,5,Emergency,Home or Self Care,2020,BLD005,SICKLE CELL TRAIT/ANEMIA,,,662,SICKLE CELL ANEMIA CRISIS,16,DISEASES AND DISORDERS OF THE BLOOD AND BLOOD FORMING ORGANS AND IMMUNOLOGICAL DISORDERS,2,Moderate,Moderate,Medical,Private Health Insurance,,,,,Y,78793.69,26433.32
Long Island,Nassau,2908000,000511,NYU Langone Hospital-Long Island,18 to 29,115,M,Black/African American,Not Span/Hispanic,3,Emergency,Home or Self Care,2020,BLD005,SICKLE CELL TRAIT/ANEMIA,OTR004,ISOLATION PROCEDURES,662,SICKLE CELL ANEMIA CRISIS,16,DISEASES AND DISORDERS OF THE BLOOD AND BLOOD FORMING ORGANS AND IMMUNOLOGICAL DISORDERS,1,Minor,Minor,Medical,Medicaid,,,,,Y,45368.39,15378.63
Long Island,Nassau,2908000,000511,NYU Langone Hospital-Long Island,30 to 49,115,F,Black/African American,Not Span/Hispanic,5,Emergency,Home or Self Care,2020,BLD005,SICKLE CELL TRAIT/ANEMIA,ADM001,TRANSFUSION OF BLOOD AND BLOOD PRODUCTS,662,SICKLE CELL ANEMIA CRISIS,16,DISEASES AND DISORDERS OF THE BLOOD AND BLOOD FORMING ORGANS AND IMMUNOLOGICAL DISORDERS,1,Minor,Minor,Medical,Medicaid,,,,,Y,67397.89,24233.39
Long Island,Nassau,2908000,000511,NYU Langone Hospital-Long Island,0 to 17,110,F,Black/African American,Not Span/Hispanic,1,Emergency,Home or Self Care,2020,BLD005,SICKLE CELL TRAIT/ANEMIA,,,662,SICKLE CELL ANEMIA CRISIS,16,DISEASES AND DISORDERS OF THE BLOOD AND BLOOD FORMING ORGANS AND IMMUNOLOGICAL DISORDERS,2,Moderate,Minor,Medical,Private Health Insurance,,,,,Y,21693.8,4472.76
Long Island,Nassau,2908000,000511,NYU Langone Hospital-Long Island,0 to 17,110,F,Black/African American,Not Span/Hispanic,1,Emergency,Home or Self Care,2020,BLD005,SICKLE CELL TRAIT/ANEMIA,,,662,SICKLE CELL ANEMIA CRISIS,16,DISEASES AND DISORDERS OF THE BLOOD AND BLOOD FORMING ORGANS AND IMMUNOLOGICAL DISORDERS,1,Minor,Minor,Medical,Private Health Insurance,,,,,Y,19535.31,4210.49
Long Island,Nassau,2908000,000511,NYU Langone Hospital-Long Island,30 to 49,,M,Black/African American,Not Span/Hispanic,5,Emergency,Home or Self Care,2020,BLD005,SICKLE CELL TRAIT/ANEMIA,OTR004,ISOLATION PROCEDURES,662,SICKLE CELL ANEMIA CRISIS,16,DISEASES AND DISORDERS OF THE BLOOD AND BLOOD FORMING ORGANS AND IMMUNOLOGICAL DISORDERS,2,Moderate,Moderate,Medical,Medicaid,,,,,Y,73512.27,24884.41
Long Island,Nassau,2908000,000511,NYU Langone Hospital-Long Island,30 to 49,110,F,Black/African American,Not Span/Hispanic,1,Emergency,Home or Self Care,2020,BLD005,SICKLE CELL TRAIT/ANEMIA,ADM001,TRANSFUSION OF BLOOD AND BLOOD PRODUCTS,662,SICKLE CELL ANEMIA CRISIS,16,DISEASES AND DISORDERS OF THE BLOOD AND BLOOD FORMING ORGANS AND IMMUNOLOGICAL DISORDERS,2,Moderate,Minor,Medical,Private Health Insurance,,,,,Y,32686.72,7247.53
Long Island,Nassau,2908000,000511,NYU Langone Hospital-Long Island,18 to 29,110,M,Black/African American,Not Span/Hispanic,1,Emergency,Home or Self Care,2020,BLD005,SICKLE CELL TRAIT/ANEMIA,,,662,SICKLE CELL ANEMIA CRISIS,16,DISEASES AND DISORDERS OF THE BLOOD AND BLOOD FORMING ORGANS AND IMMUNOLOGICAL DISORDERS,1,Minor,Minor,Medical,Medicaid,,,,,Y,20951.21,5973.65
Long Island,Nassau,2908000,000511,NYU Langone Hospital-Long Island,30 to 49,OOS,F,Black/African American,Not Span/Hispanic,3,Emergency,Left Against Medical Advice,2020,BLD005,SICKLE CELL TRAIT/ANEMIA,,,662,SICKLE CELL ANEMIA CRISIS,16,DISEASES AND DISORDERS OF THE BLOOD AND BLOOD FORMING ORGANS AND IMMUNOLOGICAL DISORDERS,2,Moderate,Moderate,Medical,Self-Pay,,,,,Y,43349.06,11198.13
Long Island,Nassau,2908000,000511,NYU Langone Hospital-Long Island,18 to 29,115,F,Black/African American,Not Span/Hispanic,1,Emergency,Home or Self Care,2020,BLD005,SICKLE CELL TRAIT/ANEMIA,,,662,SICKLE CELL ANEMIA CRISIS,16,DISEASES AND DISORDERS OF THE BLOOD AND BLOOD FORMING ORGANS AND IMMUNOLOGICAL DISORDERS,1,Minor,Minor,Medical,Private Health Insurance,,,,,Y,17734.7,5612.62
