Hospital Service Area,Hospital County,Operating Certificate Number,Permanent Facility Id,Facility Name,Age Group,Zip Code - 3 digits,Gender,Race,Ethnicity,Length of Stay,Type of Admission,Patient Disposition,Discharge Year,CCS Diagnosis Code,CCS Diagnosis Description,CCS Procedure Code,CCS Procedure Description,APR DRG Code,APR DRG Description,APR MDC Code,APR MDC Description,APR Severity of Illness Code,APR Severity of Illness Description,APR Risk of Mortality,APR Medical Surgical Description,Payment Typology 1,Payment Typology 2,Payment Typology 3,Birth Weight,Abortion Edit Indicator,Emergency Department Indicator,Total Charges,Total Costs
Long Island,Suffolk,5123000,000885,Long Island Community Hospital,70 or Older,117,F,Other Race,Not Span/Hispanic,11,Emergency,Skilled Nursing Home,2020,BLD001,NUTRITIONAL ANEMIA,ADM001,TRANSFUSION OF BLOOD AND BLOOD PRODUCTS,663,OTHER ANEMIA & DISORDERS OF BLOOD & BLOOD-FORMING ORGANS,16,DISEASES AND DISORDERS OF THE BLOOD AND BLOOD FORMING ORGANS AND IMMUNOLOGICAL DISORDERS,3,Major,Moderate,Medical,Medicare,Medicare,Private Health Insurance,,,Y,93734.36,17445.08
Long Island,Suffolk,5123000,000885,Long Island Community Hospital,50 to 69,117,F,White,Not Span/Hispanic,6,Emergency,Home or Self Care,2020,BLD001,NUTRITIONAL ANEMIA,ADM001,TRANSFUSION OF BLOOD AND BLOOD PRODUCTS,663,OTHER ANEMIA & DISORDERS OF BLOOD & BLOOD-FORMING ORGANS,16,DISEASES AND DISORDERS OF THE BLOOD AND BLOOD FORMING ORGANS AND IMMUNOLOGICAL DISORDERS,1,Minor,Minor,Medical,Blue Cross/Blue Shield,,,,,Y,57810.7,14150.73
Long Island,Suffolk,5123000,000885,Long Island Community Hospital,70 or Older,117,M,White,Not Span/Hispanic,1,Emergency,Home or Self Care,2020,INJ010,"INTERNAL ORGAN INJURY, INITIAL ENCOUNTER",ADM001,TRANSFUSION OF BLOOD AND BLOOD PRODUCTS,663,OTHER ANEMIA & DISORDERS OF BLOOD & BLOOD-FORMING ORGANS,16,DISEASES AND DISORDERS OF THE BLOOD AND BLOOD FORMING ORGANS AND IMMUNOLOGICAL DISORDERS,3,Major,Moderate,Medical,Medicare,,,,,Y,65412.25,5321.31
Long Island,Suffolk,5123000,000885,Long Island Community Hospital,50 to 69,119,F,White,Not Span/Hispanic,1,Emergency,Home or Self Care,2020,BLD001,NUTRITIONAL ANEMIA,ADM001,TRANSFUSION OF BLOOD AND BLOOD PRODUCTS,663,OTHER ANEMIA & DISORDERS OF BLOOD & BLOOD-FORMING ORGANS,16,DISEASES AND DISORDERS OF THE BLOOD AND BLOOD FORMING ORGANS AND IMMUNOLOGICAL DISORDERS,1,Minor,Minor,Medical,Private Health Insurance,,,,,Y,27164.69,4403.69
Long Island,Suffolk,5123000,000885,Long Island Community Hospital,50 to 69,117,F,Black/African American,Not Span/Hispanic,5,Emergency,Home or Self Care,2020,BLD001,NUTRITIONAL ANEMIA,ADM001,TRANSFUSION OF BLOOD AND BLOOD PRODUCTS,663,OTHER ANEMIA & DISORDERS OF BLOOD & BLOOD-FORMING ORGANS,16,DISEASES AND DISORDERS OF THE BLOOD AND BLOOD FORMING ORGANS AND IMMUNOLOGICAL DISORDERS,1,Minor,Minor,Medical,Medicare,,,,,Y,50922.91,8634.57
Long Island,Suffolk,5123000,000885,Long Island Community Hospital,70 or Older,117,F,White,Not Span/Hispanic,1,Emergency,Skilled Nursing Home,2020,BLD001,NUTRITIONAL ANEMIA,ADM001,TRANSFUSION OF BLOOD AND BLOOD PRODUCTS,663,OTHER ANEMIA & DISORDERS OF BLOOD & BLOOD-FORMING ORGANS,16,DISEASES AND DISORDERS OF THE BLOOD AND BLOOD FORMING ORGANS AND IMMUNOLOGICAL DISORDERS,3,Major,Major,Medical,Medicare,Medicare,Private Health Insurance,,,Y,15985.26,2769.81
Long Island,Suffolk,5123000,000885,Long Island Community Hospital,70 or Older,117,F,White,Not Span/Hispanic,1,Emergency,Skilled Nursing Home,2020,BLD004,ACUTE POSTHEMORRHAGIC ANEMIA,ADM001,TRANSFUSION OF BLOOD AND BLOOD PRODUCTS,663,OTHER ANEMIA & DISORDERS OF BLOOD & BLOOD-FORMING ORGANS,16,DISEASES AND DISORDERS OF THE BLOOD AND BLOOD FORMING ORGANS AND IMMUNOLOGICAL DISORDERS,1,Minor,Minor,Medical,Medicare,Medicare,Medicaid,,,Y,33026.31,5294.85
Long Island,Suffolk,5123000,000885,Long Island Community Hospital,70 or Older,119,M,White,Not Span/Hispanic,2,Emergency,Skilled Nursing Home,2020,BLD004,ACUTE POSTHEMORRHAGIC ANEMIA,ADM001,TRANSFUSION OF BLOOD AND BLOOD PRODUCTS,663,OTHER ANEMIA & DISORDERS OF BLOOD & BLOOD-FORMING ORGANS,16,DISEASES AND DISORDERS OF THE BLOOD AND BLOOD FORMING ORGANS AND IMMUNOLOGICAL DISORDERS,1,Minor,Minor,Medical,Medicare,,,,,Y,27826.3,5062.45
Long Island,Suffolk,5123000,000885,Long Island Community Hospital,70 or Older,117,F,White,Not Span/Hispanic,7,Emergency,Home or Self Care,2020,BLD001,NUTRITIONAL ANEMIA,ADM001,TRANSFUSION OF BLOOD AND BLOOD PRODUCTS,663,OTHER ANEMIA & DISORDERS OF BLOOD & BLOOD-FORMING ORGANS,16,DISEASES AND DISORDERS OF THE BLOOD AND BLOOD FORMING ORGANS AND IMMUNOLOGICAL DISORDERS,2,Moderate,Moderate,Medical,Medicare,Medicare,Blue Cross/Blue Shield,,,Y,81024.21,14171.68
Long Island,Suffolk,5123000,000885,Long Island Community Hospital,50 to 69,117,M,White,Not Span/Hispanic,4,Emergency,Home or Self Care,2020,BLD010,OTHER SPECIFIED AND UNSPECIFIED HEMATOLOGIC CONDITIONS,OTR004,ISOLATION PROCEDURES,663,OTHER ANEMIA & DISORDERS OF BLOOD & BLOOD-FORMING ORGANS,16,DISEASES AND DISORDERS OF THE BLOOD AND BLOOD FORMING ORGANS AND IMMUNOLOGICAL DISORDERS,2,Moderate,Minor,Medical,Medicare,,,,,Y,44800.89,6301.12
Long Island,Suffolk,5123000,000885,Long Island Community Hospital,50 to 69,117,F,White,Not Span/Hispanic,1,Emergency,Home or Self Care,2020,INJ010,"INTERNAL ORGAN INJURY, INITIAL ENCOUNTER",,,663,OTHER ANEMIA & DISORDERS OF BLOOD & BLOOD-FORMING ORGANS,16,DISEASES AND DISORDERS OF THE BLOOD AND BLOOD FORMING ORGANS AND IMMUNOLOGICAL DISORDERS,2,Moderate,Minor,Medical,Private Health Insurance,Blue Cross/Blue Shield,,,,Y,43346.73,3321.2
Long Island,Suffolk,5123000,000885,Long Island Community Hospital,70 or Older,117,M,White,Not Span/Hispanic,2,Emergency,Home w/ Home Health Services,2020,BLD001,NUTRITIONAL ANEMIA,ADM001,TRANSFUSION OF BLOOD AND BLOOD PRODUCTS,663,OTHER ANEMIA & DISORDERS OF BLOOD & BLOOD-FORMING ORGANS,16,DISEASES AND DISORDERS OF THE BLOOD AND BLOOD FORMING ORGANS AND IMMUNOLOGICAL DISORDERS,2,Moderate,Moderate,Medical,Medicare,Medicare,Private Health Insurance,,,Y,36824.78,5112.09
Long Island,Suffolk,5123000,000885,Long Island Community Hospital,70 or Older,117,M,White,Not Span/Hispanic,2,Emergency,Home w/ Home Health Services,2020,BLD001,NUTRITIONAL ANEMIA,ADM001,TRANSFUSION OF BLOOD AND BLOOD PRODUCTS,663,OTHER ANEMIA & DISORDERS OF BLOOD & BLOOD-FORMING ORGANS,16,DISEASES AND DISORDERS OF THE BLOOD AND BLOOD FORMING ORGANS AND IMMUNOLOGICAL DISORDERS,3,Major,Major,Medical,Medicare,,,,,Y,54689.63,5517.93
Long Island,Suffolk,5123000,000885,Long Island Community Hospital,70 or Older,119,F,White,Not Span/Hispanic,7,Emergency,Home w/ Home Health Services,2020,BLD003,APLASTIC ANEMIA,GIS001,ESOPHAGOGASTRODUODENOSCOPY (EGD) WITH BIOPSY,663,OTHER ANEMIA & DISORDERS OF BLOOD & BLOOD-FORMING ORGANS,16,DISEASES AND DISORDERS OF THE BLOOD AND BLOOD FORMING ORGANS AND IMMUNOLOGICAL DISORDERS,1,Minor,Moderate,Medical,Medicare,,,,,Y,66890.96,14753.28
Long Island,Suffolk,5123000,000885,Long Island Community Hospital,70 or Older,119,F,White,Not Span/Hispanic,3,Emergency,Home w/ Home Health Services,2020,NEO074,CONDITIONS DUE TO NEOPLASM OR THE TREATMENT OF NEOPLASM,ADM001,TRANSFUSION OF BLOOD AND BLOOD PRODUCTS,663,OTHER ANEMIA & DISORDERS OF BLOOD & BLOOD-FORMING ORGANS,16,DISEASES AND DISORDERS OF THE BLOOD AND BLOOD FORMING ORGANS AND IMMUNOLOGICAL DISORDERS,3,Major,Major,Medical,Medicare,Medicare,Private Health Insurance,,,Y,39653.36,6101.59
Long Island,Suffolk,5123000,000885,Long Island Community Hospital,50 to 69,119,M,White,Not Span/Hispanic,2,Elective,Home or Self Care,2020,BLD003,APLASTIC ANEMIA,GIS001,ESOPHAGOGASTRODUODENOSCOPY (EGD) WITH BIOPSY,663,OTHER ANEMIA & DISORDERS OF BLOOD & BLOOD-FORMING ORGANS,16,DISEASES AND DISORDERS OF THE BLOOD AND BLOOD FORMING ORGANS AND IMMUNOLOGICAL DISORDERS,2,Moderate,Minor,Medical,Medicare,Medicare,,,,N,57479.76,8709.8
Long Island,Suffolk,5123000,000885,Long Island Community Hospital,70 or Older,117,F,White,Not Span/Hispanic,3,Emergency,Home or Self Care,2020,BLD004,ACUTE POSTHEMORRHAGIC ANEMIA,ADM001,TRANSFUSION OF BLOOD AND BLOOD PRODUCTS,663,OTHER ANEMIA & DISORDERS OF BLOOD & BLOOD-FORMING ORGANS,16,DISEASES AND DISORDERS OF THE BLOOD AND BLOOD FORMING ORGANS AND IMMUNOLOGICAL DISORDERS,2,Moderate,Moderate,Medical,Medicare,Medicaid,,,,Y,40631.39,8838.8
Long Island,Suffolk,5123000,000885,Long Island Community Hospital,50 to 69,117,F,White,Not Span/Hispanic,3,Emergency,Home or Self Care,2020,BLD001,NUTRITIONAL ANEMIA,ADM001,TRANSFUSION OF BLOOD AND BLOOD PRODUCTS,663,OTHER ANEMIA & DISORDERS OF BLOOD & BLOOD-FORMING ORGANS,16,DISEASES AND DISORDERS OF THE BLOOD AND BLOOD FORMING ORGANS AND IMMUNOLOGICAL DISORDERS,2,Moderate,Minor,Medical,Private Health Insurance,,,,,Y,56335.07,9647.2
Long Island,Suffolk,5123000,000885,Long Island Community Hospital,70 or Older,119,M,White,Not Span/Hispanic,6,Emergency,Skilled Nursing Home,2020,BLD003,APLASTIC ANEMIA,ADM001,TRANSFUSION OF BLOOD AND BLOOD PRODUCTS,663,OTHER ANEMIA & DISORDERS OF BLOOD & BLOOD-FORMING ORGANS,16,DISEASES AND DISORDERS OF THE BLOOD AND BLOOD FORMING ORGANS AND IMMUNOLOGICAL DISORDERS,1,Minor,Minor,Medical,Medicare,,,,,Y,43951.42,8984.86
Long Island,Suffolk,5123000,000885,Long Island Community Hospital,70 or Older,117,F,White,Not Span/Hispanic,4,Emergency,Home w/ Home Health Services,2020,BLD004,ACUTE POSTHEMORRHAGIC ANEMIA,GIS001,ESOPHAGOGASTRODUODENOSCOPY (EGD) WITH BIOPSY,663,OTHER ANEMIA & DISORDERS OF BLOOD & BLOOD-FORMING ORGANS,16,DISEASES AND DISORDERS OF THE BLOOD AND BLOOD FORMING ORGANS AND IMMUNOLOGICAL DISORDERS,2,Moderate,Moderate,Medical,Medicare,Medicare,Private Health Insurance,,,Y,69338.54,11465.02
Long Island,Suffolk,5123000,000885,Long Island Community Hospital,50 to 69,117,F,White,Not Span/Hispanic,1,Emergency,Home or Self Care,2020,BLD003,APLASTIC ANEMIA,ADM001,TRANSFUSION OF BLOOD AND BLOOD PRODUCTS,663,OTHER ANEMIA & DISORDERS OF BLOOD & BLOOD-FORMING ORGANS,16,DISEASES AND DISORDERS OF THE BLOOD AND BLOOD FORMING ORGANS AND IMMUNOLOGICAL DISORDERS,1,Minor,Minor,Medical,Private Health Insurance,,,,,Y,12490.9,2324.6
Long Island,Suffolk,5123000,000885,Long Island Community Hospital,50 to 69,117,M,White,Not Span/Hispanic,1,Emergency,Home or Self Care,2020,INJ010,"INTERNAL ORGAN INJURY, INITIAL ENCOUNTER",PLC001,IMMOBILIZATION BY SPLINT OR OTHER EXTERNAL DEVICE,663,OTHER ANEMIA & DISORDERS OF BLOOD & BLOOD-FORMING ORGANS,16,DISEASES AND DISORDERS OF THE BLOOD AND BLOOD FORMING ORGANS AND IMMUNOLOGICAL DISORDERS,2,Moderate,Minor,Medical,Private Health Insurance,Medicare,Medicare,,,Y,46866.97,2659.3
Long Island,Suffolk,5123000,000885,Long Island Community Hospital,70 or Older,119,M,White,Not Span/Hispanic,1,Emergency,Left Against Medical Advice,2020,BLD004,ACUTE POSTHEMORRHAGIC ANEMIA,ADM001,TRANSFUSION OF BLOOD AND BLOOD PRODUCTS,663,OTHER ANEMIA & DISORDERS OF BLOOD & BLOOD-FORMING ORGANS,16,DISEASES AND DISORDERS OF THE BLOOD AND BLOOD FORMING ORGANS AND IMMUNOLOGICAL DISORDERS,1,Minor,Minor,Medical,Medicare,Medicare,Blue Cross/Blue Shield,,,Y,20056.88,3200.12
Long Island,Suffolk,5123000,000885,Long Island Community Hospital,70 or Older,117,F,White,Not Span/Hispanic,2,Emergency,Skilled Nursing Home,2020,BLD003,APLASTIC ANEMIA,ADM001,TRANSFUSION OF BLOOD AND BLOOD PRODUCTS,663,OTHER ANEMIA & DISORDERS OF BLOOD & BLOOD-FORMING ORGANS,16,DISEASES AND DISORDERS OF THE BLOOD AND BLOOD FORMING ORGANS AND IMMUNOLOGICAL DISORDERS,3,Major,Major,Medical,Medicare,Medicare,Private Health Insurance,,,Y,36543.24,5220.71
Long Island,Suffolk,5123000,000885,Long Island Community Hospital,50 to 69,119,M,White,Not Span/Hispanic,4,Emergency,Home or Self Care,2020,BLD004,ACUTE POSTHEMORRHAGIC ANEMIA,ADM001,TRANSFUSION OF BLOOD AND BLOOD PRODUCTS,663,OTHER ANEMIA & DISORDERS OF BLOOD & BLOOD-FORMING ORGANS,16,DISEASES AND DISORDERS OF THE BLOOD AND BLOOD FORMING ORGANS AND IMMUNOLOGICAL DISORDERS,3,Major,Moderate,Medical,Medicaid,,,,,Y,38175.74,7379.72
Long Island,Suffolk,5123000,000885,Long Island Community Hospital,70 or Older,119,F,White,Not Span/Hispanic,2,Emergency,Home or Self Care,2020,BLD004,ACUTE POSTHEMORRHAGIC ANEMIA,GIS001,ESOPHAGOGASTRODUODENOSCOPY (EGD) WITH BIOPSY,663,OTHER ANEMIA & DISORDERS OF BLOOD & BLOOD-FORMING ORGANS,16,DISEASES AND DISORDERS OF THE BLOOD AND BLOOD FORMING ORGANS AND IMMUNOLOGICAL DISORDERS,3,Major,Moderate,Medical,Medicare,Medicare,Blue Cross/Blue Shield,,,Y,40164.09,7683.81
Long Island,Suffolk,5123000,000885,Long Island Community Hospital,70 or Older,117,F,White,Not Span/Hispanic,7,Emergency,Skilled Nursing Home,2020,BLD007,DISEASES OF WHITE BLOOD CELLS,,,663,OTHER ANEMIA & DISORDERS OF BLOOD & BLOOD-FORMING ORGANS,16,DISEASES AND DISORDERS OF THE BLOOD AND BLOOD FORMING ORGANS AND IMMUNOLOGICAL DISORDERS,2,Moderate,Moderate,Medical,Medicare,,,,,Y,43020.66,9612.18
Long Island,Suffolk,5123000,000885,Long Island Community Hospital,70 or Older,117,F,Other Race,Not Span/Hispanic,5,Emergency,Skilled Nursing Home,2020,BLD001,NUTRITIONAL ANEMIA,ADM001,TRANSFUSION OF BLOOD AND BLOOD PRODUCTS,663,OTHER ANEMIA & DISORDERS OF BLOOD & BLOOD-FORMING ORGANS,16,DISEASES AND DISORDERS OF THE BLOOD AND BLOOD FORMING ORGANS AND IMMUNOLOGICAL DISORDERS,2,Moderate,Minor,Medical,Medicare,Medicare,,,,Y,62835.58,8974.46
Long Island,Suffolk,5123000,000885,Long Island Community Hospital,70 or Older,117,M,White,Not Span/Hispanic,6,Emergency,Skilled Nursing Home,2020,BLD004,ACUTE POSTHEMORRHAGIC ANEMIA,ADM001,TRANSFUSION OF BLOOD AND BLOOD PRODUCTS,663,OTHER ANEMIA & DISORDERS OF BLOOD & BLOOD-FORMING ORGANS,16,DISEASES AND DISORDERS OF THE BLOOD AND BLOOD FORMING ORGANS AND IMMUNOLOGICAL DISORDERS,2,Moderate,Moderate,Medical,Medicare,Medicare,Medicaid,,,Y,69502.94,13127.69
Long Island,Suffolk,5123000,000885,Long Island Community Hospital,70 or Older,117,F,Other Race,Not Span/Hispanic,8,Emergency,Home or Self Care,2020,BLD001,NUTRITIONAL ANEMIA,MAM005,MEASUREMENT DURING CARDIAC CATHETERIZATION,663,OTHER ANEMIA & DISORDERS OF BLOOD & BLOOD-FORMING ORGANS,16,DISEASES AND DISORDERS OF THE BLOOD AND BLOOD FORMING ORGANS AND IMMUNOLOGICAL DISORDERS,2,Moderate,Minor,Medical,Medicare,,,,,Y,101273.45,20554.2
Long Island,Suffolk,5123000,000885,Long Island Community Hospital,18 to 29,119,F,Other Race,Not Span/Hispanic,4,Emergency,Left Against Medical Advice,2020,BLD001,NUTRITIONAL ANEMIA,,,663,OTHER ANEMIA & DISORDERS OF BLOOD & BLOOD-FORMING ORGANS,16,DISEASES AND DISORDERS OF THE BLOOD AND BLOOD FORMING ORGANS AND IMMUNOLOGICAL DISORDERS,2,Moderate,Moderate,Medical,Private Health Insurance,,,,,Y,47686.27,7708.75
Long Island,Suffolk,5123000,000885,Long Island Community Hospital,50 to 69,117,M,White,Not Span/Hispanic,1,Emergency,Short-term Hospital,2020,BLD004,ACUTE POSTHEMORRHAGIC ANEMIA,ADM001,TRANSFUSION OF BLOOD AND BLOOD PRODUCTS,663,OTHER ANEMIA & DISORDERS OF BLOOD & BLOOD-FORMING ORGANS,16,DISEASES AND DISORDERS OF THE BLOOD AND BLOOD FORMING ORGANS AND IMMUNOLOGICAL DISORDERS,2,Moderate,Moderate,Medical,Private Health Insurance,Medicaid,,,,Y,17340.58,2962.24
Long Island,Suffolk,5123000,000885,Long Island Community Hospital,70 or Older,119,F,White,Not Span/Hispanic,8,Emergency,Home or Self Care,2020,BLD004,ACUTE POSTHEMORRHAGIC ANEMIA,GNR004,ENDOSCOPIC CONTROL OF BLEEDING,663,OTHER ANEMIA & DISORDERS OF BLOOD & BLOOD-FORMING ORGANS,16,DISEASES AND DISORDERS OF THE BLOOD AND BLOOD FORMING ORGANS AND IMMUNOLOGICAL DISORDERS,2,Moderate,Minor,Medical,Medicare,,,,,Y,75854.34,16734.2
Long Island,Suffolk,5123000,000885,Long Island Community Hospital,30 to 49,117,F,White,Not Span/Hispanic,4,Emergency,Home or Self Care,2020,BLD004,ACUTE POSTHEMORRHAGIC ANEMIA,ADM001,TRANSFUSION OF BLOOD AND BLOOD PRODUCTS,663,OTHER ANEMIA & DISORDERS OF BLOOD & BLOOD-FORMING ORGANS,16,DISEASES AND DISORDERS OF THE BLOOD AND BLOOD FORMING ORGANS AND IMMUNOLOGICAL DISORDERS,3,Major,Moderate,Medical,Private Health Insurance,Medicaid,,,,Y,37643.02,7490.44
Long Island,Suffolk,5123000,000885,Long Island Community Hospital,70 or Older,117,M,White,Not Span/Hispanic,1,Emergency,Short-term Hospital,2020,BLD004,ACUTE POSTHEMORRHAGIC ANEMIA,ADM001,TRANSFUSION OF BLOOD AND BLOOD PRODUCTS,663,OTHER ANEMIA & DISORDERS OF BLOOD & BLOOD-FORMING ORGANS,16,DISEASES AND DISORDERS OF THE BLOOD AND BLOOD FORMING ORGANS AND IMMUNOLOGICAL DISORDERS,2,Moderate,Moderate,Medical,Medicare,Medicare,Private Health Insurance,,,Y,36531.92,2755.44
Long Island,Suffolk,5123000,000885,Long Island Community Hospital,70 or Older,117,M,Other Race,Not Span/Hispanic,6,Emergency,Home or Self Care,2020,BLD001,NUTRITIONAL ANEMIA,ADM001,TRANSFUSION OF BLOOD AND BLOOD PRODUCTS,663,OTHER ANEMIA & DISORDERS OF BLOOD & BLOOD-FORMING ORGANS,16,DISEASES AND DISORDERS OF THE BLOOD AND BLOOD FORMING ORGANS AND IMMUNOLOGICAL DISORDERS,1,Minor,Minor,Medical,Medicare,Medicare,,,,Y,58191.27,13114.36
Long Island,Suffolk,5123000,000885,Long Island Community Hospital,70 or Older,117,M,White,Not Span/Hispanic,6,Emergency,Home or Self Care,2020,BLD001,NUTRITIONAL ANEMIA,ESA004,NON-INVASIVE VENTILATION,663,OTHER ANEMIA & DISORDERS OF BLOOD & BLOOD-FORMING ORGANS,16,DISEASES AND DISORDERS OF THE BLOOD AND BLOOD FORMING ORGANS AND IMMUNOLOGICAL DISORDERS,2,Moderate,Major,Medical,Medicare,Medicare,Private Health Insurance,,,Y,76225.62,16086.2
Long Island,Suffolk,5123000,000885,Long Island Community Hospital,50 to 69,117,M,White,Not Span/Hispanic,5,Emergency,Home w/ Home Health Services,2020,BLD004,ACUTE POSTHEMORRHAGIC ANEMIA,MST020,SUBCUTANEOUS TISSUE AND FASCIA EXCISION,663,OTHER ANEMIA & DISORDERS OF BLOOD & BLOOD-FORMING ORGANS,16,DISEASES AND DISORDERS OF THE BLOOD AND BLOOD FORMING ORGANS AND IMMUNOLOGICAL DISORDERS,3,Major,Major,Medical,Medicare,Medicare,Blue Cross/Blue Shield,,,Y,79473.28,12907.42
Long Island,Suffolk,5123000,000885,Long Island Community Hospital,18 to 29,117,F,Black/African American,Not Span/Hispanic,3,Emergency,Home or Self Care,2020,BLD004,ACUTE POSTHEMORRHAGIC ANEMIA,ADM001,TRANSFUSION OF BLOOD AND BLOOD PRODUCTS,663,OTHER ANEMIA & DISORDERS OF BLOOD & BLOOD-FORMING ORGANS,16,DISEASES AND DISORDERS OF THE BLOOD AND BLOOD FORMING ORGANS AND IMMUNOLOGICAL DISORDERS,3,Major,Major,Medical,Private Health Insurance,,,,,Y,49622.24,7542.83
Long Island,Suffolk,5123000,000885,Long Island Community Hospital,70 or Older,119,F,White,Not Span/Hispanic,4,Emergency,Home w/ Home Health Services,2020,BLD001,NUTRITIONAL ANEMIA,ADM001,TRANSFUSION OF BLOOD AND BLOOD PRODUCTS,663,OTHER ANEMIA & DISORDERS OF BLOOD & BLOOD-FORMING ORGANS,16,DISEASES AND DISORDERS OF THE BLOOD AND BLOOD FORMING ORGANS AND IMMUNOLOGICAL DISORDERS,2,Moderate,Moderate,Medical,Medicare,Medicare,,,,Y,63226.36,8329.2
Long Island,Suffolk,5123000,000885,Long Island Community Hospital,50 to 69,117,F,Other Race,Not Span/Hispanic,9,Emergency,Home w/ Home Health Services,2020,BLD004,ACUTE POSTHEMORRHAGIC ANEMIA,ADM001,TRANSFUSION OF BLOOD AND BLOOD PRODUCTS,663,OTHER ANEMIA & DISORDERS OF BLOOD & BLOOD-FORMING ORGANS,16,DISEASES AND DISORDERS OF THE BLOOD AND BLOOD FORMING ORGANS AND IMMUNOLOGICAL DISORDERS,2,Moderate,Moderate,Medical,Medicare,Medicare,Medicaid,,,Y,80485.83,16066.81
