Hospital Service Area,Hospital County,Operating Certificate Number,Permanent Facility Id,Facility Name,Age Group,Zip Code - 3 digits,Gender,Race,Ethnicity,Length of Stay,Type of Admission,Patient Disposition,Discharge Year,CCS Diagnosis Code,CCS Diagnosis Description,CCS Procedure Code,CCS Procedure Description,APR DRG Code,APR DRG Description,APR MDC Code,APR MDC Description,APR Severity of Illness Code,APR Severity of Illness Description,APR Risk of Mortality,APR Medical Surgical Description,Payment Typology 1,Payment Typology 2,Payment Typology 3,Birth Weight,Abortion Edit Indicator,Emergency Department Indicator,Total Charges,Total Costs
New York City,Bronx,7000006,001169,Montefiore Medical Center - Henry & Lucy Moses Div,18 to 29,104,F,Black/African American,Not Span/Hispanic,4,Emergency,Expired,2017,039,Leukemias,224,CANCER CHEMOTHERAPY,681,Other O.R. procedures for lymphatic/hematopoietic/other neoplasms,17,"Lymphatic, Hematopoietic, Other Malignancies, Chemotherapy and Radiotherapy",4,Extreme,Extreme,Surgical,Private Health Insurance,,,,N,Y,193977.55,35652.75
New York City,Kings,7002002,001324,Mount Sinai Brooklyn,30 to 49,,F,White,Unknown,3,Emergency,Short-term Hospital,2017,038,Non-Hodgkin`s lymphoma,067,OT THER PRCS; HEM/LYMPH,681,Other O.R. procedures for lymphatic/hematopoietic/other neoplasms,17,"Lymphatic, Hematopoietic, Other Malignancies, Chemotherapy and Radiotherapy",3,Major,Minor,Surgical,Private Health Insurance,Self-Pay,,,N,Y,53125.49,9988.74
New York City,Manhattan,7002024,001456,Mount Sinai Hospital,30 to 49,104,F,Black/African American,Not Span/Hispanic,5,Elective,Home w/ Home Health Services,2017,041,Cancer; other and unspecified primary,040,OT DX PRCS OF RESP TRCT,681,Other O.R. procedures for lymphatic/hematopoietic/other neoplasms,17,"Lymphatic, Hematopoietic, Other Malignancies, Chemotherapy and Radiotherapy",2,Moderate,Moderate,Surgical,Private Health Insurance,Medicaid,Self-Pay,,N,N,69615.01,23408.57
New York City,Manhattan,7002002,001439,Mount Sinai Beth Israel,70 or Older,OOS,M,White,Not Span/Hispanic,2,Elective,Home or Self Care,2017,042,Secondary malignancies,160,OT THER PRCS ON MUSCLES,681,Other O.R. procedures for lymphatic/hematopoietic/other neoplasms,17,"Lymphatic, Hematopoietic, Other Malignancies, Chemotherapy and Radiotherapy",3,Major,Major,Surgical,Medicare,Miscellaneous/Other,Self-Pay,,N,N,40549.02,13920.38
New York City,Manhattan,7002002,001439,Mount Sinai Beth Israel,30 to 49,112,F,Black/African American,Spanish/Hispanic,8,Emergency,Home or Self Care,2017,042,Secondary malignancies,067,OT THER PRCS; HEM/LYMPH,681,Other O.R. procedures for lymphatic/hematopoietic/other neoplasms,17,"Lymphatic, Hematopoietic, Other Malignancies, Chemotherapy and Radiotherapy",3,Major,Major,Surgical,Medicaid,Self-Pay,,,N,Y,87210.89,21562.07
New York City,Manhattan,7002024,001456,Mount Sinai Hospital,70 or Older,105,F,White,Not Span/Hispanic,31,Elective,Home w/ Home Health Services,2017,042,Secondary malignancies,033,OTHER OR THER PRCS NOSE,681,Other O.R. procedures for lymphatic/hematopoietic/other neoplasms,17,"Lymphatic, Hematopoietic, Other Malignancies, Chemotherapy and Radiotherapy",3,Major,Major,Surgical,Medicare,Private Health Insurance,Self-Pay,,N,N,256018.79,84789.80
New York City,Manhattan,7002024,001456,Mount Sinai Hospital,70 or Older,103,F,White,Not Span/Hispanic,2,Elective,Home or Self Care,2017,042,Secondary malignancies,160,OT THER PRCS ON MUSCLES,681,Other O.R. procedures for lymphatic/hematopoietic/other neoplasms,17,"Lymphatic, Hematopoietic, Other Malignancies, Chemotherapy and Radiotherapy",2,Moderate,Minor,Surgical,Medicare,Blue Cross/Blue Shield,Self-Pay,,N,N,37655.10,14563.72
New York City,Manhattan,7002024,001456,Mount Sinai Hospital,70 or Older,105,F,White,Not Span/Hispanic,3,Elective,Home w/ Home Health Services,2017,042,Secondary malignancies,031,DX PRCS ON NOSE & MOUTH,681,Other O.R. procedures for lymphatic/hematopoietic/other neoplasms,17,"Lymphatic, Hematopoietic, Other Malignancies, Chemotherapy and Radiotherapy",1,Minor,Moderate,Surgical,Medicare,Self-Pay,,,N,N,37280.20,14473.12
New York City,Manhattan,7002024,001456,Mount Sinai Hospital,50 to 69,104,F,Black/African American,Not Span/Hispanic,20,Emergency,Hospice - Home,2017,043,Malignant neoplasm without specification of site,097,OTHER GI DX PRCS,681,Other O.R. procedures for lymphatic/hematopoietic/other neoplasms,17,"Lymphatic, Hematopoietic, Other Malignancies, Chemotherapy and Radiotherapy",4,Extreme,Major,Surgical,Medicare,Medicare,Medicaid,,N,Y,171883.02,59707.33
New York City,Manhattan,7002024,001456,Mount Sinai Hospital,50 to 69,105,M,White,Not Span/Hispanic,21,Emergency,Home or Self Care,2017,039,Leukemias,009,OTHER OR THER NERV SYS,681,Other O.R. procedures for lymphatic/hematopoietic/other neoplasms,17,"Lymphatic, Hematopoietic, Other Malignancies, Chemotherapy and Radiotherapy",3,Major,Major,Surgical,Private Health Insurance,Self-Pay,,,N,Y,723450.03,320660.48
New York City,Manhattan,7002032,001469,Mount Sinai St. Luke's,30 to 49,112,M,Black/African American,Not Span/Hispanic,10,Emergency,Home or Self Care,2017,042,Secondary malignancies,067,OT THER PRCS; HEM/LYMPH,681,Other O.R. procedures for lymphatic/hematopoietic/other neoplasms,17,"Lymphatic, Hematopoietic, Other Malignancies, Chemotherapy and Radiotherapy",3,Major,Major,Surgical,Medicaid,Medicaid,Self-Pay,,N,Y,95378.73,26089.34
New York City,Bronx,7000006,001169,Montefiore Medical Center - Henry & Lucy Moses Div,30 to 49,104,F,Other Race,Spanish/Hispanic,6,Emergency,Home or Self Care,2017,038,Non-Hodgkin`s lymphoma,011,DX ENDOCRINE PRCS,681,Other O.R. procedures for lymphatic/hematopoietic/other neoplasms,17,"Lymphatic, Hematopoietic, Other Malignancies, Chemotherapy and Radiotherapy",2,Moderate,Minor,Surgical,Medicaid,,,,N,Y,176704.37,30634.39
New York City,Manhattan,7002002,001439,Mount Sinai Beth Israel,0 to 17,112,F,Other Race,Not Span/Hispanic,2,Urgent,Home or Self Care,2017,042,Secondary malignancies,067,OT THER PRCS; HEM/LYMPH,681,Other O.R. procedures for lymphatic/hematopoietic/other neoplasms,17,"Lymphatic, Hematopoietic, Other Malignancies, Chemotherapy and Radiotherapy",2,Moderate,Minor,Surgical,Private Health Insurance,Self-Pay,,,N,N,41941.78,13349.21
New York City,Manhattan,7002024,001456,Mount Sinai Hospital,18 to 29,109,M,White,Not Span/Hispanic,10,Urgent,Home or Self Care,2017,037,Hodgkin`s disease,067,OT THER PRCS; HEM/LYMPH,681,Other O.R. procedures for lymphatic/hematopoietic/other neoplasms,17,"Lymphatic, Hematopoietic, Other Malignancies, Chemotherapy and Radiotherapy",3,Major,Major,Surgical,Blue Cross/Blue Shield,Self-Pay,,,N,N,146265.82,33187.53
New York City,Kings,7001021,001306,New York - Presbyterian Brooklyn Methodist Hospital,50 to 69,112,M,Black/African American,Not Span/Hispanic,2,Elective,Home or Self Care,2017,045,Maintenance chemotherapy; radiotherapy,061,OT OR PRCS VES NOT HEAD,681,Other O.R. procedures for lymphatic/hematopoietic/other neoplasms,17,"Lymphatic, Hematopoietic, Other Malignancies, Chemotherapy and Radiotherapy",2,Moderate,Major,Surgical,Medicare,Medicare,Self-Pay,,N,N,24602.08,6117.47
New York City,Manhattan,7002024,001456,Mount Sinai Hospital,50 to 69,105,M,White,Not Span/Hispanic,22,Urgent,Home w/ Home Health Services,2017,040,Multiple myeloma,224,CANCER CHEMOTHERAPY,681,Other O.R. procedures for lymphatic/hematopoietic/other neoplasms,17,"Lymphatic, Hematopoietic, Other Malignancies, Chemotherapy and Radiotherapy",3,Major,Major,Surgical,Medicare,Medicare,Self-Pay,,N,N,230409.76,74924.87
New York City,Manhattan,7002024,001456,Mount Sinai Hospital,70 or Older,113,M,Other Race,Not Span/Hispanic,40,Emergency,Expired,2017,039,Leukemias,216,RESP INTUB/MECH VENTIL,681,Other O.R. procedures for lymphatic/hematopoietic/other neoplasms,17,"Lymphatic, Hematopoietic, Other Malignancies, Chemotherapy and Radiotherapy",4,Extreme,Major,Surgical,Medicare,Self-Pay,,,N,Y,518919.06,191124.09
New York City,Manhattan,7002024,001456,Mount Sinai Hospital,50 to 69,100,F,Black/African American,Not Span/Hispanic,2,Emergency,Home or Self Care,2017,042,Secondary malignancies,067,OT THER PRCS; HEM/LYMPH,681,Other O.R. procedures for lymphatic/hematopoietic/other neoplasms,17,"Lymphatic, Hematopoietic, Other Malignancies, Chemotherapy and Radiotherapy",2,Moderate,Moderate,Surgical,Medicare,Medicaid,Self-Pay,,N,Y,34757.83,10346.78
New York City,Manhattan,7002054,001458,New York Presbyterian Hospital - New York Weill Cornell Center,50 to 69,100,F,Other Race,Spanish/Hispanic,10,Emergency,Home w/ Home Health Services,2017,038,Non-Hodgkin`s lymphoma,065,BONE MARROW BIOPSY,681,Other O.R. procedures for lymphatic/hematopoietic/other neoplasms,17,"Lymphatic, Hematopoietic, Other Malignancies, Chemotherapy and Radiotherapy",2,Moderate,Minor,Surgical,Blue Cross/Blue Shield,Self-Pay,,,N,Y,154275.87,47973.52
New York City,Manhattan,7002054,001458,New York Presbyterian Hospital - New York Weill Cornell Center,18 to 29,100,F,Other Race,Spanish/Hispanic,2,Emergency,Home or Self Care,2017,038,Non-Hodgkin`s lymphoma,067,OT THER PRCS; HEM/LYMPH,681,Other O.R. procedures for lymphatic/hematopoietic/other neoplasms,17,"Lymphatic, Hematopoietic, Other Malignancies, Chemotherapy and Radiotherapy",3,Major,Moderate,Surgical,Medicaid,Medicaid,Self-Pay,,N,Y,31484.34,8125.17
New York City,Manhattan,7002054,001464,New York Presbyterian Hospital - Columbia Presbyterian Center,70 or Older,104,M,White,Not Span/Hispanic,4,Elective,Home w/ Home Health Services,2017,042,Secondary malignancies,067,OT THER PRCS; HEM/LYMPH,681,Other O.R. procedures for lymphatic/hematopoietic/other neoplasms,17,"Lymphatic, Hematopoietic, Other Malignancies, Chemotherapy and Radiotherapy",1,Minor,Minor,Surgical,Medicare,Blue Cross/Blue Shield,Self-Pay,,N,N,60566.19,17205.01
New York City,Manhattan,7002054,001464,New York Presbyterian Hospital - Columbia Presbyterian Center,18 to 29,,M,White,Not Span/Hispanic,5,Emergency,Home or Self Care,2017,037,Hodgkin`s disease,067,OT THER PRCS; HEM/LYMPH,681,Other O.R. procedures for lymphatic/hematopoietic/other neoplasms,17,"Lymphatic, Hematopoietic, Other Malignancies, Chemotherapy and Radiotherapy",2,Moderate,Moderate,Surgical,Private Health Insurance,Self-Pay,,,N,Y,59950.49,15750.13
New York City,Manhattan,7002054,001464,New York Presbyterian Hospital - Columbia Presbyterian Center,50 to 69,100,M,Black/African American,Not Span/Hispanic,2,Urgent,Home or Self Care,2017,045,Maintenance chemotherapy; radiotherapy,061,OT OR PRCS VES NOT HEAD,681,Other O.R. procedures for lymphatic/hematopoietic/other neoplasms,17,"Lymphatic, Hematopoietic, Other Malignancies, Chemotherapy and Radiotherapy",1,Minor,Moderate,Surgical,Medicare,Medicaid,Self-Pay,,N,N,47992.48,18807.53
New York City,Manhattan,7002054,001464,New York Presbyterian Hospital - Columbia Presbyterian Center,18 to 29,100,F,Multi-racial,Multi-ethnic,7,Emergency,Home w/ Home Health Services,2017,037,Hodgkin`s disease,067,OT THER PRCS; HEM/LYMPH,681,Other O.R. procedures for lymphatic/hematopoietic/other neoplasms,17,"Lymphatic, Hematopoietic, Other Malignancies, Chemotherapy and Radiotherapy",3,Major,Moderate,Surgical,Medicaid,Medicaid,Self-Pay,,N,Y,153442.30,69352.62
New York City,Queens,7003010,001637,New York - Presbyterian/Queens,70 or Older,113,F,Other Race,Spanish/Hispanic,4,Elective,Home w/ Home Health Services,2017,042,Secondary malignancies,067,OT THER PRCS; HEM/LYMPH,681,Other O.R. procedures for lymphatic/hematopoietic/other neoplasms,17,"Lymphatic, Hematopoietic, Other Malignancies, Chemotherapy and Radiotherapy",2,Moderate,Major,Surgical,Medicare,Medicare,Self-Pay,,N,N,35026.72,12852.61
New York City,Manhattan,7002024,001456,Mount Sinai Hospital,50 to 69,114,F,Black/African American,Not Span/Hispanic,13,Urgent,Hospice - Home,2017,039,Leukemias,216,RESP INTUB/MECH VENTIL,681,Other O.R. procedures for lymphatic/hematopoietic/other neoplasms,17,"Lymphatic, Hematopoietic, Other Malignancies, Chemotherapy and Radiotherapy",4,Extreme,Major,Surgical,Medicare,Medicaid,Self-Pay,,N,N,249775.83,83017.13
New York City,Manhattan,7002053,001463,NYU Langone Hospitals,70 or Older,100,M,White,Not Span/Hispanic,2,Elective,Home or Self Care,2017,042,Secondary malignancies,033,OTHER OR THER PRCS NOSE,681,Other O.R. procedures for lymphatic/hematopoietic/other neoplasms,17,"Lymphatic, Hematopoietic, Other Malignancies, Chemotherapy and Radiotherapy",2,Moderate,Minor,Surgical,Medicare,,,,N,N,75292.77,15514.93
Western NY,Erie,1401014,000208,Women And Children's Hospital Of Buffalo,0 to 17,142,F,White,Not Span/Hispanic,6,Urgent,Home w/ Home Health Services,2017,037,Hodgkin`s disease,067,OT THER PRCS; HEM/LYMPH,681,Other O.R. procedures for lymphatic/hematopoietic/other neoplasms,17,"Lymphatic, Hematopoietic, Other Malignancies, Chemotherapy and Radiotherapy",2,Moderate,Minor,Surgical,Medicaid,Self-Pay,,,N,Y,54362.61,19845.06
Western NY,Erie,1401005,000210,Erie County Medical Center,50 to 69,140,F,White,Not Span/Hispanic,3,Elective,Home or Self Care,2017,042,Secondary malignancies,067,OT THER PRCS; HEM/LYMPH,681,Other O.R. procedures for lymphatic/hematopoietic/other neoplasms,17,"Lymphatic, Hematopoietic, Other Malignancies, Chemotherapy and Radiotherapy",1,Minor,Minor,Surgical,Self-Pay,,,,N,N,13407.93,8802.72
Capital/Adirond,Albany,0101003,000004,Albany Memorial Hospital,50 to 69,120,M,White,Not Span/Hispanic,4,Emergency,Short-term Hospital,2017,042,Secondary malignancies,067,OT THER PRCS; HEM/LYMPH,681,Other O.R. procedures for lymphatic/hematopoietic/other neoplasms,17,"Lymphatic, Hematopoietic, Other Malignancies, Chemotherapy and Radiotherapy",3,Major,Major,Surgical,Blue Cross/Blue Shield,Medicare,Self-Pay,,N,Y,30962.93,8244.46
Hudson Valley,Orange,3523000,000699,Orange Regional Medical Center,70 or Older,109,F,White,Not Span/Hispanic,7,Emergency,Skilled Nursing Home,2017,042,Secondary malignancies,067,OT THER PRCS; HEM/LYMPH,681,Other O.R. procedures for lymphatic/hematopoietic/other neoplasms,17,"Lymphatic, Hematopoietic, Other Malignancies, Chemotherapy and Radiotherapy",3,Major,Moderate,Surgical,Medicare,Private Health Insurance,,,N,Y,65138.17,14857.90
Hudson Valley,Orange,3523000,000699,Orange Regional Medical Center,50 to 69,127,M,White,Not Span/Hispanic,2,Urgent,Home or Self Care,2017,042,Secondary malignancies,067,OT THER PRCS; HEM/LYMPH,681,Other O.R. procedures for lymphatic/hematopoietic/other neoplasms,17,"Lymphatic, Hematopoietic, Other Malignancies, Chemotherapy and Radiotherapy",2,Moderate,Moderate,Surgical,Medicare,Private Health Insurance,,,N,N,15809.18,3676.53
New York City,Bronx,7000006,001169,Montefiore Medical Center - Henry & Lucy Moses Div,50 to 69,104,M,Other Race,Spanish/Hispanic,22,Emergency,Home w/ Home Health Services,2017,038,Non-Hodgkin`s lymphoma,067,OT THER PRCS; HEM/LYMPH,681,Other O.R. procedures for lymphatic/hematopoietic/other neoplasms,17,"Lymphatic, Hematopoietic, Other Malignancies, Chemotherapy and Radiotherapy",4,Extreme,Extreme,Surgical,Medicare,Medicaid,,,N,Y,352296.17,69110.81
New York City,Bronx,7000006,001169,Montefiore Medical Center - Henry & Lucy Moses Div,50 to 69,104,M,Other Race,Spanish/Hispanic,30,Emergency,Hospice - Medical Facility,2017,039,Leukemias,088,ABDOMINAL PARACENTESIS,681,Other O.R. procedures for lymphatic/hematopoietic/other neoplasms,17,"Lymphatic, Hematopoietic, Other Malignancies, Chemotherapy and Radiotherapy",3,Major,Moderate,Surgical,Blue Cross/Blue Shield,,,,N,N,402488.37,77754.30
New York City,Bronx,7000006,003058,Montefiore Med Center - Jack D Weiler Hosp of A Einstein College Div,30 to 49,104,F,Other Race,Spanish/Hispanic,18,Emergency,Home or Self Care,2017,039,Leukemias,009,OTHER OR THER NERV SYS,681,Other O.R. procedures for lymphatic/hematopoietic/other neoplasms,17,"Lymphatic, Hematopoietic, Other Malignancies, Chemotherapy and Radiotherapy",3,Major,Minor,Surgical,Medicaid,,,,N,Y,319317.57,62599.07
New York City,Manhattan,7002024,001456,Mount Sinai Hospital,70 or Older,125,M,White,Not Span/Hispanic,8,Elective,Home or Self Care,2017,043,Malignant neoplasm without specification of site,084,CHOLECYSTECTOMY/EXPLOR,681,Other O.R. procedures for lymphatic/hematopoietic/other neoplasms,17,"Lymphatic, Hematopoietic, Other Malignancies, Chemotherapy and Radiotherapy",4,Extreme,Major,Surgical,Medicare,Blue Cross/Blue Shield,Self-Pay,,N,N,78588.32,30102.49
New York City,Richmond,7004003,001740,Staten Island University Hosp-North,50 to 69,103,F,White,Not Span/Hispanic,1,Elective,Home or Self Care,2017,043,Malignant neoplasm without specification of site,097,OTHER GI DX PRCS,681,Other O.R. procedures for lymphatic/hematopoietic/other neoplasms,17,"Lymphatic, Hematopoietic, Other Malignancies, Chemotherapy and Radiotherapy",1,Minor,Minor,Surgical,Medicare,Medicare,,,N,N,26017.23,6602.73
New York City,Richmond,7004003,001740,Staten Island University Hosp-North,70 or Older,103,F,Other Race,Not Span/Hispanic,22,Emergency,Expired,2017,038,Non-Hodgkin`s lymphoma,092,OTHER BOWEL DX PRCS,681,Other O.R. procedures for lymphatic/hematopoietic/other neoplasms,17,"Lymphatic, Hematopoietic, Other Malignancies, Chemotherapy and Radiotherapy",4,Extreme,Extreme,Surgical,Medicaid,Medicaid,,,N,Y,346554.59,92895.37
New York City,Richmond,7004003,001740,Staten Island University Hosp-North,70 or Older,103,F,White,Not Span/Hispanic,6,Emergency,Home w/ Home Health Services,2017,038,Non-Hodgkin`s lymphoma,067,OT THER PRCS; HEM/LYMPH,681,Other O.R. procedures for lymphatic/hematopoietic/other neoplasms,17,"Lymphatic, Hematopoietic, Other Malignancies, Chemotherapy and Radiotherapy",3,Major,Major,Surgical,Medicare,Medicaid,,,N,Y,49323.66,9638.36
New York City,Richmond,7004003,001740,Staten Island University Hosp-North,50 to 69,103,M,White,Not Span/Hispanic,6,Emergency,Home or Self Care,2017,038,Non-Hodgkin`s lymphoma,067,OT THER PRCS; HEM/LYMPH,681,Other O.R. procedures for lymphatic/hematopoietic/other neoplasms,17,"Lymphatic, Hematopoietic, Other Malignancies, Chemotherapy and Radiotherapy",3,Major,Moderate,Surgical,Medicare,Blue Cross/Blue Shield,,,N,Y,67943.64,13158.76
Central NY,Oneida,3202002,000598,St Elizabeth Medical Center,50 to 69,135,M,White,Not Span/Hispanic,2,Elective,Home or Self Care,2017,042,Secondary malignancies,067,OT THER PRCS; HEM/LYMPH,681,Other O.R. procedures for lymphatic/hematopoietic/other neoplasms,17,"Lymphatic, Hematopoietic, Other Malignancies, Chemotherapy and Radiotherapy",1,Minor,Moderate,Surgical,Blue Cross/Blue Shield,,,,N,N,16352.55,6875.79
New York City,Bronx,7000006,001169,Montefiore Medical Center - Henry & Lucy Moses Div,18 to 29,104,F,White,Not Span/Hispanic,8,Emergency,Home or Self Care,2017,037,Hodgkin`s disease,067,OT THER PRCS; HEM/LYMPH,681,Other O.R. procedures for lymphatic/hematopoietic/other neoplasms,17,"Lymphatic, Hematopoietic, Other Malignancies, Chemotherapy and Radiotherapy",2,Moderate,Minor,Surgical,Medicaid,,,,N,Y,103862.02,21524.28
New York City,Manhattan,7002024,001456,Mount Sinai Hospital,70 or Older,112,M,Black/African American,Not Span/Hispanic,1,Elective,Home or Self Care,2017,043,Malignant neoplasm without specification of site,061,OT OR PRCS VES NOT HEAD,681,Other O.R. procedures for lymphatic/hematopoietic/other neoplasms,17,"Lymphatic, Hematopoietic, Other Malignancies, Chemotherapy and Radiotherapy",1,Minor,Minor,Surgical,Medicare,Medicare,Self-Pay,,N,N,11643.09,5337.01
New York City,Manhattan,7002024,001456,Mount Sinai Hospital,70 or Older,OOS,M,White,Not Span/Hispanic,1,Elective,Home or Self Care,2017,042,Secondary malignancies,067,OT THER PRCS; HEM/LYMPH,681,Other O.R. procedures for lymphatic/hematopoietic/other neoplasms,17,"Lymphatic, Hematopoietic, Other Malignancies, Chemotherapy and Radiotherapy",2,Moderate,Moderate,Surgical,Medicare,Blue Cross/Blue Shield,Self-Pay,,N,N,24228.64,10100.84
Long Island,Suffolk,5154001,000925,Good Samaritan Hospital Medical Center,70 or Older,117,F,White,Not Span/Hispanic,20,Emergency,Expired,2017,043,Malignant neoplasm without specification of site,098,OT NON-OR GI THER PRCS,681,Other O.R. procedures for lymphatic/hematopoietic/other neoplasms,17,"Lymphatic, Hematopoietic, Other Malignancies, Chemotherapy and Radiotherapy",3,Major,Major,Surgical,Medicare,Private Health Insurance,,,N,Y,187586.54,33449.46
Finger Lakes,Monroe,2701001,000409,Highland Hospital,50 to 69,146,F,White,Not Span/Hispanic,1,Elective,Home or Self Care,2017,043,Malignant neoplasm without specification of site,033,OTHER OR THER PRCS NOSE,681,Other O.R. procedures for lymphatic/hematopoietic/other neoplasms,17,"Lymphatic, Hematopoietic, Other Malignancies, Chemotherapy and Radiotherapy",1,Minor,Minor,Surgical,Medicare,Medicare,,,N,N,13775.95,5951.29
Finger Lakes,Monroe,2701001,000409,Highland Hospital,70 or Older,148,F,White,Not Span/Hispanic,2,Elective,Home or Self Care,2017,042,Secondary malignancies,067,OT THER PRCS; HEM/LYMPH,681,Other O.R. procedures for lymphatic/hematopoietic/other neoplasms,17,"Lymphatic, Hematopoietic, Other Malignancies, Chemotherapy and Radiotherapy",1,Minor,Minor,Surgical,Medicare,Medicare,,,N,N,17695.39,7090.72
Finger Lakes,Monroe,2701001,000409,Highland Hospital,50 to 69,144,M,White,Not Span/Hispanic,7,Emergency,Home or Self Care,2017,037,Hodgkin`s disease,067,OT THER PRCS; HEM/LYMPH,681,Other O.R. procedures for lymphatic/hematopoietic/other neoplasms,17,"Lymphatic, Hematopoietic, Other Malignancies, Chemotherapy and Radiotherapy",1,Minor,Minor,Surgical,Blue Cross/Blue Shield,,,,N,Y,38747.96,12507.30
New York City,Kings,7001003,001288,Brooklyn Hospital Center - Downtown Campus,30 to 49,113,F,Other Race,Unknown,1,Elective,Home or Self Care,2017,042,Secondary malignancies,067,OT THER PRCS; HEM/LYMPH,681,Other O.R. procedures for lymphatic/hematopoietic/other neoplasms,17,"Lymphatic, Hematopoietic, Other Malignancies, Chemotherapy and Radiotherapy",1,Minor,Minor,Surgical,Medicaid,Medicaid,Self-Pay,,N,N,33516.63,9246.74
New York City,Kings,7001020,001305,Maimonides Medical Center,50 to 69,,M,White,Unknown,2,Urgent,Home w/ Home Health Services,2017,042,Secondary malignancies,067,OT THER PRCS; HEM/LYMPH,681,Other O.R. procedures for lymphatic/hematopoietic/other neoplasms,17,"Lymphatic, Hematopoietic, Other Malignancies, Chemotherapy and Radiotherapy",2,Moderate,Minor,Surgical,Medicare,,Medicaid,,N,N,37116.00,12201.14
New York City,Kings,7001020,001305,Maimonides Medical Center,70 or Older,112,F,White,Spanish/Hispanic,1,Elective,Home or Self Care,2017,042,Secondary malignancies,067,OT THER PRCS; HEM/LYMPH,681,Other O.R. procedures for lymphatic/hematopoietic/other neoplasms,17,"Lymphatic, Hematopoietic, Other Malignancies, Chemotherapy and Radiotherapy",2,Moderate,Moderate,Surgical,Medicare,,Self-Pay,,N,N,23997.00,8445.95
New York City,Kings,7001021,001306,New York - Presbyterian Brooklyn Methodist Hospital,30 to 49,112,F,Multi-racial,Spanish/Hispanic,2,Emergency,Home or Self Care,2017,045,Maintenance chemotherapy; radiotherapy,010,THYROIDECTOMY;PART/FULL,681,Other O.R. procedures for lymphatic/hematopoietic/other neoplasms,17,"Lymphatic, Hematopoietic, Other Malignancies, Chemotherapy and Radiotherapy",2,Moderate,Minor,Surgical,Medicaid,Medicaid,Self-Pay,,N,N,26718.70,4791.86
New York City,Kings,7001021,001306,New York - Presbyterian Brooklyn Methodist Hospital,70 or Older,112,F,Black/African American,Not Span/Hispanic,13,Emergency,Home w/ Home Health Services,2017,018,Cancer of other GI organs; peritoneum,099,OT OR GI THER PRCS,681,Other O.R. procedures for lymphatic/hematopoietic/other neoplasms,17,"Lymphatic, Hematopoietic, Other Malignancies, Chemotherapy and Radiotherapy",2,Moderate,Moderate,Surgical,Medicare,Medicare,Medicaid,,N,Y,107395.51,41460.70