Hospital Service Area,Hospital County,Operating Certificate Number,Permanent Facility Id,Facility Name,Age Group,Zip Code - 3 digits,Gender,Race,Ethnicity,Length of Stay,Type of Admission,Patient Disposition,Discharge Year,CCS Diagnosis Code,CCS Diagnosis Description,CCS Procedure Code,CCS Procedure Description,APR DRG Code,APR DRG Description,APR MDC Code,APR MDC Description,APR Severity of Illness Code,APR Severity of Illness Description,APR Risk of Mortality,APR Medical Surgical Description,Payment Typology 1,Payment Typology 2,Payment Typology 3,Birth Weight,Abortion Edit Indicator,Emergency Department Indicator,Total Charges,Total Costs
Long Island,Nassau,2908000,000511,NYU Langone Hospital-Long Island,70 or Older,118,M,Other Race,Not Span/Hispanic,6,Emergency,Home w/ Home Health Services,2019,NEO058,NON-HODGKIN LYMPHOMA,CAR025,PLACEMENT OF TUNNELED OR IMPLANTABLE PORTION OF A VASCULAR ACCESS DEVICE,681,OTHER O.R. PROCEDURES FOR LYMPHATIC/HEMATOPOIETIC/OTHER NEOPLASMS,17,"MYELOPROLIFERATIVE DISEASES AND DISORDERS, AND POORLY DIFFERENTIATED NEOPLASM",4,Extreme,Major,Surgical,Medicare,Medicare,Private Health Insurance,,,true,280004.69,45572.95
Long Island,Nassau,2908000,000511,NYU Langone Hospital-Long Island,30 to 49,117,M,White,Not Span/Hispanic,3,Emergency,Home or Self Care,2019,NEO070,SECONDARY MALIGNANCIES,LYM001,LYMPH NODE BIOPSY,681,OTHER O.R. PROCEDURES FOR LYMPHATIC/HEMATOPOIETIC/OTHER NEOPLASMS,17,"MYELOPROLIFERATIVE DISEASES AND DISORDERS, AND POORLY DIFFERENTIATED NEOPLASM",3,Major,Major,Surgical,Medicaid,Medicaid,,,,true,63008,9425.44
Long Island,Nassau,2908000,000511,NYU Langone Hospital-Long Island,0 to 17,115,M,White,Spanish/Hispanic,13,Emergency,Home or Self Care,2019,NEO058,NON-HODGKIN LYMPHOMA,LYM007,BONE MARROW BIOPSY,681,OTHER O.R. PROCEDURES FOR LYMPHATIC/HEMATOPOIETIC/OTHER NEOPLASMS,17,"MYELOPROLIFERATIVE DISEASES AND DISORDERS, AND POORLY DIFFERENTIATED NEOPLASM",4,Extreme,Moderate,Surgical,Private Health Insurance,,,,,true,632258.3,87777.42
Long Island,Nassau,2908000,000511,NYU Langone Hospital-Long Island,50 to 69,115,M,White,Spanish/Hispanic,1,Elective,Home or Self Care,2019,NEO070,SECONDARY MALIGNANCIES,LYM003,LYMPH NODE DISSECTION,681,OTHER O.R. PROCEDURES FOR LYMPHATIC/HEMATOPOIETIC/OTHER NEOPLASMS,17,"MYELOPROLIFERATIVE DISEASES AND DISORDERS, AND POORLY DIFFERENTIATED NEOPLASM",1,Minor,Minor,Surgical,Medicaid,,,,,false,84017.22,13493.79
Long Island,Nassau,2908000,000511,NYU Langone Hospital-Long Island,30 to 49,112,M,Black/African American,Not Span/Hispanic,5,Emergency,Left Against Medical Advice,2019,NEO070,SECONDARY MALIGNANCIES,LYM001,LYMPH NODE BIOPSY,681,OTHER O.R. PROCEDURES FOR LYMPHATIC/HEMATOPOIETIC/OTHER NEOPLASMS,17,"MYELOPROLIFERATIVE DISEASES AND DISORDERS, AND POORLY DIFFERENTIATED NEOPLASM",3,Major,Moderate,Surgical,Medicare,Medicare,,,,true,122789.85,17743.89
Long Island,Nassau,2908000,000511,NYU Langone Hospital-Long Island,50 to 69,115,M,White,Spanish/Hispanic,7,Emergency,Home or Self Care,2019,NEO058,NON-HODGKIN LYMPHOMA,LYM001,LYMPH NODE BIOPSY,681,OTHER O.R. PROCEDURES FOR LYMPHATIC/HEMATOPOIETIC/OTHER NEOPLASMS,17,"MYELOPROLIFERATIVE DISEASES AND DISORDERS, AND POORLY DIFFERENTIATED NEOPLASM",2,Moderate,Moderate,Surgical,Private Health Insurance,Medicare,,,,true,207139.21,23595.71
Long Island,Nassau,2908000,000511,NYU Langone Hospital-Long Island,50 to 69,115,M,White,Not Span/Hispanic,6,Emergency,Home or Self Care,2019,NEO061,LEUKEMIA - CHRONIC LYMPHOCYTIC LEUKEMIA (CLL),LYM001,LYMPH NODE BIOPSY,681,OTHER O.R. PROCEDURES FOR LYMPHATIC/HEMATOPOIETIC/OTHER NEOPLASMS,17,"MYELOPROLIFERATIVE DISEASES AND DISORDERS, AND POORLY DIFFERENTIATED NEOPLASM",3,Major,Moderate,Surgical,Blue Cross/Blue Shield,,,,,true,160359.2,20640.84
Long Island,Nassau,2908000,000511,NYU Langone Hospital-Long Island,70 or Older,115,M,White,Not Span/Hispanic,10,Emergency,Expired,2019,NEO058,NON-HODGKIN LYMPHOMA,LYM001,LYMPH NODE BIOPSY,681,OTHER O.R. PROCEDURES FOR LYMPHATIC/HEMATOPOIETIC/OTHER NEOPLASMS,17,"MYELOPROLIFERATIVE DISEASES AND DISORDERS, AND POORLY DIFFERENTIATED NEOPLASM",4,Extreme,Extreme,Surgical,Medicare,Medicare,Blue Cross/Blue Shield,,,true,506598.19,68316.1
Long Island,Nassau,2908000,000511,NYU Langone Hospital-Long Island,70 or Older,115,F,Black/African American,Not Span/Hispanic,21,Emergency,Skilled Nursing Home,2019,NEO058,NON-HODGKIN LYMPHOMA,LYM001,LYMPH NODE BIOPSY,681,OTHER O.R. PROCEDURES FOR LYMPHATIC/HEMATOPOIETIC/OTHER NEOPLASMS,17,"MYELOPROLIFERATIVE DISEASES AND DISORDERS, AND POORLY DIFFERENTIATED NEOPLASM",3,Major,Major,Surgical,Medicare,Medicare,,,,true,559242.95,79354.21
Long Island,Nassau,2908000,000511,NYU Langone Hospital-Long Island,50 to 69,115,F,White,Not Span/Hispanic,5,Emergency,Home or Self Care,2019,NEO066,MALIGNANT NEUROENDOCRINE TUMORS,URN009,CYSTECTOMY (INCLUDING FULGURATION) AND URETHRECTOMY,681,OTHER O.R. PROCEDURES FOR LYMPHATIC/HEMATOPOIETIC/OTHER NEOPLASMS,17,"MYELOPROLIFERATIVE DISEASES AND DISORDERS, AND POORLY DIFFERENTIATED NEOPLASM",3,Major,Major,Surgical,Medicare,Medicare,Private Health Insurance,,,true,107880.48,17611.99
Long Island,Nassau,2908000,000511,NYU Langone Hospital-Long Island,70 or Older,115,F,Other Race,Unknown,13,Emergency,Skilled Nursing Home,2019,NEO070,SECONDARY MALIGNANCIES,LYM001,LYMPH NODE BIOPSY,681,OTHER O.R. PROCEDURES FOR LYMPHATIC/HEMATOPOIETIC/OTHER NEOPLASMS,17,"MYELOPROLIFERATIVE DISEASES AND DISORDERS, AND POORLY DIFFERENTIATED NEOPLASM",3,Major,Major,Surgical,Medicare,Medicare,Private Health Insurance,,,true,163608.87,30572.22
Long Island,Nassau,2908000,000511,NYU Langone Hospital-Long Island,50 to 69,117,M,White,Not Span/Hispanic,32,Emergency,Expired,2019,NEO058,NON-HODGKIN LYMPHOMA,MAM005,MEASUREMENT DURING CARDIAC CATHETERIZATION,681,OTHER O.R. PROCEDURES FOR LYMPHATIC/HEMATOPOIETIC/OTHER NEOPLASMS,17,"MYELOPROLIFERATIVE DISEASES AND DISORDERS, AND POORLY DIFFERENTIATED NEOPLASM",4,Extreme,Extreme,Surgical,Federal/State/Local/VA,,,,,true,1229413.52,183004.07
Long Island,Nassau,2908000,000511,NYU Langone Hospital-Long Island,50 to 69,115,M,White,Not Span/Hispanic,2,Emergency,Home or Self Care,2019,NEO070,SECONDARY MALIGNANCIES,LYM001,LYMPH NODE BIOPSY,681,OTHER O.R. PROCEDURES FOR LYMPHATIC/HEMATOPOIETIC/OTHER NEOPLASMS,17,"MYELOPROLIFERATIVE DISEASES AND DISORDERS, AND POORLY DIFFERENTIATED NEOPLASM",2,Moderate,Moderate,Surgical,Blue Cross/Blue Shield,,,,,true,105107.27,15993.71
Long Island,Nassau,2908000,000511,NYU Langone Hospital-Long Island,70 or Older,115,M,White,Not Span/Hispanic,44,Elective,Skilled Nursing Home,2019,FAC006,ENCOUNTER FOR ANTINEOPLASTIC THERAPIES,GIS025,OTHER GI SYSTEM DEVICE PROCEDURES,681,OTHER O.R. PROCEDURES FOR LYMPHATIC/HEMATOPOIETIC/OTHER NEOPLASMS,17,"MYELOPROLIFERATIVE DISEASES AND DISORDERS, AND POORLY DIFFERENTIATED NEOPLASM",4,Extreme,Extreme,Surgical,Medicare,Medicare,Medicaid,,,false,553834.49,95845.51
Long Island,Nassau,2908000,000511,NYU Langone Hospital-Long Island,50 to 69,115,M,Black/African American,Not Span/Hispanic,5,Emergency,Expired,2019,NEO064,LEUKEMIA - ALL OTHER TYPES,LYM001,LYMPH NODE BIOPSY,681,OTHER O.R. PROCEDURES FOR LYMPHATIC/HEMATOPOIETIC/OTHER NEOPLASMS,17,"MYELOPROLIFERATIVE DISEASES AND DISORDERS, AND POORLY DIFFERENTIATED NEOPLASM",4,Extreme,Extreme,Surgical,Medicare,,,,,true,392353.58,47635.97
Long Island,Nassau,2908000,000511,NYU Langone Hospital-Long Island,50 to 69,110,M,White,Spanish/Hispanic,6,Emergency,Home or Self Care,2019,NEO058,NON-HODGKIN LYMPHOMA,RES006,OPEN AND THORACOSCOPIC PLEURAL DRAINAGE,681,OTHER O.R. PROCEDURES FOR LYMPHATIC/HEMATOPOIETIC/OTHER NEOPLASMS,17,"MYELOPROLIFERATIVE DISEASES AND DISORDERS, AND POORLY DIFFERENTIATED NEOPLASM",3,Major,Moderate,Surgical,Private Health Insurance,Medicare,Medicare,,,true,115948.34,18998.19
Long Island,Nassau,2908000,000511,NYU Langone Hospital-Long Island,70 or Older,117,M,White,Not Span/Hispanic,1,Elective,Home or Self Care,2019,NEO057,HODGKIN LYMPHOMA,LYM001,LYMPH NODE BIOPSY,681,OTHER O.R. PROCEDURES FOR LYMPHATIC/HEMATOPOIETIC/OTHER NEOPLASMS,17,"MYELOPROLIFERATIVE DISEASES AND DISORDERS, AND POORLY DIFFERENTIATED NEOPLASM",1,Minor,Minor,Surgical,Medicare,Medicare,,,,false,124401.76,16189.18
Long Island,Nassau,2908000,000511,NYU Langone Hospital-Long Island,70 or Older,114,F,Black/African American,Not Span/Hispanic,4,Emergency,Home w/ Home Health Services,2019,NEO070,SECONDARY MALIGNANCIES,GIS004,GI SYSTEM ENDOSCOPY WITHOUT BIOPSY (DIAGNOSTIC),681,OTHER O.R. PROCEDURES FOR LYMPHATIC/HEMATOPOIETIC/OTHER NEOPLASMS,17,"MYELOPROLIFERATIVE DISEASES AND DISORDERS, AND POORLY DIFFERENTIATED NEOPLASM",3,Major,Major,Surgical,Medicare,Medicare,,,,true,101852.69,14172.05
Long Island,Nassau,2908000,000511,NYU Langone Hospital-Long Island,70 or Older,115,F,White,Not Span/Hispanic,30,Emergency,Skilled Nursing Home,2019,NEO058,NON-HODGKIN LYMPHOMA,LYM001,LYMPH NODE BIOPSY,681,OTHER O.R. PROCEDURES FOR LYMPHATIC/HEMATOPOIETIC/OTHER NEOPLASMS,17,"MYELOPROLIFERATIVE DISEASES AND DISORDERS, AND POORLY DIFFERENTIATED NEOPLASM",4,Extreme,Major,Surgical,Medicare,Medicare,,,,true,772994.94,116459.98
Long Island,Nassau,2908000,000511,NYU Langone Hospital-Long Island,18 to 29,115,M,White,Spanish/Hispanic,5,Emergency,Home w/ Home Health Services,2019,NEO057,HODGKIN LYMPHOMA,LYM001,LYMPH NODE BIOPSY,681,OTHER O.R. PROCEDURES FOR LYMPHATIC/HEMATOPOIETIC/OTHER NEOPLASMS,17,"MYELOPROLIFERATIVE DISEASES AND DISORDERS, AND POORLY DIFFERENTIATED NEOPLASM",2,Moderate,Minor,Surgical,Private Health Insurance,,,,,true,371538.22,48194.08
Long Island,Nassau,2908000,000511,NYU Langone Hospital-Long Island,70 or Older,115,M,White,Not Span/Hispanic,22,Emergency,Skilled Nursing Home,2019,NEO058,NON-HODGKIN LYMPHOMA,LYM001,LYMPH NODE BIOPSY,681,OTHER O.R. PROCEDURES FOR LYMPHATIC/HEMATOPOIETIC/OTHER NEOPLASMS,17,"MYELOPROLIFERATIVE DISEASES AND DISORDERS, AND POORLY DIFFERENTIATED NEOPLASM",4,Extreme,Extreme,Surgical,Blue Cross/Blue Shield,Medicare,,,,true,526204.73,78823.56
Long Island,Nassau,2908000,000511,NYU Langone Hospital-Long Island,70 or Older,115,F,White,Not Span/Hispanic,17,Emergency,Home w/ Home Health Services,2019,NEO070,SECONDARY MALIGNANCIES,LYM001,LYMPH NODE BIOPSY,681,OTHER O.R. PROCEDURES FOR LYMPHATIC/HEMATOPOIETIC/OTHER NEOPLASMS,17,"MYELOPROLIFERATIVE DISEASES AND DISORDERS, AND POORLY DIFFERENTIATED NEOPLASM",3,Major,Major,Surgical,Medicare,Medicare,Private Health Insurance,,,true,199475.47,36604.47
Long Island,Nassau,2908000,000511,NYU Langone Hospital-Long Island,50 to 69,115,F,Black/African American,Not Span/Hispanic,1,Urgent,Home w/ Home Health Services,2019,NEO070,SECONDARY MALIGNANCIES,RES002,"LUNG, PLEURA, OR DIAPHRAGM BIOPSY (NON-ENDOSCOPIC)",681,OTHER O.R. PROCEDURES FOR LYMPHATIC/HEMATOPOIETIC/OTHER NEOPLASMS,17,"MYELOPROLIFERATIVE DISEASES AND DISORDERS, AND POORLY DIFFERENTIATED NEOPLASM",2,Moderate,Moderate,Surgical,Blue Cross/Blue Shield,,,,,false,40206.42,6158.92
Long Island,Nassau,2908000,000511,NYU Langone Hospital-Long Island,70 or Older,117,M,White,Spanish/Hispanic,11,Emergency,Left Against Medical Advice,2019,NEO058,NON-HODGKIN LYMPHOMA,LYM001,LYMPH NODE BIOPSY,681,OTHER O.R. PROCEDURES FOR LYMPHATIC/HEMATOPOIETIC/OTHER NEOPLASMS,17,"MYELOPROLIFERATIVE DISEASES AND DISORDERS, AND POORLY DIFFERENTIATED NEOPLASM",4,Extreme,Major,Surgical,Medicare,Medicare,Private Health Insurance,,,true,262369.22,42133.91
Long Island,Nassau,2908000,000511,NYU Langone Hospital-Long Island,50 to 69,117,M,White,Not Span/Hispanic,7,Emergency,Home or Self Care,2019,NEO058,NON-HODGKIN LYMPHOMA,LYM001,LYMPH NODE BIOPSY,681,OTHER O.R. PROCEDURES FOR LYMPHATIC/HEMATOPOIETIC/OTHER NEOPLASMS,17,"MYELOPROLIFERATIVE DISEASES AND DISORDERS, AND POORLY DIFFERENTIATED NEOPLASM",3,Major,Moderate,Surgical,Blue Cross/Blue Shield,,,,,true,223306.94,30804.41
Long Island,Nassau,2908000,000511,NYU Langone Hospital-Long Island,50 to 69,117,M,White,Not Span/Hispanic,35,Elective,Home w/ Home Health Services,2019,NEO060,LEUKEMIA - ACUTE MYELOID LEUKEMIA (AML),LYM007,BONE MARROW BIOPSY,681,OTHER O.R. PROCEDURES FOR LYMPHATIC/HEMATOPOIETIC/OTHER NEOPLASMS,17,"MYELOPROLIFERATIVE DISEASES AND DISORDERS, AND POORLY DIFFERENTIATED NEOPLASM",4,Extreme,Major,Surgical,Blue Cross/Blue Shield,,,,,true,1057093.6,143921.45
Long Island,Nassau,2908000,000511,NYU Langone Hospital-Long Island,18 to 29,117,F,White,Not Span/Hispanic,5,Emergency,Home or Self Care,2019,NEO058,NON-HODGKIN LYMPHOMA,LYM001,LYMPH NODE BIOPSY,681,OTHER O.R. PROCEDURES FOR LYMPHATIC/HEMATOPOIETIC/OTHER NEOPLASMS,17,"MYELOPROLIFERATIVE DISEASES AND DISORDERS, AND POORLY DIFFERENTIATED NEOPLASM",2,Moderate,Minor,Surgical,Blue Cross/Blue Shield,,,,,true,191144.97,36213.17
Long Island,Nassau,2908000,000511,NYU Langone Hospital-Long Island,70 or Older,113,M,White,Not Span/Hispanic,8,Emergency,Home w/ Home Health Services,2019,NEO058,NON-HODGKIN LYMPHOMA,LYM001,LYMPH NODE BIOPSY,681,OTHER O.R. PROCEDURES FOR LYMPHATIC/HEMATOPOIETIC/OTHER NEOPLASMS,17,"MYELOPROLIFERATIVE DISEASES AND DISORDERS, AND POORLY DIFFERENTIATED NEOPLASM",3,Major,Major,Surgical,Medicare,,,,,true,208462.64,28225.14
Long Island,Nassau,2908000,000511,NYU Langone Hospital-Long Island,18 to 29,115,M,Other Race,Not Span/Hispanic,5,Emergency,Home w/ Home Health Services,2019,NEO057,HODGKIN LYMPHOMA,LYM001,LYMPH NODE BIOPSY,681,OTHER O.R. PROCEDURES FOR LYMPHATIC/HEMATOPOIETIC/OTHER NEOPLASMS,17,"MYELOPROLIFERATIVE DISEASES AND DISORDERS, AND POORLY DIFFERENTIATED NEOPLASM",3,Major,Moderate,Surgical,Medicaid,,,,,true,300762.76,38907.09
Long Island,Nassau,2908000,000511,NYU Langone Hospital-Long Island,70 or Older,114,M,White,Not Span/Hispanic,5,Emergency,Skilled Nursing Home,2019,NEO061,LEUKEMIA - CHRONIC LYMPHOCYTIC LEUKEMIA (CLL),LYM001,LYMPH NODE BIOPSY,681,OTHER O.R. PROCEDURES FOR LYMPHATIC/HEMATOPOIETIC/OTHER NEOPLASMS,17,"MYELOPROLIFERATIVE DISEASES AND DISORDERS, AND POORLY DIFFERENTIATED NEOPLASM",3,Major,Extreme,Surgical,Medicare,Medicare,,,,true,89579.99,15403.13
Long Island,Nassau,2908000,000511,NYU Langone Hospital-Long Island,70 or Older,117,F,White,Not Span/Hispanic,1,Elective,Home w/ Home Health Services,2019,NEO070,SECONDARY MALIGNANCIES,LYM001,LYMPH NODE BIOPSY,681,OTHER O.R. PROCEDURES FOR LYMPHATIC/HEMATOPOIETIC/OTHER NEOPLASMS,17,"MYELOPROLIFERATIVE DISEASES AND DISORDERS, AND POORLY DIFFERENTIATED NEOPLASM",2,Moderate,Moderate,Surgical,Medicare,Medicare,,,,false,164928.8,24819.38
Long Island,Nassau,2908000,000511,NYU Langone Hospital-Long Island,50 to 69,115,M,Black/African American,Not Span/Hispanic,20,Emergency,Home w/ Home Health Services,2019,NEO058,NON-HODGKIN LYMPHOMA,LYM001,LYMPH NODE BIOPSY,681,OTHER O.R. PROCEDURES FOR LYMPHATIC/HEMATOPOIETIC/OTHER NEOPLASMS,17,"MYELOPROLIFERATIVE DISEASES AND DISORDERS, AND POORLY DIFFERENTIATED NEOPLASM",4,Extreme,Extreme,Surgical,Blue Cross/Blue Shield,,,,,true,384633.86,61007.89
Long Island,Nassau,2908000,000511,NYU Langone Hospital-Long Island,70 or Older,113,M,Other Race,Not Span/Hispanic,6,Elective,Skilled Nursing Home,2019,NEO070,SECONDARY MALIGNANCIES,LYM003,LYMPH NODE DISSECTION,681,OTHER O.R. PROCEDURES FOR LYMPHATIC/HEMATOPOIETIC/OTHER NEOPLASMS,17,"MYELOPROLIFERATIVE DISEASES AND DISORDERS, AND POORLY DIFFERENTIATED NEOPLASM",2,Moderate,Major,Surgical,Private Health Insurance,,,,,false,156463.75,26286.35
