Hospital Service Area,Hospital County,Operating Certificate Number,Permanent Facility Id,Facility Name,Age Group,Zip Code - 3 digits,Gender,Race,Ethnicity,Length of Stay,Type of Admission,Patient Disposition,Discharge Year,CCS Diagnosis Code,CCS Diagnosis Description,CCS Procedure Code,CCS Procedure Description,APR DRG Code,APR DRG Description,APR MDC Code,APR MDC Description,APR Severity of Illness Code,APR Severity of Illness Description,APR Risk of Mortality,APR Medical Surgical Description,Payment Typology 1,Payment Typology 2,Payment Typology 3,Birth Weight,Abortion Edit Indicator,Emergency Department Indicator,Total Charges,Total Costs
New York City,Manhattan,7002053,001463,NYU Langone Hospitals,70 or Older,100,M,White,Not Span/Hispanic,9,Emergency,Hospice - Medical Facility,2019,NEO058,NON-HODGKIN LYMPHOMA,GIS006,PARACENTESIS,691,"LYMPHOMA, MYELOMA & NON-ACUTE LEUKEMIA",17,"MYELOPROLIFERATIVE DISEASES AND DISORDERS, AND POORLY DIFFERENTIATED NEOPLASM",4,Extreme,Extreme,Medical,Private Health Insurance,Medicare,,,,true,306431.25,55652.93
New York City,Manhattan,7002053,001463,NYU Langone Hospitals,30 to 49,112,F,White,Spanish/Hispanic,3,Emergency,Home or Self Care,2019,NEO065,MULTIPLE MYELOMA,MST002,BONE AND JOINT BIOPSY,691,"LYMPHOMA, MYELOMA & NON-ACUTE LEUKEMIA",17,"MYELOPROLIFERATIVE DISEASES AND DISORDERS, AND POORLY DIFFERENTIATED NEOPLASM",1,Minor,Minor,Medical,Private Health Insurance,,,,,true,108165.91,25326.63
New York City,Manhattan,7002053,001463,NYU Langone Hospitals,50 to 69,100,F,Other Race,Unknown,6,Emergency,Home or Self Care,2019,NEO065,MULTIPLE MYELOMA,MST002,BONE AND JOINT BIOPSY,691,"LYMPHOMA, MYELOMA & NON-ACUTE LEUKEMIA",17,"MYELOPROLIFERATIVE DISEASES AND DISORDERS, AND POORLY DIFFERENTIATED NEOPLASM",2,Moderate,Minor,Medical,Blue Cross/Blue Shield,,,,,true,154069.56,29450.8
New York City,Manhattan,7002053,001463,NYU Langone Hospitals,50 to 69,104,F,Black/African American,Not Span/Hispanic,33,Urgent,Hospice - Home,2019,NEO065,MULTIPLE MYELOMA,EST001,PHERESIS THERAPY,691,"LYMPHOMA, MYELOMA & NON-ACUTE LEUKEMIA",17,"MYELOPROLIFERATIVE DISEASES AND DISORDERS, AND POORLY DIFFERENTIATED NEOPLASM",4,Extreme,Extreme,Medical,Private Health Insurance,,,,,false,536471.66,143488.22
New York City,Manhattan,7002053,001463,NYU Langone Hospitals,70 or Older,112,M,White,Not Span/Hispanic,1,Emergency,Expired,2019,NEO058,NON-HODGKIN LYMPHOMA,,,691,"LYMPHOMA, MYELOMA & NON-ACUTE LEUKEMIA",17,"MYELOPROLIFERATIVE DISEASES AND DISORDERS, AND POORLY DIFFERENTIATED NEOPLASM",4,Extreme,Major,Medical,Medicare,Medicare,,,,true,120414.41,12089.85
New York City,Manhattan,7002053,001463,NYU Langone Hospitals,70 or Older,111,M,White,Not Span/Hispanic,17,Emergency,Home w/ Home Health Services,2019,NEO065,MULTIPLE MYELOMA,LYM007,BONE MARROW BIOPSY,691,"LYMPHOMA, MYELOMA & NON-ACUTE LEUKEMIA",17,"MYELOPROLIFERATIVE DISEASES AND DISORDERS, AND POORLY DIFFERENTIATED NEOPLASM",4,Extreme,Major,Medical,Medicare,Blue Cross/Blue Shield,,,,true,233821.93,71793.17
New York City,Manhattan,7002053,001463,NYU Langone Hospitals,50 to 69,112,M,Black/African American,Not Span/Hispanic,4,Emergency,Home or Self Care,2019,NEO065,MULTIPLE MYELOMA,RAD001,BEAM RADIATION,691,"LYMPHOMA, MYELOMA & NON-ACUTE LEUKEMIA",17,"MYELOPROLIFERATIVE DISEASES AND DISORDERS, AND POORLY DIFFERENTIATED NEOPLASM",3,Major,Moderate,Medical,Private Health Insurance,,,,,true,59019.29,24141.69
New York City,Manhattan,7002053,001463,NYU Langone Hospitals,70 or Older,112,M,White,Not Span/Hispanic,3,Emergency,Skilled Nursing Home,2019,NEO058,NON-HODGKIN LYMPHOMA,ENT001,LARYNGOSCOPY (DIAGNOSTIC),691,"LYMPHOMA, MYELOMA & NON-ACUTE LEUKEMIA",17,"MYELOPROLIFERATIVE DISEASES AND DISORDERS, AND POORLY DIFFERENTIATED NEOPLASM",2,Moderate,Moderate,Medical,Medicare,Medicare,,,,true,51881.61,16403.65
New York City,Manhattan,7002053,001463,NYU Langone Hospitals,50 to 69,114,F,Black/African American,Not Span/Hispanic,1,Elective,Home or Self Care,2019,NEO065,MULTIPLE MYELOMA,,,691,"LYMPHOMA, MYELOMA & NON-ACUTE LEUKEMIA",17,"MYELOPROLIFERATIVE DISEASES AND DISORDERS, AND POORLY DIFFERENTIATED NEOPLASM",4,Extreme,Moderate,Medical,Private Health Insurance,,,,,false,15316.13,4482.63
New York City,Manhattan,7002053,001463,NYU Langone Hospitals,0 to 17,117,M,White,Not Span/Hispanic,1,Elective,Home or Self Care,2019,NEO058,NON-HODGKIN LYMPHOMA,CAR025,PLACEMENT OF TUNNELED OR IMPLANTABLE PORTION OF A VASCULAR ACCESS DEVICE,691,"LYMPHOMA, MYELOMA & NON-ACUTE LEUKEMIA",17,"MYELOPROLIFERATIVE DISEASES AND DISORDERS, AND POORLY DIFFERENTIATED NEOPLASM",1,Minor,Minor,Medical,Blue Cross/Blue Shield,,,,,false,52447.68,8759.94
New York City,Manhattan,7002053,001463,NYU Langone Hospitals,70 or Older,108,M,White,Not Span/Hispanic,5,Emergency,Hospice - Home,2019,NEO061,LEUKEMIA - CHRONIC LYMPHOCYTIC LEUKEMIA (CLL),CNS002,LUMBAR PUNCTURE,691,"LYMPHOMA, MYELOMA & NON-ACUTE LEUKEMIA",17,"MYELOPROLIFERATIVE DISEASES AND DISORDERS, AND POORLY DIFFERENTIATED NEOPLASM",4,Extreme,Major,Medical,Medicare,Medicare,,,,true,115185.02,27113.59
New York City,Manhattan,7002053,001463,NYU Langone Hospitals,70 or Older,112,M,White,Not Span/Hispanic,2,Emergency,Home or Self Care,2019,NEO058,NON-HODGKIN LYMPHOMA,,,691,"LYMPHOMA, MYELOMA & NON-ACUTE LEUKEMIA",17,"MYELOPROLIFERATIVE DISEASES AND DISORDERS, AND POORLY DIFFERENTIATED NEOPLASM",3,Major,Major,Medical,Medicare,Medicare,,,,true,58262.46,12200.02
New York City,Manhattan,7002053,001463,NYU Langone Hospitals,70 or Older,112,M,Black/African American,Not Span/Hispanic,3,Emergency,Home or Self Care,2019,NEO058,NON-HODGKIN LYMPHOMA,ADM021,"ADMINISTRATION OF THERAPEUTIC SUBSTANCES, NEC",691,"LYMPHOMA, MYELOMA & NON-ACUTE LEUKEMIA",17,"MYELOPROLIFERATIVE DISEASES AND DISORDERS, AND POORLY DIFFERENTIATED NEOPLASM",4,Extreme,Major,Medical,Medicare,Medicaid,,,,true,44322.5,12583.79
New York City,Manhattan,7002053,001463,NYU Langone Hospitals,50 to 69,112,F,White,Not Span/Hispanic,5,Emergency,Home w/ Home Health Services,2019,NEO065,MULTIPLE MYELOMA,RAD001,BEAM RADIATION,691,"LYMPHOMA, MYELOMA & NON-ACUTE LEUKEMIA",17,"MYELOPROLIFERATIVE DISEASES AND DISORDERS, AND POORLY DIFFERENTIATED NEOPLASM",2,Moderate,Moderate,Medical,Medicaid,,,,,true,50936.58,21643.36
New York City,Manhattan,7002053,001463,NYU Langone Hospitals,50 to 69,OOS,F,Other Race,Not Span/Hispanic,4,Urgent,Home or Self Care,2019,NEO058,NON-HODGKIN LYMPHOMA,,,691,"LYMPHOMA, MYELOMA & NON-ACUTE LEUKEMIA",17,"MYELOPROLIFERATIVE DISEASES AND DISORDERS, AND POORLY DIFFERENTIATED NEOPLASM",3,Major,Major,Medical,Blue Cross/Blue Shield,,,,,false,42538.75,13620
New York City,Manhattan,7002053,001463,NYU Langone Hospitals,50 to 69,112,M,Black/African American,Not Span/Hispanic,1,Emergency,Home or Self Care,2019,NEO065,MULTIPLE MYELOMA,,,691,"LYMPHOMA, MYELOMA & NON-ACUTE LEUKEMIA",17,"MYELOPROLIFERATIVE DISEASES AND DISORDERS, AND POORLY DIFFERENTIATED NEOPLASM",3,Major,Moderate,Medical,Private Health Insurance,,,,,true,48806.81,7591.69
New York City,Manhattan,7002053,001463,NYU Langone Hospitals,0 to 17,117,M,Other Race,Not Span/Hispanic,10,Emergency,Home or Self Care,2019,NEO058,NON-HODGKIN LYMPHOMA,LYM007,BONE MARROW BIOPSY,691,"LYMPHOMA, MYELOMA & NON-ACUTE LEUKEMIA",17,"MYELOPROLIFERATIVE DISEASES AND DISORDERS, AND POORLY DIFFERENTIATED NEOPLASM",3,Major,Major,Medical,Medicaid,,,,,false,558704.96,85870.6
New York City,Manhattan,7002053,001463,NYU Langone Hospitals,50 to 69,109,M,White,Not Span/Hispanic,5,Emergency,Home or Self Care,2019,NEO065,MULTIPLE MYELOMA,MST002,BONE AND JOINT BIOPSY,691,"LYMPHOMA, MYELOMA & NON-ACUTE LEUKEMIA",17,"MYELOPROLIFERATIVE DISEASES AND DISORDERS, AND POORLY DIFFERENTIATED NEOPLASM",3,Major,Moderate,Medical,Private Health Insurance,,,,,true,180318.51,32221.76
New York City,Manhattan,7002053,001463,NYU Langone Hospitals,70 or Older,103,F,Other Race,Spanish/Hispanic,3,Emergency,Home w/ Home Health Services,2019,NEO061,LEUKEMIA - CHRONIC LYMPHOCYTIC LEUKEMIA (CLL),,,691,"LYMPHOMA, MYELOMA & NON-ACUTE LEUKEMIA",17,"MYELOPROLIFERATIVE DISEASES AND DISORDERS, AND POORLY DIFFERENTIATED NEOPLASM",3,Major,Moderate,Medical,Private Health Insurance,Medicaid,,,,true,69072.92,15496.21
New York City,Manhattan,7002053,001463,NYU Langone Hospitals,70 or Older,100,F,Other Race,Unknown,9,Emergency,Home w/ Home Health Services,2019,NEO058,NON-HODGKIN LYMPHOMA,LYM007,BONE MARROW BIOPSY,691,"LYMPHOMA, MYELOMA & NON-ACUTE LEUKEMIA",17,"MYELOPROLIFERATIVE DISEASES AND DISORDERS, AND POORLY DIFFERENTIATED NEOPLASM",3,Major,Major,Medical,Medicare,Blue Cross/Blue Shield,,,,true,133716.27,40995.69
New York City,Manhattan,7002053,001463,NYU Langone Hospitals,70 or Older,112,M,White,Not Span/Hispanic,1,Emergency,Expired,2019,NEO058,NON-HODGKIN LYMPHOMA,,,691,"LYMPHOMA, MYELOMA & NON-ACUTE LEUKEMIA",17,"MYELOPROLIFERATIVE DISEASES AND DISORDERS, AND POORLY DIFFERENTIATED NEOPLASM",4,Extreme,Major,Medical,Medicare,Medicare,,,,true,27100.05,6096.34
New York City,Manhattan,7002053,001463,NYU Langone Hospitals,70 or Older,117,F,White,Not Span/Hispanic,3,Emergency,Home or Self Care,2019,NEO057,HODGKIN LYMPHOMA,ADM012,CHEMOTHERAPY,691,"LYMPHOMA, MYELOMA & NON-ACUTE LEUKEMIA",17,"MYELOPROLIFERATIVE DISEASES AND DISORDERS, AND POORLY DIFFERENTIATED NEOPLASM",3,Major,Major,Medical,Medicare,Private Health Insurance,,,,true,96880.33,19965.8
New York City,Manhattan,7002053,001463,NYU Langone Hospitals,70 or Older,112,M,White,Not Span/Hispanic,3,Emergency,Hospice - Medical Facility,2019,NEO058,NON-HODGKIN LYMPHOMA,ESA004,NON-INVASIVE VENTILATION,691,"LYMPHOMA, MYELOMA & NON-ACUTE LEUKEMIA",17,"MYELOPROLIFERATIVE DISEASES AND DISORDERS, AND POORLY DIFFERENTIATED NEOPLASM",4,Extreme,Major,Medical,Medicare,Medicare,,,,true,35507.89,11993.7
New York City,Manhattan,7002053,001463,NYU Langone Hospitals,70 or Older,100,F,Black/African American,Not Span/Hispanic,2,Emergency,Home or Self Care,2019,NEO065,MULTIPLE MYELOMA,ADM001,TRANSFUSION OF BLOOD AND BLOOD PRODUCTS,691,"LYMPHOMA, MYELOMA & NON-ACUTE LEUKEMIA",17,"MYELOPROLIFERATIVE DISEASES AND DISORDERS, AND POORLY DIFFERENTIATED NEOPLASM",3,Major,Major,Medical,Medicaid,,,,,true,47214.55,10854.39
New York City,Manhattan,7002053,001463,NYU Langone Hospitals,70 or Older,103,M,Other Race,Not Span/Hispanic,10,Emergency,Inpatient Rehabilitation Facility,2019,NEO058,NON-HODGKIN LYMPHOMA,CNS001,MINIMALLY INVASIVE CNS BIOPSY,691,"LYMPHOMA, MYELOMA & NON-ACUTE LEUKEMIA",17,"MYELOPROLIFERATIVE DISEASES AND DISORDERS, AND POORLY DIFFERENTIATED NEOPLASM",3,Major,Extreme,Medical,Medicare,,,,,true,343974.93,70949.5
New York City,Manhattan,7002053,001463,NYU Langone Hospitals,70 or Older,OOS,M,White,Not Span/Hispanic,3,Emergency,Home or Self Care,2019,NEO058,NON-HODGKIN LYMPHOMA,GIS007,GI SYSTEM DRAINAGE (EXCLUDING PARACENTESIS),691,"LYMPHOMA, MYELOMA & NON-ACUTE LEUKEMIA",17,"MYELOPROLIFERATIVE DISEASES AND DISORDERS, AND POORLY DIFFERENTIATED NEOPLASM",2,Moderate,Moderate,Medical,Medicare,,,,,true,43141.16,13161.48
New York City,Manhattan,7002053,001463,NYU Langone Hospitals,70 or Older,103,M,White,Not Span/Hispanic,8,Emergency,Home or Self Care,2019,NEO058,NON-HODGKIN LYMPHOMA,CAR028,INFERIOR VENA CAVA (IVC) FILTER PROCEDURES,691,"LYMPHOMA, MYELOMA & NON-ACUTE LEUKEMIA",17,"MYELOPROLIFERATIVE DISEASES AND DISORDERS, AND POORLY DIFFERENTIATED NEOPLASM",4,Extreme,Major,Medical,Medicare,Medicaid,,,,true,107589.26,34419.19
New York City,Manhattan,7002053,001463,NYU Langone Hospitals,50 to 69,125,F,White,Not Span/Hispanic,28,Emergency,Home or Self Care,2019,NEO058,NON-HODGKIN LYMPHOMA,LYM007,BONE MARROW BIOPSY,691,"LYMPHOMA, MYELOMA & NON-ACUTE LEUKEMIA",17,"MYELOPROLIFERATIVE DISEASES AND DISORDERS, AND POORLY DIFFERENTIATED NEOPLASM",3,Major,Major,Medical,Medicare,,,,,true,299230.92,104217.08
New York City,Manhattan,7002053,001463,NYU Langone Hospitals,50 to 69,100,M,Other Race,Not Span/Hispanic,20,Emergency,Home w/ Home Health Services,2019,NEO058,NON-HODGKIN LYMPHOMA,URN003,URETER AND OTHER URINARY TRACT DILATION,691,"LYMPHOMA, MYELOMA & NON-ACUTE LEUKEMIA",17,"MYELOPROLIFERATIVE DISEASES AND DISORDERS, AND POORLY DIFFERENTIATED NEOPLASM",4,Extreme,Extreme,Medical,Medicare,Medicaid,,,,true,605426.15,136475.98
New York City,Manhattan,7002053,001463,NYU Langone Hospitals,70 or Older,OOS,M,White,Not Span/Hispanic,2,Emergency,Home or Self Care,2019,NEO058,NON-HODGKIN LYMPHOMA,,,691,"LYMPHOMA, MYELOMA & NON-ACUTE LEUKEMIA",17,"MYELOPROLIFERATIVE DISEASES AND DISORDERS, AND POORLY DIFFERENTIATED NEOPLASM",2,Moderate,Major,Medical,Medicare,Blue Cross/Blue Shield,,,,false,69926.25,10785.55
New York City,Manhattan,7002053,001463,NYU Langone Hospitals,50 to 69,113,M,Other Race,Unknown,13,Urgent,Home or Self Care,2019,NEO058,NON-HODGKIN LYMPHOMA,ADM012,CHEMOTHERAPY,691,"LYMPHOMA, MYELOMA & NON-ACUTE LEUKEMIA",17,"MYELOPROLIFERATIVE DISEASES AND DISORDERS, AND POORLY DIFFERENTIATED NEOPLASM",3,Major,Minor,Medical,Blue Cross/Blue Shield,,,,,false,242646.27,59211.36
New York City,Manhattan,7002053,001463,NYU Langone Hospitals,70 or Older,112,F,Other Race,Spanish/Hispanic,4,Emergency,Home or Self Care,2019,NEO065,MULTIPLE MYELOMA,ADM021,"ADMINISTRATION OF THERAPEUTIC SUBSTANCES, NEC",691,"LYMPHOMA, MYELOMA & NON-ACUTE LEUKEMIA",17,"MYELOPROLIFERATIVE DISEASES AND DISORDERS, AND POORLY DIFFERENTIATED NEOPLASM",3,Major,Major,Medical,Private Health Insurance,Medicaid,,,,true,125071.89,32314.18
New York City,Manhattan,7002053,001463,NYU Langone Hospitals,70 or Older,100,M,White,Not Span/Hispanic,2,Emergency,Home w/ Home Health Services,2019,NEO058,NON-HODGKIN LYMPHOMA,ADM001,TRANSFUSION OF BLOOD AND BLOOD PRODUCTS,691,"LYMPHOMA, MYELOMA & NON-ACUTE LEUKEMIA",17,"MYELOPROLIFERATIVE DISEASES AND DISORDERS, AND POORLY DIFFERENTIATED NEOPLASM",4,Extreme,Extreme,Medical,Private Health Insurance,Medicaid,,,,true,33662.84,8971.04
New York City,Manhattan,7002053,001463,NYU Langone Hospitals,50 to 69,100,M,Multi-racial,Not Span/Hispanic,4,Urgent,Home or Self Care,2019,NEO058,NON-HODGKIN LYMPHOMA,RAD001,BEAM RADIATION,691,"LYMPHOMA, MYELOMA & NON-ACUTE LEUKEMIA",17,"MYELOPROLIFERATIVE DISEASES AND DISORDERS, AND POORLY DIFFERENTIATED NEOPLASM",2,Moderate,Minor,Medical,Medicaid,,,,,false,94229.2,39191.79
New York City,Manhattan,7002053,001463,NYU Langone Hospitals,70 or Older,112,F,White,Not Span/Hispanic,10,Urgent,Inpatient Rehabilitation Facility,2019,NEO058,NON-HODGKIN LYMPHOMA,CNS001,MINIMALLY INVASIVE CNS BIOPSY,691,"LYMPHOMA, MYELOMA & NON-ACUTE LEUKEMIA",17,"MYELOPROLIFERATIVE DISEASES AND DISORDERS, AND POORLY DIFFERENTIATED NEOPLASM",4,Extreme,Extreme,Medical,Medicare,Medicare,,,,false,317226.55,64209.22
New York City,Manhattan,7002053,001463,NYU Langone Hospitals,30 to 49,125,M,White,Not Span/Hispanic,8,Emergency,Home or Self Care,2019,NEO058,NON-HODGKIN LYMPHOMA,CNS001,MINIMALLY INVASIVE CNS BIOPSY,691,"LYMPHOMA, MYELOMA & NON-ACUTE LEUKEMIA",17,"MYELOPROLIFERATIVE DISEASES AND DISORDERS, AND POORLY DIFFERENTIATED NEOPLASM",4,Extreme,Extreme,Medical,Private Health Insurance,,,,,true,259889.87,61482.67
New York City,Manhattan,7002053,001463,NYU Langone Hospitals,70 or Older,103,F,White,Not Span/Hispanic,2,Elective,Home or Self Care,2019,NEO065,MULTIPLE MYELOMA,,,691,"LYMPHOMA, MYELOMA & NON-ACUTE LEUKEMIA",17,"MYELOPROLIFERATIVE DISEASES AND DISORDERS, AND POORLY DIFFERENTIATED NEOPLASM",2,Moderate,Moderate,Medical,Medicare,Blue Cross/Blue Shield,,,,false,40954.25,8354.6
New York City,Manhattan,7002053,001463,NYU Langone Hospitals,50 to 69,112,M,White,Not Span/Hispanic,15,Emergency,Home or Self Care,2019,NEO058,NON-HODGKIN LYMPHOMA,ADM012,CHEMOTHERAPY,691,"LYMPHOMA, MYELOMA & NON-ACUTE LEUKEMIA",17,"MYELOPROLIFERATIVE DISEASES AND DISORDERS, AND POORLY DIFFERENTIATED NEOPLASM",3,Major,Major,Medical,Blue Cross/Blue Shield,Medicare,,,,true,363383.71,78299.49
New York City,Manhattan,7002053,001463,NYU Langone Hospitals,30 to 49,110,M,White,Not Span/Hispanic,9,Emergency,Home or Self Care,2019,NEO058,NON-HODGKIN LYMPHOMA,CNS002,LUMBAR PUNCTURE,691,"LYMPHOMA, MYELOMA & NON-ACUTE LEUKEMIA",17,"MYELOPROLIFERATIVE DISEASES AND DISORDERS, AND POORLY DIFFERENTIATED NEOPLASM",2,Moderate,Minor,Medical,Private Health Insurance,,,,,true,293744.63,73981.6
New York City,Manhattan,7002053,001463,NYU Langone Hospitals,70 or Older,OOS,M,Other Race,Not Span/Hispanic,8,Emergency,Home or Self Care,2019,NEO058,NON-HODGKIN LYMPHOMA,GIS002,COLONOSCOPY AND PROCTOSCOPY WITH BIOPSY,691,"LYMPHOMA, MYELOMA & NON-ACUTE LEUKEMIA",17,"MYELOPROLIFERATIVE DISEASES AND DISORDERS, AND POORLY DIFFERENTIATED NEOPLASM",3,Major,Major,Medical,Medicare,Private Health Insurance,,,,true,150133.83,36930.64
New York City,Manhattan,7002053,001463,NYU Langone Hospitals,30 to 49,112,F,White,Not Span/Hispanic,1,Elective,Home or Self Care,2019,NEO065,MULTIPLE MYELOMA,EST001,PHERESIS THERAPY,691,"LYMPHOMA, MYELOMA & NON-ACUTE LEUKEMIA",17,"MYELOPROLIFERATIVE DISEASES AND DISORDERS, AND POORLY DIFFERENTIATED NEOPLASM",2,Moderate,Moderate,Medical,Private Health Insurance,,,,,false,244129.83,13950.69
New York City,Manhattan,7002053,001463,NYU Langone Hospitals,50 to 69,112,F,White,Not Span/Hispanic,6,Elective,Home w/ Home Health Services,2019,NEO058,NON-HODGKIN LYMPHOMA,CAR024,VENOUS AND ARTERIAL CATHETER PLACEMENT,691,"LYMPHOMA, MYELOMA & NON-ACUTE LEUKEMIA",17,"MYELOPROLIFERATIVE DISEASES AND DISORDERS, AND POORLY DIFFERENTIATED NEOPLASM",3,Major,Minor,Medical,Medicare,Medicaid,,,,false,72167.8,23493.02
New York City,Manhattan,7002053,001463,NYU Langone Hospitals,50 to 69,100,M,Other Race,Not Span/Hispanic,8,Emergency,Hospice - Home,2019,NEO058,NON-HODGKIN LYMPHOMA,ADM012,CHEMOTHERAPY,691,"LYMPHOMA, MYELOMA & NON-ACUTE LEUKEMIA",17,"MYELOPROLIFERATIVE DISEASES AND DISORDERS, AND POORLY DIFFERENTIATED NEOPLASM",3,Major,Major,Medical,Medicare,Medicaid,,,,true,144300.58,33228.81
New York City,Manhattan,7002053,001463,NYU Langone Hospitals,70 or Older,112,M,Black/African American,Not Span/Hispanic,11,Emergency,Home w/ Home Health Services,2019,NEO061,LEUKEMIA - CHRONIC LYMPHOCYTIC LEUKEMIA (CLL),RES003,THORACENTESIS (DIAGNOSTIC),691,"LYMPHOMA, MYELOMA & NON-ACUTE LEUKEMIA",17,"MYELOPROLIFERATIVE DISEASES AND DISORDERS, AND POORLY DIFFERENTIATED NEOPLASM",2,Moderate,Moderate,Medical,Private Health Insurance,Medicare,,,,true,158211.68,49049.86
New York City,Manhattan,7002053,001463,NYU Langone Hospitals,70 or Older,112,M,White,Not Span/Hispanic,16,Emergency,Home w/ Home Health Services,2019,NEO061,LEUKEMIA - CHRONIC LYMPHOCYTIC LEUKEMIA (CLL),RES012,RELEASE OF LUNG AND PLEURA,691,"LYMPHOMA, MYELOMA & NON-ACUTE LEUKEMIA",17,"MYELOPROLIFERATIVE DISEASES AND DISORDERS, AND POORLY DIFFERENTIATED NEOPLASM",4,Extreme,Major,Medical,Medicare,Blue Cross/Blue Shield,,,,true,352642.04,83228.34
New York City,Manhattan,7002053,001463,NYU Langone Hospitals,50 to 69,100,M,White,Not Span/Hispanic,3,Emergency,Home or Self Care,2019,NEO058,NON-HODGKIN LYMPHOMA,RES005,CHEST TUBE PLACEMENT AND THERAPEUTIC THORACENTESIS,691,"LYMPHOMA, MYELOMA & NON-ACUTE LEUKEMIA",17,"MYELOPROLIFERATIVE DISEASES AND DISORDERS, AND POORLY DIFFERENTIATED NEOPLASM",3,Major,Minor,Medical,Medicaid,,,,,true,53940.2,14611.09
New York City,Manhattan,7002053,001463,NYU Langone Hospitals,70 or Older,103,F,Black/African American,Not Span/Hispanic,10,Elective,Home w/ Home Health Services,2019,NEO058,NON-HODGKIN LYMPHOMA,RHB002,"PHYSICAL, OCCUPATIONAL, AND RESPIRATORY THERAPY TREATMENT",691,"LYMPHOMA, MYELOMA & NON-ACUTE LEUKEMIA",17,"MYELOPROLIFERATIVE DISEASES AND DISORDERS, AND POORLY DIFFERENTIATED NEOPLASM",4,Extreme,Moderate,Medical,Private Health Insurance,,,,,false,110848.07,33669.01
New York City,Manhattan,7002053,001463,NYU Langone Hospitals,50 to 69,100,M,Other Race,Spanish/Hispanic,6,Emergency,Home or Self Care,2019,NEO065,MULTIPLE MYELOMA,MST003,"SUBCUTANEOUS TISSUE, FASCIA, AND MUSCLE BIOPSY",691,"LYMPHOMA, MYELOMA & NON-ACUTE LEUKEMIA",17,"MYELOPROLIFERATIVE DISEASES AND DISORDERS, AND POORLY DIFFERENTIATED NEOPLASM",3,Major,Minor,Medical,Medicare,Blue Cross/Blue Shield,,,,true,180400.53,50941.39
New York City,Manhattan,7002053,001463,NYU Langone Hospitals,70 or Older,112,M,Other Race,Not Span/Hispanic,20,Emergency,Expired,2019,NEO064,LEUKEMIA - ALL OTHER TYPES,URN005,NEPHROSTOMY AND URETEROSTOMY PROCEDURES (INCLUDING STENTS),691,"LYMPHOMA, MYELOMA & NON-ACUTE LEUKEMIA",17,"MYELOPROLIFERATIVE DISEASES AND DISORDERS, AND POORLY DIFFERENTIATED NEOPLASM",4,Extreme,Extreme,Medical,Medicaid,,,,,true,539939.66,137833.09
New York City,Manhattan,7002053,001463,NYU Langone Hospitals,70 or Older,113,M,Other Race,Not Span/Hispanic,5,Emergency,Home w/ Home Health Services,2019,NEO065,MULTIPLE MYELOMA,RAD001,BEAM RADIATION,691,"LYMPHOMA, MYELOMA & NON-ACUTE LEUKEMIA",17,"MYELOPROLIFERATIVE DISEASES AND DISORDERS, AND POORLY DIFFERENTIATED NEOPLASM",3,Major,Major,Medical,Medicare,Medicare,,,,true,118389.24,42126.19
New York City,Manhattan,7002053,001463,NYU Langone Hospitals,50 to 69,100,M,White,Not Span/Hispanic,9,Emergency,Home or Self Care,2019,NEO058,NON-HODGKIN LYMPHOMA,ADM012,CHEMOTHERAPY,691,"LYMPHOMA, MYELOMA & NON-ACUTE LEUKEMIA",17,"MYELOPROLIFERATIVE DISEASES AND DISORDERS, AND POORLY DIFFERENTIATED NEOPLASM",3,Major,Minor,Medical,Medicare,Medicare,,,,true,182105.08,39753.68
New York City,Manhattan,7002053,001463,NYU Langone Hospitals,70 or Older,113,M,Other Race,Not Span/Hispanic,7,Emergency,Home or Self Care,2019,NEO065,MULTIPLE MYELOMA,RAD001,BEAM RADIATION,691,"LYMPHOMA, MYELOMA & NON-ACUTE LEUKEMIA",17,"MYELOPROLIFERATIVE DISEASES AND DISORDERS, AND POORLY DIFFERENTIATED NEOPLASM",3,Major,Moderate,Medical,Medicare,Medicare,,,,true,132737.49,46695.51
New York City,Manhattan,7002053,001463,NYU Langone Hospitals,70 or Older,OOS,M,Other Race,Not Span/Hispanic,8,Emergency,Hospice - Home,2019,NEO058,NON-HODGKIN LYMPHOMA,ADM005,ADMINISTRATION OF THROMBOLYTICS AND PLATELET INHIBITORS,691,"LYMPHOMA, MYELOMA & NON-ACUTE LEUKEMIA",17,"MYELOPROLIFERATIVE DISEASES AND DISORDERS, AND POORLY DIFFERENTIATED NEOPLASM",4,Extreme,Major,Medical,Medicare,Private Health Insurance,,,,true,203051.88,40342.11
New York City,Manhattan,7002053,001463,NYU Langone Hospitals,50 to 69,100,M,White,Not Span/Hispanic,1,Emergency,Left Against Medical Advice,2019,NEO058,NON-HODGKIN LYMPHOMA,,,691,"LYMPHOMA, MYELOMA & NON-ACUTE LEUKEMIA",17,"MYELOPROLIFERATIVE DISEASES AND DISORDERS, AND POORLY DIFFERENTIATED NEOPLASM",2,Moderate,Minor,Medical,Medicaid,,,,,true,15482.14,4738.45
New York City,Manhattan,7002053,001463,NYU Langone Hospitals,50 to 69,113,M,Other Race,Not Span/Hispanic,10,Emergency,Home w/ Home Health Services,2019,NEO065,MULTIPLE MYELOMA,LYM007,BONE MARROW BIOPSY,691,"LYMPHOMA, MYELOMA & NON-ACUTE LEUKEMIA",17,"MYELOPROLIFERATIVE DISEASES AND DISORDERS, AND POORLY DIFFERENTIATED NEOPLASM",3,Major,Moderate,Medical,Blue Cross/Blue Shield,,,,,true,278467.73,86774.63
New York City,Manhattan,7002053,001463,NYU Langone Hospitals,70 or Older,113,M,Other Race,Not Span/Hispanic,5,Emergency,Home w/ Home Health Services,2019,NEO065,MULTIPLE MYELOMA,RAD001,BEAM RADIATION,691,"LYMPHOMA, MYELOMA & NON-ACUTE LEUKEMIA",17,"MYELOPROLIFERATIVE DISEASES AND DISORDERS, AND POORLY DIFFERENTIATED NEOPLASM",3,Major,Major,Medical,Medicare,Medicare,,,,true,190541.96,48094.06
New York City,Manhattan,7002053,001463,NYU Langone Hospitals,70 or Older,100,F,White,Not Span/Hispanic,5,Emergency,Home w/ Home Health Services,2019,NEO061,LEUKEMIA - CHRONIC LYMPHOCYTIC LEUKEMIA (CLL),ADM001,TRANSFUSION OF BLOOD AND BLOOD PRODUCTS,691,"LYMPHOMA, MYELOMA & NON-ACUTE LEUKEMIA",17,"MYELOPROLIFERATIVE DISEASES AND DISORDERS, AND POORLY DIFFERENTIATED NEOPLASM",3,Major,Moderate,Medical,Medicare,Medicare,,,,true,59821,20569.62