Hospital Service Area,Hospital County,Operating Certificate Number,Permanent Facility Id,Facility Name,Age Group,Zip Code - 3 digits,Gender,Race,Ethnicity,Length of Stay,Type of Admission,Patient Disposition,Discharge Year,CCS Diagnosis Code,CCS Diagnosis Description,CCS Procedure Code,CCS Procedure Description,APR DRG Code,APR DRG Description,APR MDC Code,APR MDC Description,APR Severity of Illness Code,APR Severity of Illness Description,APR Risk of Mortality,APR Medical Surgical Description,Payment Typology 1,Payment Typology 2,Payment Typology 3,Birth Weight,Abortion Edit Indicator,Emergency Department Indicator,Total Charges,Total Costs
New York City,Manhattan,7002024,001456,Mount Sinai Hospital,50 to 69,112,F,Black/African American,Not Span/Hispanic,5,Urgent,Skilled Nursing Home,2020,NEO065,MULTIPLE MYELOMA,IMG009,PLAIN RADIOGRAPHY,691,"LYMPHOMA, MYELOMA & NON-ACUTE LEUKEMIA",17,"MYELOPROLIFERATIVE DISEASES AND DISORDERS, AND POORLY DIFFERENTIATED NEOPLASM",3,Major,Minor,Medical,Medicaid,Self-Pay,,,,N,62694.78,15792.39
New York City,Bronx,7000006,001169,Montefiore Medical Center - Henry & Lucy Moses Div,70 or Older,104,F,Black/African American,Not Span/Hispanic,8,Emergency,Skilled Nursing Home,2020,NEO065,MULTIPLE MYELOMA,ADM001,TRANSFUSION OF BLOOD AND BLOOD PRODUCTS,691,"LYMPHOMA, MYELOMA & NON-ACUTE LEUKEMIA",17,"MYELOPROLIFERATIVE DISEASES AND DISORDERS, AND POORLY DIFFERENTIATED NEOPLASM",3,Major,Major,Medical,Medicare,Private Health Insurance,,,,Y,114026.7,20230.15
New York City,Bronx,7000006,001169,Montefiore Medical Center - Henry & Lucy Moses Div,50 to 69,104,F,Black/African American,Not Span/Hispanic,3,Emergency,Home or Self Care,2020,NEO058,NON-HODGKIN LYMPHOMA,,,691,"LYMPHOMA, MYELOMA & NON-ACUTE LEUKEMIA",17,"MYELOPROLIFERATIVE DISEASES AND DISORDERS, AND POORLY DIFFERENTIATED NEOPLASM",3,Major,Major,Medical,Private Health Insurance,,,,,Y,37098.93,5860.95
Hudson Valley,Westchester,5904001,001072,Montefiore New Rochelle Hospital,70 or Older,108,M,Other Race,Unknown,7,Emergency,Short-term Hospital,2020,NEO061,LEUKEMIA - CHRONIC LYMPHOCYTIC LEUKEMIA (CLL),GIS006,PARACENTESIS,691,"LYMPHOMA, MYELOMA & NON-ACUTE LEUKEMIA",17,"MYELOPROLIFERATIVE DISEASES AND DISORDERS, AND POORLY DIFFERENTIATED NEOPLASM",3,Major,Major,Medical,Medicare,Medicare,Self-Pay,,,Y,60486.71,15441.19
New York City,Manhattan,7002024,001456,Mount Sinai Hospital,0 to 17,113,M,Other Race,Spanish/Hispanic,2,Emergency,Home or Self Care,2020,NEO058,NON-HODGKIN LYMPHOMA,LYM007,BONE MARROW BIOPSY,691,"LYMPHOMA, MYELOMA & NON-ACUTE LEUKEMIA",17,"MYELOPROLIFERATIVE DISEASES AND DISORDERS, AND POORLY DIFFERENTIATED NEOPLASM",2,Moderate,Minor,Medical,Medicaid,Medicaid,Self-Pay,,,Y,64482.07,19045.95
New York City,Bronx,7000006,001169,Montefiore Medical Center - Henry & Lucy Moses Div,70 or Older,104,F,Other Race,Spanish/Hispanic,1,Elective,Home or Self Care,2020,NEO064,LEUKEMIA - ALL OTHER TYPES,CAR024,VENOUS AND ARTERIAL CATHETER PLACEMENT,691,"LYMPHOMA, MYELOMA & NON-ACUTE LEUKEMIA",17,"MYELOPROLIFERATIVE DISEASES AND DISORDERS, AND POORLY DIFFERENTIATED NEOPLASM",2,Moderate,Minor,Medical,Medicare,Medicaid,,,,N,25191.76,3457.27
New York City,Bronx,7000006,001168,Montefiore Medical Center-Wakefield Hospital,70 or Older,104,F,Other Race,Unknown,2,Emergency,Home or Self Care,2020,NEO058,NON-HODGKIN LYMPHOMA,,,691,"LYMPHOMA, MYELOMA & NON-ACUTE LEUKEMIA",17,"MYELOPROLIFERATIVE DISEASES AND DISORDERS, AND POORLY DIFFERENTIATED NEOPLASM",2,Moderate,Moderate,Medical,Medicare,,,,,Y,42974.86,5972.77
New York City,Manhattan,7002032,001469,Mount Sinai Morningside,50 to 69,100,F,Black/African American,Not Span/Hispanic,8,Emergency,Inpatient Rehabilitation Facility,2020,NEO065,MULTIPLE MYELOMA,IMG009,PLAIN RADIOGRAPHY,691,"LYMPHOMA, MYELOMA & NON-ACUTE LEUKEMIA",17,"MYELOPROLIFERATIVE DISEASES AND DISORDERS, AND POORLY DIFFERENTIATED NEOPLASM",2,Moderate,Moderate,Medical,Medicare,Medicare,Medicaid,,,Y,102538.58,22156.98
New York City,Manhattan,7002024,001456,Mount Sinai Hospital,50 to 69,113,F,Other Race,Not Span/Hispanic,3,Emergency,Home w/ Home Health Services,2020,NEO065,MULTIPLE MYELOMA,OTR004,ISOLATION PROCEDURES,691,"LYMPHOMA, MYELOMA & NON-ACUTE LEUKEMIA",17,"MYELOPROLIFERATIVE DISEASES AND DISORDERS, AND POORLY DIFFERENTIATED NEOPLASM",3,Major,Moderate,Medical,Medicaid,Medicaid,Self-Pay,,,Y,47457.06,10720.62
New York City,Manhattan,7002024,001456,Mount Sinai Hospital,70 or Older,100,M,Other Race,Not Span/Hispanic,8,Emergency,Home w/ Home Health Services,2020,NEO058,NON-HODGKIN LYMPHOMA,LYM007,BONE MARROW BIOPSY,691,"LYMPHOMA, MYELOMA & NON-ACUTE LEUKEMIA",17,"MYELOPROLIFERATIVE DISEASES AND DISORDERS, AND POORLY DIFFERENTIATED NEOPLASM",2,Moderate,Moderate,Medical,Medicare,Medicaid,Self-Pay,,,Y,151798.54,40993.42
New York City,Bronx,7000006,001169,Montefiore Medical Center - Henry & Lucy Moses Div,30 to 49,125,M,White,Not Span/Hispanic,2,Emergency,Hospice - Medical Facility,2020,NEO057,HODGKIN LYMPHOMA,RES007,AIRWAY INTUBATION,691,"LYMPHOMA, MYELOMA & NON-ACUTE LEUKEMIA",17,"MYELOPROLIFERATIVE DISEASES AND DISORDERS, AND POORLY DIFFERENTIATED NEOPLASM",3,Major,Major,Medical,Medicare,,,,,Y,38823.5,5388.29
New York City,Manhattan,7002054,001464,New York-Presbyterian Hospital - Columbia Presbyterian Center,18 to 29,100,M,Other Race,Spanish/Hispanic,20,Elective,Home or Self Care,2020,NEO058,NON-HODGKIN LYMPHOMA,ADM012,CHEMOTHERAPY,691,"LYMPHOMA, MYELOMA & NON-ACUTE LEUKEMIA",17,"MYELOPROLIFERATIVE DISEASES AND DISORDERS, AND POORLY DIFFERENTIATED NEOPLASM",3,Major,Moderate,Medical,Private Health Insurance,Self-Pay,,,,N,317488.72,86564.7
New York City,Manhattan,7002054,001464,New York-Presbyterian Hospital - Columbia Presbyterian Center,70 or Older,109,M,White,Not Span/Hispanic,3,Elective,Home or Self Care,2020,NEO065,MULTIPLE MYELOMA,,,691,"LYMPHOMA, MYELOMA & NON-ACUTE LEUKEMIA",17,"MYELOPROLIFERATIVE DISEASES AND DISORDERS, AND POORLY DIFFERENTIATED NEOPLASM",1,Minor,Moderate,Medical,Medicare,Blue Cross/Blue Shield,Self-Pay,,,N,38483.09,7911.46
New York City,Manhattan,7002054,001464,New York-Presbyterian Hospital - Columbia Presbyterian Center,18 to 29,OOS,F,White,Not Span/Hispanic,1,Urgent,Home or Self Care,2020,NEO057,HODGKIN LYMPHOMA,EST001,PHERESIS THERAPY,691,"LYMPHOMA, MYELOMA & NON-ACUTE LEUKEMIA",17,"MYELOPROLIFERATIVE DISEASES AND DISORDERS, AND POORLY DIFFERENTIATED NEOPLASM",1,Minor,Minor,Medical,Private Health Insurance,Self-Pay,,,,N,55583.7,21115.34
New York City,Manhattan,7002054,001464,New York-Presbyterian Hospital - Columbia Presbyterian Center,50 to 69,OOS,F,White,Not Span/Hispanic,7,Emergency,Skilled Nursing Home,2020,NEO058,NON-HODGKIN LYMPHOMA,ADM001,TRANSFUSION OF BLOOD AND BLOOD PRODUCTS,691,"LYMPHOMA, MYELOMA & NON-ACUTE LEUKEMIA",17,"MYELOPROLIFERATIVE DISEASES AND DISORDERS, AND POORLY DIFFERENTIATED NEOPLASM",2,Moderate,Moderate,Medical,Medicare,Medicare,Self-Pay,,,Y,94627.58,20202.35
New York City,Manhattan,7002024,001456,Mount Sinai Hospital,50 to 69,112,M,White,Not Span/Hispanic,6,Emergency,Expired,2020,NEO058,NON-HODGKIN LYMPHOMA,,,691,"LYMPHOMA, MYELOMA & NON-ACUTE LEUKEMIA",17,"MYELOPROLIFERATIVE DISEASES AND DISORDERS, AND POORLY DIFFERENTIATED NEOPLASM",2,Moderate,Moderate,Medical,Miscellaneous/Other,Self-Pay,,,,Y,73115.93,18095.68
New York City,Manhattan,7002024,001456,Mount Sinai Hospital,30 to 49,100,M,Black/African American,Not Span/Hispanic,7,Emergency,Expired,2020,NEO058,NON-HODGKIN LYMPHOMA,ADM001,TRANSFUSION OF BLOOD AND BLOOD PRODUCTS,691,"LYMPHOMA, MYELOMA & NON-ACUTE LEUKEMIA",17,"MYELOPROLIFERATIVE DISEASES AND DISORDERS, AND POORLY DIFFERENTIATED NEOPLASM",4,Extreme,Extreme,Medical,Blue Cross/Blue Shield,Self-Pay,,,,Y,190565.97,46620.79
New York City,Queens,7003010,001637,New York - Presbyterian/Queens,70 or Older,113,M,White,Not Span/Hispanic,7,Emergency,Inpatient Rehabilitation Facility,2020,NEO058,NON-HODGKIN LYMPHOMA,ADM001,TRANSFUSION OF BLOOD AND BLOOD PRODUCTS,691,"LYMPHOMA, MYELOMA & NON-ACUTE LEUKEMIA",17,"MYELOPROLIFERATIVE DISEASES AND DISORDERS, AND POORLY DIFFERENTIATED NEOPLASM",3,Major,Major,Medical,Medicare,Private Health Insurance,Self-Pay,,,Y,61408.21,15689.9
New York City,Kings,7002053,001304,NYU Langone Hospital-Brooklyn,30 to 49,112,M,Other Race,Spanish/Hispanic,6,Emergency,Home or Self Care,2020,NEO058,NON-HODGKIN LYMPHOMA,GIS002,COLONOSCOPY AND PROCTOSCOPY WITH BIOPSY,691,"LYMPHOMA, MYELOMA & NON-ACUTE LEUKEMIA",17,"MYELOPROLIFERATIVE DISEASES AND DISORDERS, AND POORLY DIFFERENTIATED NEOPLASM",3,Major,Moderate,Medical,Medicaid,,,,,Y,129917.15,27685.36
New York City,Manhattan,7002053,001463,NYU Langone Hospitals,70 or Older,100,M,White,Not Span/Hispanic,1,Emergency,Skilled Nursing Home,2020,NEO065,MULTIPLE MYELOMA,ADM001,TRANSFUSION OF BLOOD AND BLOOD PRODUCTS,691,"LYMPHOMA, MYELOMA & NON-ACUTE LEUKEMIA",17,"MYELOPROLIFERATIVE DISEASES AND DISORDERS, AND POORLY DIFFERENTIATED NEOPLASM",3,Major,Major,Medical,Medicare,Medicaid,,,,Y,41781.34,14038.07
New York City,Kings,7001037,001320,University Hospital of Brooklyn,30 to 49,112,M,Black/African American,Not Span/Hispanic,10,Emergency,Home or Self Care,2020,NEO065,MULTIPLE MYELOMA,LYM007,BONE MARROW BIOPSY,691,"LYMPHOMA, MYELOMA & NON-ACUTE LEUKEMIA",17,"MYELOPROLIFERATIVE DISEASES AND DISORDERS, AND POORLY DIFFERENTIATED NEOPLASM",4,Extreme,Major,Medical,Private Health Insurance,Self-Pay,,,,Y,83543.4,56592.94
New York City,Manhattan,7002054,001458,New York-Presbyterian Hospital - New York Weill Cornell Center,70 or Older,100,M,Other Race,Multi-ethnic,8,Elective,Home w/ Home Health Services,2020,NEO061,LEUKEMIA - CHRONIC LYMPHOCYTIC LEUKEMIA (CLL),RHB002,"PHYSICAL, OCCUPATIONAL, AND RESPIRATORY THERAPY TREATMENT",691,"LYMPHOMA, MYELOMA & NON-ACUTE LEUKEMIA",17,"MYELOPROLIFERATIVE DISEASES AND DISORDERS, AND POORLY DIFFERENTIATED NEOPLASM",3,Major,Moderate,Medical,Private Health Insurance,Medicare,Self-Pay,,,N,123979.24,30888.55
New York City,Manhattan,7002054,001458,New York-Presbyterian Hospital - New York Weill Cornell Center,30 to 49,112,M,Other Race,Not Span/Hispanic,11,Emergency,Home w/ Home Health Services,2020,NEO057,HODGKIN LYMPHOMA,CAR028,INFERIOR VENA CAVA (IVC) FILTER PROCEDURES,691,"LYMPHOMA, MYELOMA & NON-ACUTE LEUKEMIA",17,"MYELOPROLIFERATIVE DISEASES AND DISORDERS, AND POORLY DIFFERENTIATED NEOPLASM",3,Major,Major,Medical,Private Health Insurance,,,,,Y,191639.6,50299.45
New York City,Manhattan,7002054,001458,New York-Presbyterian Hospital - New York Weill Cornell Center,50 to 69,100,M,White,Not Span/Hispanic,30,Emergency,Home or Self Care,2020,NEO058,NON-HODGKIN LYMPHOMA,LYM007,BONE MARROW BIOPSY,691,"LYMPHOMA, MYELOMA & NON-ACUTE LEUKEMIA",17,"MYELOPROLIFERATIVE DISEASES AND DISORDERS, AND POORLY DIFFERENTIATED NEOPLASM",2,Moderate,Moderate,Medical,Medicaid,Self-Pay,,,,Y,430926.18,120618.27
New York City,Manhattan,7002054,001458,New York-Presbyterian Hospital - New York Weill Cornell Center,70 or Older,100,M,Black/African American,Not Span/Hispanic,24,Emergency,Skilled Nursing Home,2020,NEO065,MULTIPLE MYELOMA,RAD004,"RADIATION THERAPY, NEC",691,"LYMPHOMA, MYELOMA & NON-ACUTE LEUKEMIA",17,"MYELOPROLIFERATIVE DISEASES AND DISORDERS, AND POORLY DIFFERENTIATED NEOPLASM",3,Major,Major,Medical,Medicare,Medicare,Self-Pay,,,Y,441317.46,123168.92
New York City,Manhattan,7002054,001458,New York-Presbyterian Hospital - New York Weill Cornell Center,70 or Older,112,F,Black/African American,Not Span/Hispanic,11,Emergency,Skilled Nursing Home,2020,NEO065,MULTIPLE MYELOMA,LYM007,BONE MARROW BIOPSY,691,"LYMPHOMA, MYELOMA & NON-ACUTE LEUKEMIA",17,"MYELOPROLIFERATIVE DISEASES AND DISORDERS, AND POORLY DIFFERENTIATED NEOPLASM",3,Major,Major,Medical,Medicare,Blue Cross/Blue Shield,Self-Pay,,,Y,194240.48,47778.7
New York City,Manhattan,7002054,001458,New York-Presbyterian Hospital - New York Weill Cornell Center,30 to 49,101,M,Other Race,Not Span/Hispanic,7,Emergency,Home or Self Care,2020,NEO065,MULTIPLE MYELOMA,RAD004,"RADIATION THERAPY, NEC",691,"LYMPHOMA, MYELOMA & NON-ACUTE LEUKEMIA",17,"MYELOPROLIFERATIVE DISEASES AND DISORDERS, AND POORLY DIFFERENTIATED NEOPLASM",2,Moderate,Moderate,Medical,Medicaid,Self-Pay,,,,Y,143238.25,36654.44
New York City,Manhattan,7002054,001458,New York-Presbyterian Hospital - New York Weill Cornell Center,50 to 69,100,M,White,Not Span/Hispanic,17,Emergency,Facility w/ Custodial/Supportive Care,2020,NEO058,NON-HODGKIN LYMPHOMA,GIS001,ESOPHAGOGASTRODUODENOSCOPY (EGD) WITH BIOPSY,691,"LYMPHOMA, MYELOMA & NON-ACUTE LEUKEMIA",17,"MYELOPROLIFERATIVE DISEASES AND DISORDERS, AND POORLY DIFFERENTIATED NEOPLASM",3,Major,Moderate,Medical,Medicare,Medicare,Self-Pay,,,Y,216047.66,50699.19
New York City,Kings,7001021,001306,New York - Presbyterian Brooklyn Methodist Hospital,70 or Older,112,M,Other Race,Not Span/Hispanic,10,Emergency,Home or Self Care,2020,NEO065,MULTIPLE MYELOMA,,,691,"LYMPHOMA, MYELOMA & NON-ACUTE LEUKEMIA",17,"MYELOPROLIFERATIVE DISEASES AND DISORDERS, AND POORLY DIFFERENTIATED NEOPLASM",3,Major,Major,Medical,Medicare,Medicare,Self-Pay,,,Y,71166.22,17008.48
New York City,Manhattan,7002054,001458,New York-Presbyterian Hospital - New York Weill Cornell Center,70 or Older,101,F,White,Not Span/Hispanic,12,Emergency,Home or Self Care,2020,NEO058,NON-HODGKIN LYMPHOMA,MST002,BONE AND JOINT BIOPSY,691,"LYMPHOMA, MYELOMA & NON-ACUTE LEUKEMIA",17,"MYELOPROLIFERATIVE DISEASES AND DISORDERS, AND POORLY DIFFERENTIATED NEOPLASM",3,Major,Minor,Medical,Medicare,Private Health Insurance,Self-Pay,,,N,167056.18,36881.31
New York City,Kings,7001021,001306,New York - Presbyterian Brooklyn Methodist Hospital,70 or Older,112,M,Black/African American,Not Span/Hispanic,8,Emergency,Home w/ Home Health Services,2020,NEO065,MULTIPLE MYELOMA,,,691,"LYMPHOMA, MYELOMA & NON-ACUTE LEUKEMIA",17,"MYELOPROLIFERATIVE DISEASES AND DISORDERS, AND POORLY DIFFERENTIATED NEOPLASM",3,Major,Moderate,Medical,Medicare,Medicare,Medicaid,,,Y,61330.51,14739.03
New York City,Manhattan,7002054,001458,New York-Presbyterian Hospital - New York Weill Cornell Center,70 or Older,112,M,White,Not Span/Hispanic,10,Emergency,Home w/ Home Health Services,2020,NEO058,NON-HODGKIN LYMPHOMA,LYM007,BONE MARROW BIOPSY,691,"LYMPHOMA, MYELOMA & NON-ACUTE LEUKEMIA",17,"MYELOPROLIFERATIVE DISEASES AND DISORDERS, AND POORLY DIFFERENTIATED NEOPLASM",2,Moderate,Major,Medical,Medicare,Medicare,Self-Pay,,,Y,171559.7,42236.28
New York City,Manhattan,7002054,001458,New York-Presbyterian Hospital - New York Weill Cornell Center,50 to 69,OOS,M,White,Not Span/Hispanic,2,Emergency,Home or Self Care,2020,NEO058,NON-HODGKIN LYMPHOMA,ADM015,ADMINISTRATION OF ANTIBIOTICS,691,"LYMPHOMA, MYELOMA & NON-ACUTE LEUKEMIA",17,"MYELOPROLIFERATIVE DISEASES AND DISORDERS, AND POORLY DIFFERENTIATED NEOPLASM",2,Moderate,Moderate,Medical,Private Health Insurance,Self-Pay,,,,Y,48621.87,10915.53
New York City,Manhattan,7002054,001458,New York-Presbyterian Hospital - New York Weill Cornell Center,50 to 69,OOS,F,Black/African American,Not Span/Hispanic,21,Elective,Home w/ Home Health Services,2020,NEO065,MULTIPLE MYELOMA,CAR025,PLACEMENT OF TUNNELED OR IMPLANTABLE PORTION OF A VASCULAR ACCESS DEVICE,691,"LYMPHOMA, MYELOMA & NON-ACUTE LEUKEMIA",17,"MYELOPROLIFERATIVE DISEASES AND DISORDERS, AND POORLY DIFFERENTIATED NEOPLASM",4,Extreme,Major,Medical,Medicare,Private Health Insurance,Self-Pay,,,N,382706.28,102552.58
New York City,Manhattan,7002054,001458,New York-Presbyterian Hospital - New York Weill Cornell Center,70 or Older,112,M,White,Not Span/Hispanic,1,Emergency,Home or Self Care,2020,NEO061,LEUKEMIA - CHRONIC LYMPHOCYTIC LEUKEMIA (CLL),,,691,"LYMPHOMA, MYELOMA & NON-ACUTE LEUKEMIA",17,"MYELOPROLIFERATIVE DISEASES AND DISORDERS, AND POORLY DIFFERENTIATED NEOPLASM",2,Moderate,Minor,Medical,Medicare,Private Health Insurance,Self-Pay,,,Y,25402.57,5170.19
New York City,Kings,7001021,001306,New York - Presbyterian Brooklyn Methodist Hospital,30 to 49,112,F,Black/African American,Not Span/Hispanic,4,Elective,Home or Self Care,2020,NEO057,HODGKIN LYMPHOMA,LYM008,BONE MARROW ASPIRATION (THERAPEUTIC),691,"LYMPHOMA, MYELOMA & NON-ACUTE LEUKEMIA",17,"MYELOPROLIFERATIVE DISEASES AND DISORDERS, AND POORLY DIFFERENTIATED NEOPLASM",2,Moderate,Minor,Medical,"Managed Care, Unspecified",Medicaid,Self-Pay,,,N,25123.5,6349.6
New York City,Kings,7001021,001306,New York - Presbyterian Brooklyn Methodist Hospital,50 to 69,112,M,Black/African American,Not Span/Hispanic,7,Emergency,Home or Self Care,2020,NEO058,NON-HODGKIN LYMPHOMA,OTR004,ISOLATION PROCEDURES,691,"LYMPHOMA, MYELOMA & NON-ACUTE LEUKEMIA",17,"MYELOPROLIFERATIVE DISEASES AND DISORDERS, AND POORLY DIFFERENTIATED NEOPLASM",3,Major,Major,Medical,Private Health Insurance,Self-Pay,,,,Y,64766.85,18079.09
Long Island,Nassau,2950002,000528,Nassau University Medical Center,70 or Older,115,F,Other Race,Spanish/Hispanic,1,Emergency,Home or Self Care,2020,NEO065,MULTIPLE MYELOMA,ADM001,TRANSFUSION OF BLOOD AND BLOOD PRODUCTS,691,"LYMPHOMA, MYELOMA & NON-ACUTE LEUKEMIA",17,"MYELOPROLIFERATIVE DISEASES AND DISORDERS, AND POORLY DIFFERENTIATED NEOPLASM",2,Moderate,Moderate,Medical,Medicare,Medicaid,Self-Pay,,,N,8910.42,2580
Long Island,Nassau,2950002,000528,Nassau University Medical Center,70 or Older,115,M,Other Race,Spanish/Hispanic,1,Emergency,Skilled Nursing Home,2020,NEO065,MULTIPLE MYELOMA,ADM001,TRANSFUSION OF BLOOD AND BLOOD PRODUCTS,691,"LYMPHOMA, MYELOMA & NON-ACUTE LEUKEMIA",17,"MYELOPROLIFERATIVE DISEASES AND DISORDERS, AND POORLY DIFFERENTIATED NEOPLASM",1,Minor,Moderate,Medical,Medicare,Medicare,Medicaid,,,N,8261.54,3217.86
Western NY,Erie,1401005,000210,Erie County Medical Center,70 or Older,142,F,Black/African American,Not Span/Hispanic,25,Emergency,Expired,2020,NEO058,NON-HODGKIN LYMPHOMA,RES005,CHEST TUBE PLACEMENT AND THERAPEUTIC THORACENTESIS,691,"LYMPHOMA, MYELOMA & NON-ACUTE LEUKEMIA",17,"MYELOPROLIFERATIVE DISEASES AND DISORDERS, AND POORLY DIFFERENTIATED NEOPLASM",4,Extreme,Extreme,Medical,Medicare,Medicare,,,,Y,99696.35,62502.31
Western NY,Erie,1401005,000210,Erie County Medical Center,30 to 49,140,F,White,Not Span/Hispanic,1,Emergency,Cancer Center or Children's Hospital,2020,NEO058,NON-HODGKIN LYMPHOMA,ADM001,TRANSFUSION OF BLOOD AND BLOOD PRODUCTS,691,"LYMPHOMA, MYELOMA & NON-ACUTE LEUKEMIA",17,"MYELOPROLIFERATIVE DISEASES AND DISORDERS, AND POORLY DIFFERENTIATED NEOPLASM",2,Moderate,Minor,Medical,Blue Cross/Blue Shield,,,,,Y,11221.58,4242.32
New York City,Manhattan,7002002,001439,Mount Sinai Beth Israel,70 or Older,100,M,White,Unknown,7,Emergency,Hospice - Medical Facility,2020,NEO064,LEUKEMIA - ALL OTHER TYPES,CAR024,VENOUS AND ARTERIAL CATHETER PLACEMENT,691,"LYMPHOMA, MYELOMA & NON-ACUTE LEUKEMIA",17,"MYELOPROLIFERATIVE DISEASES AND DISORDERS, AND POORLY DIFFERENTIATED NEOPLASM",4,Extreme,Extreme,Medical,Private Health Insurance,Self-Pay,,,,Y,220693.77,66711.06
New York City,Manhattan,7002032,001466,Mount Sinai West,50 to 69,100,M,Other Race,Spanish/Hispanic,17,Urgent,Left Against Medical Advice,2020,NEO058,NON-HODGKIN LYMPHOMA,GIS001,ESOPHAGOGASTRODUODENOSCOPY (EGD) WITH BIOPSY,691,"LYMPHOMA, MYELOMA & NON-ACUTE LEUKEMIA",17,"MYELOPROLIFERATIVE DISEASES AND DISORDERS, AND POORLY DIFFERENTIATED NEOPLASM",4,Extreme,Extreme,Medical,Medicaid,Medicaid,Self-Pay,,,N,221728.03,47077.56
New York City,Manhattan,7002024,001456,Mount Sinai Hospital,50 to 69,104,F,Other Race,Unknown,12,Urgent,Skilled Nursing Home,2020,NEO058,NON-HODGKIN LYMPHOMA,ADM012,CHEMOTHERAPY,691,"LYMPHOMA, MYELOMA & NON-ACUTE LEUKEMIA",17,"MYELOPROLIFERATIVE DISEASES AND DISORDERS, AND POORLY DIFFERENTIATED NEOPLASM",3,Major,Major,Medical,Medicaid,Medicaid,Self-Pay,,,N,163075.79,38573.39
New York City,Manhattan,7002053,001463,NYU Langone Hospitals,50 to 69,OOS,M,White,Not Span/Hispanic,4,Emergency,Home or Self Care,2020,NEO058,NON-HODGKIN LYMPHOMA,ADM003,ADMINISTRATION OF ALBUMIN AND GLOBULIN,691,"LYMPHOMA, MYELOMA & NON-ACUTE LEUKEMIA",17,"MYELOPROLIFERATIVE DISEASES AND DISORDERS, AND POORLY DIFFERENTIATED NEOPLASM",3,Major,Moderate,Medical,Private Health Insurance,,,,,N,208639.39,20357.24
New York City,Manhattan,7002024,001456,Mount Sinai Hospital,50 to 69,117,M,White,Not Span/Hispanic,22,Emergency,Home or Self Care,2020,NEO065,MULTIPLE MYELOMA,LYM007,BONE MARROW BIOPSY,691,"LYMPHOMA, MYELOMA & NON-ACUTE LEUKEMIA",17,"MYELOPROLIFERATIVE DISEASES AND DISORDERS, AND POORLY DIFFERENTIATED NEOPLASM",3,Major,Major,Medical,Blue Cross/Blue Shield,Self-Pay,,,,Y,325446.2,85034.59
New York City,Manhattan,7002053,001463,NYU Langone Hospitals,50 to 69,113,F,Other Race,Not Span/Hispanic,9,Urgent,Home or Self Care,2020,NEO058,NON-HODGKIN LYMPHOMA,CNS001,MINIMALLY INVASIVE CNS BIOPSY,691,"LYMPHOMA, MYELOMA & NON-ACUTE LEUKEMIA",17,"MYELOPROLIFERATIVE DISEASES AND DISORDERS, AND POORLY DIFFERENTIATED NEOPLASM",3,Major,Major,Medical,Private Health Insurance,,,,,N,264660.6,47366.14
New York City,Kings,7002053,001304,NYU Langone Hospital-Brooklyn,50 to 69,112,F,White,Not Span/Hispanic,10,Emergency,Skilled Nursing Home,2020,NEO058,NON-HODGKIN LYMPHOMA,,,691,"LYMPHOMA, MYELOMA & NON-ACUTE LEUKEMIA",17,"MYELOPROLIFERATIVE DISEASES AND DISORDERS, AND POORLY DIFFERENTIATED NEOPLASM",2,Moderate,Minor,Medical,Medicaid,,,,,Y,162359.06,37657.81
New York City,Kings,7002053,001304,NYU Langone Hospital-Brooklyn,50 to 69,112,F,White,Not Span/Hispanic,2,Emergency,Home w/ Home Health Services,2020,NEO058,NON-HODGKIN LYMPHOMA,ADM001,TRANSFUSION OF BLOOD AND BLOOD PRODUCTS,691,"LYMPHOMA, MYELOMA & NON-ACUTE LEUKEMIA",17,"MYELOPROLIFERATIVE DISEASES AND DISORDERS, AND POORLY DIFFERENTIATED NEOPLASM",2,Moderate,Moderate,Medical,Private Health Insurance,,,,,Y,36160.64,10709.1
New York City,Bronx,7000006,001169,Montefiore Medical Center - Henry & Lucy Moses Div,50 to 69,104,M,Other Race,Spanish/Hispanic,6,Urgent,Home w/ Home Health Services,2020,NEO065,MULTIPLE MYELOMA,GIS001,ESOPHAGOGASTRODUODENOSCOPY (EGD) WITH BIOPSY,691,"LYMPHOMA, MYELOMA & NON-ACUTE LEUKEMIA",17,"MYELOPROLIFERATIVE DISEASES AND DISORDERS, AND POORLY DIFFERENTIATED NEOPLASM",4,Extreme,Major,Medical,Medicare,Medicaid,,,,N,118628.76,24248.82
Hudson Valley,Rockland,4329000,000779,Good Samaritan Hospital of Suffern,50 to 69,109,M,White,Not Span/Hispanic,12,Emergency,Home or Self Care,2020,NEO058,NON-HODGKIN LYMPHOMA,RES005,CHEST TUBE PLACEMENT AND THERAPEUTIC THORACENTESIS,691,"LYMPHOMA, MYELOMA & NON-ACUTE LEUKEMIA",17,"MYELOPROLIFERATIVE DISEASES AND DISORDERS, AND POORLY DIFFERENTIATED NEOPLASM",3,Major,Extreme,Medical,Medicaid,,,,,Y,220538.99,55474.21
New York City,Bronx,7000006,001168,Montefiore Medical Center-Wakefield Hospital,30 to 49,104,F,White,Not Span/Hispanic,6,Emergency,Home or Self Care,2020,NEO057,HODGKIN LYMPHOMA,GNR007,"MEDIASTINAL PROCEDURES, NEC",691,"LYMPHOMA, MYELOMA & NON-ACUTE LEUKEMIA",17,"MYELOPROLIFERATIVE DISEASES AND DISORDERS, AND POORLY DIFFERENTIATED NEOPLASM",2,Moderate,Minor,Medical,Private Health Insurance,,,,,Y,105384.45,14481.73
New York City,Manhattan,7002053,001463,NYU Langone Hospitals,70 or Older,114,M,White,Not Span/Hispanic,1,Elective,Home w/ Home Health Services,2020,NEO061,LEUKEMIA - CHRONIC LYMPHOCYTIC LEUKEMIA (CLL),RES005,CHEST TUBE PLACEMENT AND THERAPEUTIC THORACENTESIS,691,"LYMPHOMA, MYELOMA & NON-ACUTE LEUKEMIA",17,"MYELOPROLIFERATIVE DISEASES AND DISORDERS, AND POORLY DIFFERENTIATED NEOPLASM",1,Minor,Moderate,Medical,Medicare,Medicaid,,,,N,43367.82,7694.47
New York City,Kings,7002053,001304,NYU Langone Hospital-Brooklyn,70 or Older,112,M,White,Not Span/Hispanic,5,Emergency,Home or Self Care,2020,NEO058,NON-HODGKIN LYMPHOMA,LYM007,BONE MARROW BIOPSY,691,"LYMPHOMA, MYELOMA & NON-ACUTE LEUKEMIA",17,"MYELOPROLIFERATIVE DISEASES AND DISORDERS, AND POORLY DIFFERENTIATED NEOPLASM",3,Major,Major,Medical,Medicare,Private Health Insurance,,,,Y,66426.45,19143.19