Hospital Service Area,Hospital County,Operating Certificate Number,Permanent Facility Id,Facility Name,Age Group,Zip Code - 3 digits,Gender,Race,Ethnicity,Length of Stay,Type of Admission,Patient Disposition,Discharge Year,CCS Diagnosis Code,CCS Diagnosis Description,CCS Procedure Code,CCS Procedure Description,APR DRG Code,APR DRG Description,APR MDC Code,APR MDC Description,APR Severity of Illness Code,APR Severity of Illness Description,APR Risk of Mortality,APR Medical Surgical Description,Payment Typology 1,Payment Typology 2,Payment Typology 3,Birth Weight,Abortion Edit Indicator,Emergency Department Indicator,Total Charges,Total Costs
New York City,Manhattan,7002001,001438,Bellevue Hospital Center,50 to 69,112,M,White,Unknown,10,Emergency,Court/Law Enforcement,2020,NEO058,NON-HODGKIN LYMPHOMA,LYM007,BONE MARROW BIOPSY,691,"LYMPHOMA, MYELOMA & NON-ACUTE LEUKEMIA",17,"MYELOPROLIFERATIVE DISEASES AND DISORDERS, AND POORLY DIFFERENTIATED NEOPLASM",3,Major,Major,Medical,Medicaid,,,,,Y,77450.33,44540.45
New York City,Manhattan,7002001,001438,Bellevue Hospital Center,30 to 49,100,M,Other Race,Unknown,5,Urgent,Home or Self Care,2020,NEO062,LEUKEMIA - CHRONIC MYELOID LEUKEMIA (CML),LYM007,BONE MARROW BIOPSY,691,"LYMPHOMA, MYELOMA & NON-ACUTE LEUKEMIA",17,"MYELOPROLIFERATIVE DISEASES AND DISORDERS, AND POORLY DIFFERENTIATED NEOPLASM",2,Moderate,Minor,Medical,Medicaid,,,,,N,35648.31,20500.77
New York City,Manhattan,7002001,001438,Bellevue Hospital Center,30 to 49,100,M,Other Race,Spanish/Hispanic,2,Elective,Home or Self Care,2020,NEO065,MULTIPLE MYELOMA,ADM001,TRANSFUSION OF BLOOD AND BLOOD PRODUCTS,691,"LYMPHOMA, MYELOMA & NON-ACUTE LEUKEMIA",17,"MYELOPROLIFERATIVE DISEASES AND DISORDERS, AND POORLY DIFFERENTIATED NEOPLASM",2,Moderate,Moderate,Medical,Medicaid,,,,,N,16397.1,9429.71
New York City,Manhattan,7002001,001438,Bellevue Hospital Center,30 to 49,100,M,Other Race,Spanish/Hispanic,1,Emergency,Home or Self Care,2020,NEO065,MULTIPLE MYELOMA,ADM001,TRANSFUSION OF BLOOD AND BLOOD PRODUCTS,691,"LYMPHOMA, MYELOMA & NON-ACUTE LEUKEMIA",17,"MYELOPROLIFERATIVE DISEASES AND DISORDERS, AND POORLY DIFFERENTIATED NEOPLASM",2,Moderate,Moderate,Medical,Medicaid,,,,,Y,11062.96,6362.13
New York City,Manhattan,7002001,001438,Bellevue Hospital Center,50 to 69,100,M,Black/African American,Not Span/Hispanic,6,Urgent,Skilled Nursing Home,2020,NEO061,LEUKEMIA - CHRONIC LYMPHOCYTIC LEUKEMIA (CLL),ADM001,TRANSFUSION OF BLOOD AND BLOOD PRODUCTS,691,"LYMPHOMA, MYELOMA & NON-ACUTE LEUKEMIA",17,"MYELOPROLIFERATIVE DISEASES AND DISORDERS, AND POORLY DIFFERENTIATED NEOPLASM",3,Major,Moderate,Medical,Medicare,Medicaid,,,,N,48276.81,27763.22
New York City,Manhattan,7002001,001438,Bellevue Hospital Center,50 to 69,112,F,Other Race,Spanish/Hispanic,9,Emergency,Home or Self Care,2020,NEO058,NON-HODGKIN LYMPHOMA,LYM007,BONE MARROW BIOPSY,691,"LYMPHOMA, MYELOMA & NON-ACUTE LEUKEMIA",17,"MYELOPROLIFERATIVE DISEASES AND DISORDERS, AND POORLY DIFFERENTIATED NEOPLASM",2,Moderate,Major,Medical,Medicaid,,,,,Y,76703.91,44111.19
New York City,Manhattan,7002001,001438,Bellevue Hospital Center,30 to 49,111,M,White,Spanish/Hispanic,6,Emergency,Home or Self Care,2020,NEO065,MULTIPLE MYELOMA,EST001,PHERESIS THERAPY,691,"LYMPHOMA, MYELOMA & NON-ACUTE LEUKEMIA",17,"MYELOPROLIFERATIVE DISEASES AND DISORDERS, AND POORLY DIFFERENTIATED NEOPLASM",2,Moderate,Moderate,Medical,Medicaid,,,,,Y,55985.91,32196.6
New York City,Manhattan,7002001,001438,Bellevue Hospital Center,70 or Older,100,M,Other Race,Spanish/Hispanic,1,Emergency,Home or Self Care,2020,NEO061,LEUKEMIA - CHRONIC LYMPHOCYTIC LEUKEMIA (CLL),ADM001,TRANSFUSION OF BLOOD AND BLOOD PRODUCTS,691,"LYMPHOMA, MYELOMA & NON-ACUTE LEUKEMIA",17,"MYELOPROLIFERATIVE DISEASES AND DISORDERS, AND POORLY DIFFERENTIATED NEOPLASM",2,Moderate,Moderate,Medical,Medicare,,,,,Y,12160.51,6993.31
New York City,Manhattan,7002001,001438,Bellevue Hospital Center,50 to 69,100,M,Black/African American,Not Span/Hispanic,30,Emergency,Skilled Nursing Home,2020,NEO058,NON-HODGKIN LYMPHOMA,ADM012,CHEMOTHERAPY,691,"LYMPHOMA, MYELOMA & NON-ACUTE LEUKEMIA",17,"MYELOPROLIFERATIVE DISEASES AND DISORDERS, AND POORLY DIFFERENTIATED NEOPLASM",3,Major,Moderate,Medical,Medicaid,,,,,Y,243059.02,139779.35
New York City,Manhattan,7002001,001438,Bellevue Hospital Center,50 to 69,113,M,Other Race,Spanish/Hispanic,4,Emergency,Home or Self Care,2020,NEO058,NON-HODGKIN LYMPHOMA,ENT003,ENT DIAGNOSTIC PROCEDURES (NON-ENDOSCOPIC),691,"LYMPHOMA, MYELOMA & NON-ACUTE LEUKEMIA",17,"MYELOPROLIFERATIVE DISEASES AND DISORDERS, AND POORLY DIFFERENTIATED NEOPLASM",1,Minor,Minor,Medical,Medicaid,,,,,Y,46765.38,26894.02
New York City,Manhattan,7002001,001438,Bellevue Hospital Center,70 or Older,114,F,Other Race,Not Span/Hispanic,6,Urgent,Home or Self Care,2020,NEO058,NON-HODGKIN LYMPHOMA,HEP001,LIVER BIOPSY,691,"LYMPHOMA, MYELOMA & NON-ACUTE LEUKEMIA",17,"MYELOPROLIFERATIVE DISEASES AND DISORDERS, AND POORLY DIFFERENTIATED NEOPLASM",3,Major,Minor,Medical,Medicaid,,,,,N,50144.06,28837.05
New York City,Manhattan,7002001,001438,Bellevue Hospital Center,50 to 69,100,M,Black/African American,Not Span/Hispanic,28,Elective,Short-term Hospital,2020,NEO058,NON-HODGKIN LYMPHOMA,,,691,"LYMPHOMA, MYELOMA & NON-ACUTE LEUKEMIA",17,"MYELOPROLIFERATIVE DISEASES AND DISORDERS, AND POORLY DIFFERENTIATED NEOPLASM",3,Major,Moderate,Medical,Medicaid,,,,,N,174046.64,100091.44
New York City,Manhattan,7002001,001438,Bellevue Hospital Center,18 to 29,112,M,White,Not Span/Hispanic,15,Emergency,Home or Self Care,2020,NEO057,HODGKIN LYMPHOMA,LYM007,BONE MARROW BIOPSY,691,"LYMPHOMA, MYELOMA & NON-ACUTE LEUKEMIA",17,"MYELOPROLIFERATIVE DISEASES AND DISORDERS, AND POORLY DIFFERENTIATED NEOPLASM",3,Major,Minor,Medical,Private Health Insurance,,,,,Y,162173.49,93263.38
New York City,Manhattan,7002001,001438,Bellevue Hospital Center,30 to 49,112,M,White,Not Span/Hispanic,1,Emergency,Home or Self Care,2020,NEO063,LEUKEMIA - HAIRY CELL,ADM001,TRANSFUSION OF BLOOD AND BLOOD PRODUCTS,691,"LYMPHOMA, MYELOMA & NON-ACUTE LEUKEMIA",17,"MYELOPROLIFERATIVE DISEASES AND DISORDERS, AND POORLY DIFFERENTIATED NEOPLASM",2,Moderate,Minor,Medical,Medicaid,,,,,Y,19896.59,11442.21
New York City,Manhattan,7002001,001438,Bellevue Hospital Center,18 to 29,112,M,Other Race,Unknown,6,Emergency,Home or Self Care,2020,NEO057,HODGKIN LYMPHOMA,LYM001,LYMPH NODE BIOPSY,691,"LYMPHOMA, MYELOMA & NON-ACUTE LEUKEMIA",17,"MYELOPROLIFERATIVE DISEASES AND DISORDERS, AND POORLY DIFFERENTIATED NEOPLASM",3,Major,Moderate,Medical,Private Health Insurance,,,,,Y,82531.12,47462.33
New York City,Manhattan,7002001,001438,Bellevue Hospital Center,70 or Older,113,F,Other Race,Not Span/Hispanic,13,Emergency,Home or Self Care,2020,NEO065,MULTIPLE MYELOMA,CAR024,VENOUS AND ARTERIAL CATHETER PLACEMENT,691,"LYMPHOMA, MYELOMA & NON-ACUTE LEUKEMIA",17,"MYELOPROLIFERATIVE DISEASES AND DISORDERS, AND POORLY DIFFERENTIATED NEOPLASM",3,Major,Major,Medical,Medicaid,,,,,Y,147898.3,85053.95
New York City,Manhattan,7002001,001438,Bellevue Hospital Center,50 to 69,112,M,Other Race,Spanish/Hispanic,4,Emergency,Home or Self Care,2020,NEO058,NON-HODGKIN LYMPHOMA,ENT003,ENT DIAGNOSTIC PROCEDURES (NON-ENDOSCOPIC),691,"LYMPHOMA, MYELOMA & NON-ACUTE LEUKEMIA",17,"MYELOPROLIFERATIVE DISEASES AND DISORDERS, AND POORLY DIFFERENTIATED NEOPLASM",3,Major,Major,Medical,Medicaid,,,,,Y,41425.06,23822.89
New York City,Manhattan,7002001,001438,Bellevue Hospital Center,30 to 49,113,F,Other Race,Spanish/Hispanic,16,Emergency,Home or Self Care,2020,NEO058,NON-HODGKIN LYMPHOMA,ADM012,CHEMOTHERAPY,691,"LYMPHOMA, MYELOMA & NON-ACUTE LEUKEMIA",17,"MYELOPROLIFERATIVE DISEASES AND DISORDERS, AND POORLY DIFFERENTIATED NEOPLASM",3,Major,Major,Medical,Medicaid,,,,,Y,235103.48,135204.25
New York City,Manhattan,7002001,001438,Bellevue Hospital Center,50 to 69,112,M,White,Not Span/Hispanic,5,Emergency,Home w/ Home Health Services,2020,NEO061,LEUKEMIA - CHRONIC LYMPHOCYTIC LEUKEMIA (CLL),IMG006,COMPUTERIZED TOMOGRAPHY (CT) WITH CONTRAST,691,"LYMPHOMA, MYELOMA & NON-ACUTE LEUKEMIA",17,"MYELOPROLIFERATIVE DISEASES AND DISORDERS, AND POORLY DIFFERENTIATED NEOPLASM",2,Moderate,Moderate,Medical,Medicaid,,,,,Y,76786.5,44158.69
New York City,Manhattan,7002001,001438,Bellevue Hospital Center,30 to 49,100,M,Other Race,Spanish/Hispanic,10,Urgent,Home w/ Home Health Services,2020,NEO065,MULTIPLE MYELOMA,LYM007,BONE MARROW BIOPSY,691,"LYMPHOMA, MYELOMA & NON-ACUTE LEUKEMIA",17,"MYELOPROLIFERATIVE DISEASES AND DISORDERS, AND POORLY DIFFERENTIATED NEOPLASM",3,Major,Moderate,Medical,Medicare,Medicaid,,,,N,124480.3,71586.63
New York City,Manhattan,7002001,001438,Bellevue Hospital Center,50 to 69,113,F,Other Race,Spanish/Hispanic,2,Emergency,Home or Self Care,2020,NEO058,NON-HODGKIN LYMPHOMA,IMG009,PLAIN RADIOGRAPHY,691,"LYMPHOMA, MYELOMA & NON-ACUTE LEUKEMIA",17,"MYELOPROLIFERATIVE DISEASES AND DISORDERS, AND POORLY DIFFERENTIATED NEOPLASM",2,Moderate,Minor,Medical,Medicaid,,,,,Y,17571.58,10105.13
New York City,Manhattan,7002001,001438,Bellevue Hospital Center,70 or Older,100,M,White,Unknown,3,Emergency,Home or Self Care,2020,NEO062,LEUKEMIA - CHRONIC MYELOID LEUKEMIA (CML),ADM001,TRANSFUSION OF BLOOD AND BLOOD PRODUCTS,691,"LYMPHOMA, MYELOMA & NON-ACUTE LEUKEMIA",17,"MYELOPROLIFERATIVE DISEASES AND DISORDERS, AND POORLY DIFFERENTIATED NEOPLASM",3,Major,Major,Medical,Medicaid,,,,,Y,35029.82,20145.09
New York City,Manhattan,7002001,001438,Bellevue Hospital Center,30 to 49,112,M,Black/African American,Not Span/Hispanic,17,Emergency,Home or Self Care,2020,NEO057,HODGKIN LYMPHOMA,LYM007,BONE MARROW BIOPSY,691,"LYMPHOMA, MYELOMA & NON-ACUTE LEUKEMIA",17,"MYELOPROLIFERATIVE DISEASES AND DISORDERS, AND POORLY DIFFERENTIATED NEOPLASM",4,Extreme,Extreme,Medical,Medicaid,,,,,Y,158266.03,91016.26
New York City,Manhattan,7002001,001438,Bellevue Hospital Center,30 to 49,112,M,Other Race,Spanish/Hispanic,16,Emergency,Home or Self Care,2020,NEO058,NON-HODGKIN LYMPHOMA,RES001,BRONCHOSCOPY (DIAGNOSTIC),691,"LYMPHOMA, MYELOMA & NON-ACUTE LEUKEMIA",17,"MYELOPROLIFERATIVE DISEASES AND DISORDERS, AND POORLY DIFFERENTIATED NEOPLASM",2,Moderate,Major,Medical,Medicaid,,,,,Y,153842.7,88472.48
New York City,Manhattan,7002001,001438,Bellevue Hospital Center,50 to 69,112,M,Black/African American,Not Span/Hispanic,9,Emergency,Home or Self Care,2020,NEO065,MULTIPLE MYELOMA,LYM007,BONE MARROW BIOPSY,691,"LYMPHOMA, MYELOMA & NON-ACUTE LEUKEMIA",17,"MYELOPROLIFERATIVE DISEASES AND DISORDERS, AND POORLY DIFFERENTIATED NEOPLASM",4,Extreme,Major,Medical,Private Health Insurance,,,,,Y,99930.62,57468.5
New York City,Manhattan,7002001,001438,Bellevue Hospital Center,30 to 49,113,M,Other Race,Spanish/Hispanic,3,Emergency,Court/Law Enforcement,2020,NEO062,LEUKEMIA - CHRONIC MYELOID LEUKEMIA (CML),ADM012,CHEMOTHERAPY,691,"LYMPHOMA, MYELOMA & NON-ACUTE LEUKEMIA",17,"MYELOPROLIFERATIVE DISEASES AND DISORDERS, AND POORLY DIFFERENTIATED NEOPLASM",3,Major,Minor,Medical,Medicaid,,,,,Y,26890.81,15464.47
New York City,Manhattan,7002001,001438,Bellevue Hospital Center,18 to 29,112,F,Multi-racial,Not Span/Hispanic,1,Emergency,Home or Self Care,2020,NEO057,HODGKIN LYMPHOMA,ADM001,TRANSFUSION OF BLOOD AND BLOOD PRODUCTS,691,"LYMPHOMA, MYELOMA & NON-ACUTE LEUKEMIA",17,"MYELOPROLIFERATIVE DISEASES AND DISORDERS, AND POORLY DIFFERENTIATED NEOPLASM",2,Moderate,Minor,Medical,Medicaid,,,,,Y,13096.58,7531.63
New York City,Manhattan,7002001,001438,Bellevue Hospital Center,18 to 29,112,F,Multi-racial,Not Span/Hispanic,1,Emergency,Home or Self Care,2020,NEO057,HODGKIN LYMPHOMA,ADM001,TRANSFUSION OF BLOOD AND BLOOD PRODUCTS,691,"LYMPHOMA, MYELOMA & NON-ACUTE LEUKEMIA",17,"MYELOPROLIFERATIVE DISEASES AND DISORDERS, AND POORLY DIFFERENTIATED NEOPLASM",1,Minor,Minor,Medical,Medicaid,,,,,Y,10758.07,6186.79
New York City,Manhattan,7002001,001438,Bellevue Hospital Center,30 to 49,113,F,Other Race,Spanish/Hispanic,7,Emergency,Home w/ Home Health Services,2020,NEO058,NON-HODGKIN LYMPHOMA,ENT006,ENT DRAINAGE (EXCLUDING MYRINGOTOMY),691,"LYMPHOMA, MYELOMA & NON-ACUTE LEUKEMIA",17,"MYELOPROLIFERATIVE DISEASES AND DISORDERS, AND POORLY DIFFERENTIATED NEOPLASM",4,Extreme,Major,Medical,Medicaid,,,,,Y,78043.32,44881.46
New York City,Manhattan,7002001,001438,Bellevue Hospital Center,50 to 69,112,M,Other Race,Spanish/Hispanic,6,Emergency,Home or Self Care,2020,NEO058,NON-HODGKIN LYMPHOMA,GNR008,"ABDOMINAL WALL PROCEDURES, NEC",691,"LYMPHOMA, MYELOMA & NON-ACUTE LEUKEMIA",17,"MYELOPROLIFERATIVE DISEASES AND DISORDERS, AND POORLY DIFFERENTIATED NEOPLASM",2,Moderate,Minor,Medical,Medicare,Medicaid,,,,Y,51850.96,29818.66
New York City,Manhattan,7002001,001438,Bellevue Hospital Center,50 to 69,112,M,Black/African American,Not Span/Hispanic,14,Elective,Expired,2020,NEO065,MULTIPLE MYELOMA,ADM012,CHEMOTHERAPY,691,"LYMPHOMA, MYELOMA & NON-ACUTE LEUKEMIA",17,"MYELOPROLIFERATIVE DISEASES AND DISORDERS, AND POORLY DIFFERENTIATED NEOPLASM",4,Extreme,Major,Medical,Medicaid,,,,,N,120085.28,69059.12
New York City,Manhattan,7002001,001438,Bellevue Hospital Center,50 to 69,113,M,Other Race,Not Span/Hispanic,3,Emergency,Home or Self Care,2020,NEO058,NON-HODGKIN LYMPHOMA,GNR009,"RETROPERITONEAL PROCEDURES, NEC",691,"LYMPHOMA, MYELOMA & NON-ACUTE LEUKEMIA",17,"MYELOPROLIFERATIVE DISEASES AND DISORDERS, AND POORLY DIFFERENTIATED NEOPLASM",2,Moderate,Moderate,Medical,Medicaid,,,,,Y,39769.91,22871.04
New York City,Manhattan,7002001,001438,Bellevue Hospital Center,50 to 69,112,M,Other Race,Unknown,4,Emergency,Home or Self Care,2020,NEO062,LEUKEMIA - CHRONIC MYELOID LEUKEMIA (CML),LYM007,BONE MARROW BIOPSY,691,"LYMPHOMA, MYELOMA & NON-ACUTE LEUKEMIA",17,"MYELOPROLIFERATIVE DISEASES AND DISORDERS, AND POORLY DIFFERENTIATED NEOPLASM",3,Major,Moderate,Medical,Medicaid,,,,,Y,34876.04,20056.65
New York City,Manhattan,7002001,001438,Bellevue Hospital Center,50 to 69,113,M,Other Race,Not Span/Hispanic,5,Emergency,Home or Self Care,2020,NEO058,NON-HODGKIN LYMPHOMA,ADM012,CHEMOTHERAPY,691,"LYMPHOMA, MYELOMA & NON-ACUTE LEUKEMIA",17,"MYELOPROLIFERATIVE DISEASES AND DISORDERS, AND POORLY DIFFERENTIATED NEOPLASM",4,Extreme,Major,Medical,Medicaid,,,,,Y,76092.21,43759.41
New York City,Manhattan,7002001,001438,Bellevue Hospital Center,50 to 69,112,M,Black/African American,Not Span/Hispanic,47,Emergency,Skilled Nursing Home,2020,NEO065,MULTIPLE MYELOMA,LYM007,BONE MARROW BIOPSY,691,"LYMPHOMA, MYELOMA & NON-ACUTE LEUKEMIA",17,"MYELOPROLIFERATIVE DISEASES AND DISORDERS, AND POORLY DIFFERENTIATED NEOPLASM",4,Extreme,Major,Medical,Private Health Insurance,,,,,Y,441473.37,253884.27
New York City,Manhattan,7002001,001438,Bellevue Hospital Center,50 to 69,100,F,Other Race,Not Span/Hispanic,8,Emergency,Home or Self Care,2020,NEO062,LEUKEMIA - CHRONIC MYELOID LEUKEMIA (CML),LYM007,BONE MARROW BIOPSY,691,"LYMPHOMA, MYELOMA & NON-ACUTE LEUKEMIA",17,"MYELOPROLIFERATIVE DISEASES AND DISORDERS, AND POORLY DIFFERENTIATED NEOPLASM",2,Moderate,Minor,Medical,Medicare,Medicaid,,,,Y,64584.42,37141.47
New York City,Manhattan,7002001,001438,Bellevue Hospital Center,50 to 69,112,M,Black/African American,Not Span/Hispanic,1,Emergency,Skilled Nursing Home,2020,NEO065,MULTIPLE MYELOMA,ADM001,TRANSFUSION OF BLOOD AND BLOOD PRODUCTS,691,"LYMPHOMA, MYELOMA & NON-ACUTE LEUKEMIA",17,"MYELOPROLIFERATIVE DISEASES AND DISORDERS, AND POORLY DIFFERENTIATED NEOPLASM",3,Major,Major,Medical,Private Health Insurance,,,,,Y,12207.74,7020.48
New York City,Manhattan,7002001,001438,Bellevue Hospital Center,50 to 69,114,M,Other Race,Spanish/Hispanic,10,Urgent,Expired,2020,NEO057,HODGKIN LYMPHOMA,CAR017,PERICARDIAL PROCEDURES,691,"LYMPHOMA, MYELOMA & NON-ACUTE LEUKEMIA",17,"MYELOPROLIFERATIVE DISEASES AND DISORDERS, AND POORLY DIFFERENTIATED NEOPLASM",4,Extreme,Extreme,Medical,Medicaid,,,,,N,188795.05,108573.01
New York City,Manhattan,7002001,001438,Bellevue Hospital Center,70 or Older,112,M,Other Race,Spanish/Hispanic,37,Emergency,Home w/ Home Health Services,2020,NEO058,NON-HODGKIN LYMPHOMA,ENT002,ENT DIAGNOSTIC ENDOSCOPY (EXCLUDING LARYNGOSCOPY),691,"LYMPHOMA, MYELOMA & NON-ACUTE LEUKEMIA",17,"MYELOPROLIFERATIVE DISEASES AND DISORDERS, AND POORLY DIFFERENTIATED NEOPLASM",4,Extreme,Extreme,Medical,Medicare,Medicaid,,,,Y,327193.95,188164.01
New York City,Manhattan,7002001,001438,Bellevue Hospital Center,70 or Older,100,F,Other Race,Unknown,2,Emergency,Home or Self Care,2020,NEO065,MULTIPLE MYELOMA,ADM001,TRANSFUSION OF BLOOD AND BLOOD PRODUCTS,691,"LYMPHOMA, MYELOMA & NON-ACUTE LEUKEMIA",17,"MYELOPROLIFERATIVE DISEASES AND DISORDERS, AND POORLY DIFFERENTIATED NEOPLASM",3,Major,Major,Medical,Medicare,,,,,Y,18147.69,10436.45
New York City,Manhattan,7002001,001438,Bellevue Hospital Center,50 to 69,104,M,Black/African American,Not Span/Hispanic,5,Emergency,Home or Self Care,2020,NEO065,MULTIPLE MYELOMA,IMG005,MAGNETIC RESONANCE IMAGING (MRI),691,"LYMPHOMA, MYELOMA & NON-ACUTE LEUKEMIA",17,"MYELOPROLIFERATIVE DISEASES AND DISORDERS, AND POORLY DIFFERENTIATED NEOPLASM",3,Major,Moderate,Medical,Medicaid,,,,,Y,38155.77,21942.77
New York City,Manhattan,7002001,001438,Bellevue Hospital Center,50 to 69,112,M,White,Not Span/Hispanic,3,Emergency,Home or Self Care,2020,NEO061,LEUKEMIA - CHRONIC LYMPHOCYTIC LEUKEMIA (CLL),ADM001,TRANSFUSION OF BLOOD AND BLOOD PRODUCTS,691,"LYMPHOMA, MYELOMA & NON-ACUTE LEUKEMIA",17,"MYELOPROLIFERATIVE DISEASES AND DISORDERS, AND POORLY DIFFERENTIATED NEOPLASM",2,Moderate,Minor,Medical,Medicaid,,,,,Y,31522.51,18128.09
