Hospital Service Area,Hospital County,Operating Certificate Number,Permanent Facility Id,Facility Name,Age Group,Zip Code - 3 digits,Gender,Race,Ethnicity,Length of Stay,Type of Admission,Patient Disposition,Discharge Year,CCS Diagnosis Code,CCS Diagnosis Description,CCS Procedure Code,CCS Procedure Description,APR DRG Code,APR DRG Description,APR MDC Code,APR MDC Description,APR Severity of Illness Code,APR Severity of Illness Description,APR Risk of Mortality,APR Medical Surgical Description,Payment Typology 1,Payment Typology 2,Payment Typology 3,Birth Weight,Abortion Edit Indicator,Emergency Department Indicator,Total Charges,Total Costs
Hudson Valley,Orange,3523000,000699,Orange Regional Medical Center,30 to 49,125,F,Other Race,Not Span/Hispanic,2,Urgent,Home or Self Care,2017,045,Maintenance chemotherapy; radiotherapy,211,THERAPEUTIC RADIOLOGY,692,Radiotherapy,17,"Lymphatic, Hematopoietic, Other Malignancies, Chemotherapy and Radiotherapy",1,Minor,Minor,Medical,Private Health Insurance,,,,N,N,9081.61,2324.65
New York City,Kings,7001021,001306,New York - Presbyterian Brooklyn Methodist Hospital,70 or Older,112,M,Black/African American,Not Span/Hispanic,4,Elective,Home or Self Care,2017,045,Maintenance chemotherapy; radiotherapy,211,THERAPEUTIC RADIOLOGY,692,Radiotherapy,17,"Lymphatic, Hematopoietic, Other Malignancies, Chemotherapy and Radiotherapy",2,Moderate,Moderate,Medical,Medicaid,Medicaid,Self-Pay,,N,N,54634.38,9608.92
Hudson Valley,Orange,3523000,000699,Orange Regional Medical Center,50 to 69,109,F,Other Race,Spanish/Hispanic,2,Elective,Home or Self Care,2017,045,Maintenance chemotherapy; radiotherapy,000,NO PROC,692,Radiotherapy,17,"Lymphatic, Hematopoietic, Other Malignancies, Chemotherapy and Radiotherapy",1,Minor,Minor,Medical,Private Health Insurance,,,,N,N,29142.01,13600.00
New York City,Bronx,7000006,001169,Montefiore Medical Center - Henry & Lucy Moses Div,30 to 49,104,M,Multi-racial,Not Span/Hispanic,3,Emergency,Home or Self Care,2017,035,Cancer of brain and nervous system,007,OTHER DX NERV SYS PRCS,692,Radiotherapy,17,"Lymphatic, Hematopoietic, Other Malignancies, Chemotherapy and Radiotherapy",3,Major,Major,Medical,Medicare,,,,N,Y,79789.33,12926.65
New York City,Bronx,7000006,003058,Montefiore Med Center - Jack D Weiler Hosp of A Einstein College Div,50 to 69,104,F,White,Not Span/Hispanic,47,Emergency,Expired,2017,042,Secondary malignancies,211,THERAPEUTIC RADIOLOGY,692,Radiotherapy,17,"Lymphatic, Hematopoietic, Other Malignancies, Chemotherapy and Radiotherapy",3,Major,Major,Medical,Blue Cross/Blue Shield,,,,N,Y,528171.90,101679.82
New York City,Manhattan,7002053,001463,NYU Langone Hospitals,50 to 69,112,F,Black/African American,Not Span/Hispanic,8,Emergency,Home w/ Home Health Services,2017,042,Secondary malignancies,211,THERAPEUTIC RADIOLOGY,692,Radiotherapy,17,"Lymphatic, Hematopoietic, Other Malignancies, Chemotherapy and Radiotherapy",3,Major,Major,Medical,Blue Cross/Blue Shield,,,,N,Y,234988.36,82096.78
New York City,Manhattan,7002054,001464,New York Presbyterian Hospital - Columbia Presbyterian Center,30 to 49,129,M,White,Not Span/Hispanic,4,Urgent,Home or Self Care,2017,045,Maintenance chemotherapy; radiotherapy,211,THERAPEUTIC RADIOLOGY,692,Radiotherapy,17,"Lymphatic, Hematopoietic, Other Malignancies, Chemotherapy and Radiotherapy",1,Minor,Minor,Medical,Medicare,Medicaid,Self-Pay,,N,N,59221.99,19703.33
New York City,Manhattan,7002054,001464,New York Presbyterian Hospital - Columbia Presbyterian Center,30 to 49,OOS,F,White,Not Span/Hispanic,3,Elective,Home or Self Care,2017,045,Maintenance chemotherapy; radiotherapy,226,OT DX RADIO & RELATED,692,Radiotherapy,17,"Lymphatic, Hematopoietic, Other Malignancies, Chemotherapy and Radiotherapy",1,Minor,Minor,Medical,Private Health Insurance,Self-Pay,,,N,N,36616.21,12060.62
New York City,Manhattan,7002054,001464,New York Presbyterian Hospital - Columbia Presbyterian Center,70 or Older,100,F,Black/African American,Not Span/Hispanic,16,Emergency,Expired,2017,042,Secondary malignancies,211,THERAPEUTIC RADIOLOGY,692,Radiotherapy,17,"Lymphatic, Hematopoietic, Other Malignancies, Chemotherapy and Radiotherapy",4,Extreme,Extreme,Medical,Medicare,Medicaid,Self-Pay,,N,Y,188519.85,47020.90
New York City,Bronx,7000006,001169,Montefiore Medical Center - Henry & Lucy Moses Div,30 to 49,104,F,Other Race,Not Span/Hispanic,3,Elective,Home or Self Care,2017,045,Maintenance chemotherapy; radiotherapy,211,THERAPEUTIC RADIOLOGY,692,Radiotherapy,17,"Lymphatic, Hematopoietic, Other Malignancies, Chemotherapy and Radiotherapy",1,Minor,Minor,Medical,Medicaid,,,,N,N,61672.07,12987.92
New York City,Bronx,7000006,001169,Montefiore Medical Center - Henry & Lucy Moses Div,70 or Older,104,F,Other Race,Not Span/Hispanic,9,Emergency,Hospice - Medical Facility,2017,045,Maintenance chemotherapy; radiotherapy,211,THERAPEUTIC RADIOLOGY,692,Radiotherapy,17,"Lymphatic, Hematopoietic, Other Malignancies, Chemotherapy and Radiotherapy",2,Moderate,Minor,Medical,Medicare,,,,N,N,107709.75,22787.34
New York City,Manhattan,7002001,001438,Bellevue Hospital Center,30 to 49,104,M,Other Race,Spanish/Hispanic,3,Emergency,Home or Self Care,2017,045,Maintenance chemotherapy; radiotherapy,211,THERAPEUTIC RADIOLOGY,692,Radiotherapy,17,"Lymphatic, Hematopoietic, Other Malignancies, Chemotherapy and Radiotherapy",1,Minor,Minor,Medical,Medicaid,,,,N,N,18609.32,11998.32
New York City,Manhattan,7002053,001463,NYU Langone Hospitals,30 to 49,112,F,Other Race,Not Span/Hispanic,1,Emergency,Home or Self Care,2017,042,Secondary malignancies,211,THERAPEUTIC RADIOLOGY,692,Radiotherapy,17,"Lymphatic, Hematopoietic, Other Malignancies, Chemotherapy and Radiotherapy",2,Moderate,Minor,Medical,Private Health Insurance,,,,N,Y,165606.63,132308.42
Long Island,Suffolk,5151001,000245,University Hospital,70 or Older,117,F,White,Not Span/Hispanic,9,Urgent,Inpatient Rehabilitation Facility,2017,045,Maintenance chemotherapy; radiotherapy,211,THERAPEUTIC RADIOLOGY,692,Radiotherapy,17,"Lymphatic, Hematopoietic, Other Malignancies, Chemotherapy and Radiotherapy",4,Extreme,Major,Medical,Medicare,Blue Cross/Blue Shield,,,N,N,87774.18,26379.22
Long Island,Suffolk,5151001,000245,University Hospital,70 or Older,117,F,White,Not Span/Hispanic,13,Urgent,Hospice - Medical Facility,2017,045,Maintenance chemotherapy; radiotherapy,223,ENTERAL/PARENTERAL NUTR,692,Radiotherapy,17,"Lymphatic, Hematopoietic, Other Malignancies, Chemotherapy and Radiotherapy",3,Major,Major,Medical,Medicare,Private Health Insurance,,,N,N,128472.31,37234.60
Finger Lakes,Monroe,2701005,000413,Strong Memorial Hospital,50 to 69,146,F,White,Not Span/Hispanic,27,Urgent,Expired,2017,045,Maintenance chemotherapy; radiotherapy,000,NO PROC,692,Radiotherapy,17,"Lymphatic, Hematopoietic, Other Malignancies, Chemotherapy and Radiotherapy",2,Moderate,Minor,Medical,Blue Cross/Blue Shield,Self-Pay,,,N,N,79269.74,36920.64
Capital/Adirond,Albany,0101000,000001,Albany Medical Center Hospital,50 to 69,124,F,White,Not Span/Hispanic,53,Urgent,Home or Self Care,2017,045,Maintenance chemotherapy; radiotherapy,211,THERAPEUTIC RADIOLOGY,692,Radiotherapy,17,"Lymphatic, Hematopoietic, Other Malignancies, Chemotherapy and Radiotherapy",3,Major,Major,Medical,Medicare,,,,N,N,246132.98,73046.06
Capital/Adirond,Albany,0101000,000001,Albany Medical Center Hospital,30 to 49,128,F,White,Not Span/Hispanic,2,Elective,Home or Self Care,2017,045,Maintenance chemotherapy; radiotherapy,226,OT DX RADIO & RELATED,692,Radiotherapy,17,"Lymphatic, Hematopoietic, Other Malignancies, Chemotherapy and Radiotherapy",1,Minor,Minor,Medical,"Managed Care, Unspecified",,,,N,N,5777.10,2326.76
New York City,Manhattan,7002020,001453,Memorial Sloan Kettering Memorial Hospital,50 to 69,OOS,F,White,Not Span/Hispanic,2,Elective,Home or Self Care,2017,045,Maintenance chemotherapy; radiotherapy,211,THERAPEUTIC RADIOLOGY,692,Radiotherapy,17,"Lymphatic, Hematopoietic, Other Malignancies, Chemotherapy and Radiotherapy",2,Moderate,Minor,Medical,Medicare,Private Health Insurance,Medicare,,N,N,96562.48,37324.13
New York City,Manhattan,7002020,001453,Memorial Sloan Kettering Memorial Hospital,70 or Older,OOS,M,White,Not Span/Hispanic,4,Emergency,Home or Self Care,2017,045,Maintenance chemotherapy; radiotherapy,211,THERAPEUTIC RADIOLOGY,692,Radiotherapy,17,"Lymphatic, Hematopoietic, Other Malignancies, Chemotherapy and Radiotherapy",2,Moderate,Moderate,Medical,Medicare,,,,N,Y,53195.51,20819.44
New York City,Manhattan,7002053,001463,NYU Langone Hospitals,50 to 69,113,F,White,Not Span/Hispanic,5,Emergency,Home w/ Home Health Services,2017,042,Secondary malignancies,211,THERAPEUTIC RADIOLOGY,692,Radiotherapy,17,"Lymphatic, Hematopoietic, Other Malignancies, Chemotherapy and Radiotherapy",4,Extreme,Extreme,Medical,Medicare,,,,N,Y,216757.73,157806.04
Central NY,Onondaga,3301007,000635,University Hospital SUNY Health Science Center,50 to 69,130,M,White,Not Span/Hispanic,23,Emergency,Skilled Nursing Home,2017,042,Secondary malignancies,211,THERAPEUTIC RADIOLOGY,692,Radiotherapy,17,"Lymphatic, Hematopoietic, Other Malignancies, Chemotherapy and Radiotherapy",3,Major,Major,Medical,Medicare,Medicaid,,,N,Y,248478.42,75838.31
New York City,Queens,7003004,001630,Long Island Jewish Medical Center,70 or Older,113,M,White,Not Span/Hispanic,20,Urgent,Skilled Nursing Home,2017,045,Maintenance chemotherapy; radiotherapy,168,"INCIS/DRAIN, SKIN/SUBCU",692,Radiotherapy,17,"Lymphatic, Hematopoietic, Other Malignancies, Chemotherapy and Radiotherapy",3,Major,Major,Medical,Medicare,Medicare,Self-Pay,,N,N,231334.36,54420.72
New York City,Queens,7003004,001630,Long Island Jewish Medical Center,70 or Older,115,F,White,Not Span/Hispanic,34,Urgent,Hospice - Medical Facility,2017,045,Maintenance chemotherapy; radiotherapy,211,THERAPEUTIC RADIOLOGY,692,Radiotherapy,17,"Lymphatic, Hematopoietic, Other Malignancies, Chemotherapy and Radiotherapy",4,Extreme,Extreme,Medical,Medicare,Medicare,Self-Pay,,N,N,305671.06,62796.86
New York City,Queens,7003004,001630,Long Island Jewish Medical Center,70 or Older,114,F,White,Not Span/Hispanic,21,Urgent,Expired,2017,045,Maintenance chemotherapy; radiotherapy,211,THERAPEUTIC RADIOLOGY,692,Radiotherapy,17,"Lymphatic, Hematopoietic, Other Malignancies, Chemotherapy and Radiotherapy",3,Major,Major,Medical,Medicare,Medicare,Self-Pay,,N,N,208282.84,44602.93
New York City,Queens,7003004,001630,Long Island Jewish Medical Center,50 to 69,114,F,White,Not Span/Hispanic,9,Urgent,Expired,2017,045,Maintenance chemotherapy; radiotherapy,216,RESP INTUB/MECH VENTIL,692,Radiotherapy,17,"Lymphatic, Hematopoietic, Other Malignancies, Chemotherapy and Radiotherapy",4,Extreme,Extreme,Medical,Medicaid,Medicaid,Self-Pay,,N,N,102121.67,23972.70
New York City,Queens,7003004,001630,Long Island Jewish Medical Center,50 to 69,113,F,Other Race,Not Span/Hispanic,4,Urgent,Home or Self Care,2017,045,Maintenance chemotherapy; radiotherapy,211,THERAPEUTIC RADIOLOGY,692,Radiotherapy,17,"Lymphatic, Hematopoietic, Other Malignancies, Chemotherapy and Radiotherapy",2,Moderate,Minor,Medical,Private Health Insurance,Self-Pay,,,N,N,55875.46,14134.94
New York City,Queens,7003004,001630,Long Island Jewish Medical Center,70 or Older,117,F,White,Not Span/Hispanic,5,Urgent,Home or Self Care,2017,045,Maintenance chemotherapy; radiotherapy,000,NO PROC,692,Radiotherapy,17,"Lymphatic, Hematopoietic, Other Malignancies, Chemotherapy and Radiotherapy",2,Moderate,Moderate,Medical,Medicare,Medicare,Self-Pay,,N,N,87352.54,32861.49
Hudson Valley,Westchester,5920000,001117,Northern Westchester Hospital,50 to 69,106,F,White,Not Span/Hispanic,1,Elective,Short-term Hospital,2017,042,Secondary malignancies,007,OTHER DX NERV SYS PRCS,692,Radiotherapy,17,"Lymphatic, Hematopoietic, Other Malignancies, Chemotherapy and Radiotherapy",3,Major,Major,Medical,Private Health Insurance,,,,N,N,29285.50,13075.29
New York City,Bronx,7000006,001169,Montefiore Medical Center - Henry & Lucy Moses Div,18 to 29,107,F,Other Race,Unknown,4,Emergency,Home or Self Care,2017,047,Other and unspecified benign neoplasm,211,THERAPEUTIC RADIOLOGY,692,Radiotherapy,17,"Lymphatic, Hematopoietic, Other Malignancies, Chemotherapy and Radiotherapy",2,Moderate,Minor,Medical,Medicaid,,,,N,N,117089.13,25793.54
New York City,Manhattan,7002054,001464,New York Presbyterian Hospital - Columbia Presbyterian Center,70 or Older,111,F,White,Not Span/Hispanic,24,Urgent,Skilled Nursing Home,2017,045,Maintenance chemotherapy; radiotherapy,211,THERAPEUTIC RADIOLOGY,692,Radiotherapy,17,"Lymphatic, Hematopoietic, Other Malignancies, Chemotherapy and Radiotherapy",4,Extreme,Major,Medical,Medicare,Private Health Insurance,Self-Pay,,N,N,303983.97,78071.89
New York City,Manhattan,7002054,001464,New York Presbyterian Hospital - Columbia Presbyterian Center,50 to 69,OOS,M,Other Race,Not Span/Hispanic,3,Elective,Home or Self Care,2017,045,Maintenance chemotherapy; radiotherapy,211,THERAPEUTIC RADIOLOGY,692,Radiotherapy,17,"Lymphatic, Hematopoietic, Other Malignancies, Chemotherapy and Radiotherapy",2,Moderate,Moderate,Medical,Medicare,Self-Pay,,,N,N,43541.51,15924.10
Capital/Adirond,Albany,0101004,000005,St Peters Hospital,50 to 69,123,F,White,Not Span/Hispanic,12,Elective,Home w/ Home Health Services,2017,045,Maintenance chemotherapy; radiotherapy,000,NO PROC,692,Radiotherapy,17,"Lymphatic, Hematopoietic, Other Malignancies, Chemotherapy and Radiotherapy",3,Major,Minor,Medical,Medicare,Medicaid,,,N,N,86276.71,27801.17
New York City,Kings,7001016,001301,Kings County Hospital Center,50 to 69,112,M,Black/African American,Not Span/Hispanic,10,Elective,Skilled Nursing Home,2017,045,Maintenance chemotherapy; radiotherapy,211,THERAPEUTIC RADIOLOGY,692,Radiotherapy,17,"Lymphatic, Hematopoietic, Other Malignancies, Chemotherapy and Radiotherapy",2,Moderate,Minor,Medical,Medicaid,,,,N,N,50826.82,30550.83
New York City,Manhattan,7002017,001450,Lenox Hill Hospital,50 to 69,115,M,Other Race,Unknown,7,Elective,Skilled Nursing Home,2017,035,Cancer of brain and nervous system,211,THERAPEUTIC RADIOLOGY,692,Radiotherapy,17,"Lymphatic, Hematopoietic, Other Malignancies, Chemotherapy and Radiotherapy",2,Moderate,Minor,Medical,Blue Cross/Blue Shield,,,,N,N,140771.38,31600.11
New York City,Manhattan,7002053,001463,NYU Langone Hospitals,30 to 49,100,M,White,Not Span/Hispanic,21,Emergency,Skilled Nursing Home,2017,042,Secondary malignancies,211,THERAPEUTIC RADIOLOGY,692,Radiotherapy,17,"Lymphatic, Hematopoietic, Other Malignancies, Chemotherapy and Radiotherapy",3,Major,Major,Medical,Medicaid,,,,N,Y,401477.47,215748.16
New York City,Manhattan,7002020,001453,Memorial Sloan Kettering Memorial Hospital,0 to 17,,F,White,Not Span/Hispanic,1,Elective,Home or Self Care,2017,045,Maintenance chemotherapy; radiotherapy,211,THERAPEUTIC RADIOLOGY,692,Radiotherapy,17,"Lymphatic, Hematopoietic, Other Malignancies, Chemotherapy and Radiotherapy",1,Minor,Minor,Medical,Private Health Insurance,,,,N,N,15056.63,5689.21
Central NY,Onondaga,3301007,000635,University Hospital SUNY Health Science Center,70 or Older,134,F,White,Not Span/Hispanic,20,Emergency,Hospice - Home,2017,045,Maintenance chemotherapy; radiotherapy,211,THERAPEUTIC RADIOLOGY,692,Radiotherapy,17,"Lymphatic, Hematopoietic, Other Malignancies, Chemotherapy and Radiotherapy",2,Moderate,Moderate,Medical,Medicare,,,,N,N,171045.14,55604.73
Central NY,Onondaga,3301007,000635,University Hospital SUNY Health Science Center,70 or Older,130,M,White,Not Span/Hispanic,15,Emergency,Skilled Nursing Home,2017,045,Maintenance chemotherapy; radiotherapy,211,THERAPEUTIC RADIOLOGY,692,Radiotherapy,17,"Lymphatic, Hematopoietic, Other Malignancies, Chemotherapy and Radiotherapy",3,Major,Moderate,Medical,Medicare,Private Health Insurance,,,N,N,150978.74,48988.64
New York City,Queens,7003004,001630,Long Island Jewish Medical Center,70 or Older,114,F,Other Race,Not Span/Hispanic,23,Urgent,Hospice - Home,2017,045,Maintenance chemotherapy; radiotherapy,037,DX BRONCHOSCOPY & BIOPS,692,Radiotherapy,17,"Lymphatic, Hematopoietic, Other Malignancies, Chemotherapy and Radiotherapy",3,Major,Major,Medical,Medicare,Self-Pay,,,N,N,254930.67,57970.01
New York City,Queens,7003004,001630,Long Island Jewish Medical Center,50 to 69,110,M,White,Not Span/Hispanic,21,Urgent,Inpatient Rehabilitation Facility,2017,045,Maintenance chemotherapy; radiotherapy,000,NO PROC,692,Radiotherapy,17,"Lymphatic, Hematopoietic, Other Malignancies, Chemotherapy and Radiotherapy",3,Major,Moderate,Medical,Medicare,Private Health Insurance,Self-Pay,,N,N,237247.76,53568.14
New York City,Queens,7003004,001630,Long Island Jewish Medical Center,50 to 69,118,M,Other Race,Not Span/Hispanic,7,Urgent,Home or Self Care,2017,045,Maintenance chemotherapy; radiotherapy,000,NO PROC,692,Radiotherapy,17,"Lymphatic, Hematopoietic, Other Malignancies, Chemotherapy and Radiotherapy",2,Moderate,Minor,Medical,Medicaid,Self-Pay,,,N,N,76311.61,19034.71
Long Island,Nassau,2950001,000527,South Nassau Communities Hospital,50 to 69,115,M,Black/African American,Not Span/Hispanic,14,Urgent,Expired,2017,045,Maintenance chemotherapy; radiotherapy,216,RESP INTUB/MECH VENTIL,692,Radiotherapy,17,"Lymphatic, Hematopoietic, Other Malignancies, Chemotherapy and Radiotherapy",4,Extreme,Extreme,Medical,Private Health Insurance,,,,N,N,206018.30,53367.92
New York City,Manhattan,7002024,001456,Mount Sinai Hospital,70 or Older,100,F,White,Not Span/Hispanic,14,Emergency,Home or Self Care,2017,045,Maintenance chemotherapy; radiotherapy,159,OT DX PRCS ON MUSC/SKEL,692,Radiotherapy,17,"Lymphatic, Hematopoietic, Other Malignancies, Chemotherapy and Radiotherapy",3,Major,Major,Medical,Medicare,Self-Pay,,,N,Y,137848.37,41336.81
New York City,Manhattan,7002054,001464,New York Presbyterian Hospital - Columbia Presbyterian Center,50 to 69,107,M,White,Not Span/Hispanic,1,Elective,Home or Self Care,2017,042,Secondary malignancies,211,THERAPEUTIC RADIOLOGY,692,Radiotherapy,17,"Lymphatic, Hematopoietic, Other Malignancies, Chemotherapy and Radiotherapy",2,Moderate,Moderate,Medical,Private Health Insurance,Self-Pay,,,N,N,55376.44,24553.67
New York City,Queens,7003007,001633,Queens Hospital Center,70 or Older,114,F,Black/African American,Not Span/Hispanic,7,Emergency,Home or Self Care,2017,045,Maintenance chemotherapy; radiotherapy,211,THERAPEUTIC RADIOLOGY,692,Radiotherapy,17,"Lymphatic, Hematopoietic, Other Malignancies, Chemotherapy and Radiotherapy",1,Minor,Minor,Medical,Medicaid,,,,N,N,36083.39,19639.32
New York City,Manhattan,7002053,001463,NYU Langone Hospitals,70 or Older,100,F,White,Not Span/Hispanic,2,Emergency,Home or Self Care,2017,042,Secondary malignancies,211,THERAPEUTIC RADIOLOGY,692,Radiotherapy,17,"Lymphatic, Hematopoietic, Other Malignancies, Chemotherapy and Radiotherapy",2,Moderate,Minor,Medical,Medicare,,,,N,Y,167815.92,128877.69
New York City,Manhattan,7002053,001463,NYU Langone Hospitals,50 to 69,100,M,White,Not Span/Hispanic,2,Urgent,Home or Self Care,2017,045,Maintenance chemotherapy; radiotherapy,211,THERAPEUTIC RADIOLOGY,692,Radiotherapy,17,"Lymphatic, Hematopoietic, Other Malignancies, Chemotherapy and Radiotherapy",1,Minor,Minor,Medical,Blue Cross/Blue Shield,,,,N,N,41071.20,25677.00
New York City,Manhattan,7002001,001438,Bellevue Hospital Center,30 to 49,113,F,Other Race,Spanish/Hispanic,4,Emergency,Home or Self Care,2017,045,Maintenance chemotherapy; radiotherapy,000,NO PROC,692,Radiotherapy,17,"Lymphatic, Hematopoietic, Other Malignancies, Chemotherapy and Radiotherapy",1,Minor,Minor,Medical,Medicaid,,,,N,N,25767.84,16613.76
New York City,Manhattan,7002001,001438,Bellevue Hospital Center,30 to 49,113,M,Other Race,Spanish/Hispanic,3,Emergency,Home or Self Care,2017,045,Maintenance chemotherapy; radiotherapy,211,THERAPEUTIC RADIOLOGY,692,Radiotherapy,17,"Lymphatic, Hematopoietic, Other Malignancies, Chemotherapy and Radiotherapy",1,Minor,Minor,Medical,Medicaid,,,,N,N,18576.77,11977.34
New York City,Manhattan,7002001,001438,Bellevue Hospital Center,30 to 49,113,M,Other Race,Not Span/Hispanic,2,Emergency,Home or Self Care,2017,045,Maintenance chemotherapy; radiotherapy,211,THERAPEUTIC RADIOLOGY,692,Radiotherapy,17,"Lymphatic, Hematopoietic, Other Malignancies, Chemotherapy and Radiotherapy",1,Minor,Minor,Medical,Medicaid,,,,N,N,13547.23,8734.55
Long Island,Suffolk,5151001,000245,University Hospital,30 to 49,117,F,Other Race,Spanish/Hispanic,6,Emergency,Home or Self Care,2017,042,Secondary malignancies,211,THERAPEUTIC RADIOLOGY,692,Radiotherapy,17,"Lymphatic, Hematopoietic, Other Malignancies, Chemotherapy and Radiotherapy",3,Major,Major,Medical,Medicaid,Medicaid,Medicaid,,N,Y,191643.02,48208.33
Finger Lakes,Monroe,2701005,000413,Strong Memorial Hospital,50 to 69,146,F,Other Race,Not Span/Hispanic,1,Elective,Home or Self Care,2017,035,Cancer of brain and nervous system,211,THERAPEUTIC RADIOLOGY,692,Radiotherapy,17,"Lymphatic, Hematopoietic, Other Malignancies, Chemotherapy and Radiotherapy",2,Moderate,Minor,Medical,Private Health Insurance,Medicare,Self-Pay,,N,N,18157.79,7751.68
Finger Lakes,Ontario,3421000,000676,Clifton Springs Hospital and Clinic,50 to 69,145,M,White,Not Span/Hispanic,9,Elective,Home or Self Care,2017,045,Maintenance chemotherapy; radiotherapy,000,NO PROC,692,Radiotherapy,17,"Lymphatic, Hematopoietic, Other Malignancies, Chemotherapy and Radiotherapy",3,Major,Major,Medical,Private Health Insurance,,,,N,N,23459.40,12193.47
New York City,Manhattan,7002020,001453,Memorial Sloan Kettering Memorial Hospital,50 to 69,117,M,White,Not Span/Hispanic,6,Emergency,Home or Self Care,2017,045,Maintenance chemotherapy; radiotherapy,211,THERAPEUTIC RADIOLOGY,692,Radiotherapy,17,"Lymphatic, Hematopoietic, Other Malignancies, Chemotherapy and Radiotherapy",2,Moderate,Minor,Medical,Blue Cross/Blue Shield,,,,N,Y,60563.60,25233.57
New York City,Manhattan,7002020,001453,Memorial Sloan Kettering Memorial Hospital,70 or Older,127,F,White,Not Span/Hispanic,11,Elective,Home or Self Care,2017,045,Maintenance chemotherapy; radiotherapy,211,THERAPEUTIC RADIOLOGY,692,Radiotherapy,17,"Lymphatic, Hematopoietic, Other Malignancies, Chemotherapy and Radiotherapy",3,Major,Moderate,Medical,Medicare,Private Health Insurance,Medicare,,N,N,141011.15,51251.31
New York City,Manhattan,7002032,001469,Mount Sinai St. Luke's,70 or Older,100,M,Other Race,Unknown,19,Urgent,Skilled Nursing Home,2017,042,Secondary malignancies,211,THERAPEUTIC RADIOLOGY,692,Radiotherapy,17,"Lymphatic, Hematopoietic, Other Malignancies, Chemotherapy and Radiotherapy",3,Major,Major,Medical,Medicare,Medicare,Medicaid,,N,N,137635.29,39045.96
New York City,Queens,7003004,001630,Long Island Jewish Medical Center,30 to 49,117,F,White,Not Span/Hispanic,27,Urgent,Hospice - Medical Facility,2017,045,Maintenance chemotherapy; radiotherapy,222,BLOOD TRANSFUSION,692,Radiotherapy,17,"Lymphatic, Hematopoietic, Other Malignancies, Chemotherapy and Radiotherapy",4,Extreme,Extreme,Medical,Private Health Insurance,Self-Pay,,,N,N,314358.14,78487.43
New York City,Queens,7003004,001630,Long Island Jewish Medical Center,70 or Older,113,M,Other Race,Not Span/Hispanic,17,Urgent,Hospice - Home,2017,045,Maintenance chemotherapy; radiotherapy,211,THERAPEUTIC RADIOLOGY,692,Radiotherapy,17,"Lymphatic, Hematopoietic, Other Malignancies, Chemotherapy and Radiotherapy",3,Major,Moderate,Medical,Medicare,Private Health Insurance,Self-Pay,,N,N,209763.40,46642.72
New York City,Queens,7003004,001630,Long Island Jewish Medical Center,50 to 69,110,F,Other Race,Not Span/Hispanic,9,Urgent,Hospice - Medical Facility,2017,045,Maintenance chemotherapy; radiotherapy,000,NO PROC,692,Radiotherapy,17,"Lymphatic, Hematopoietic, Other Malignancies, Chemotherapy and Radiotherapy",4,Extreme,Major,Medical,Medicaid,Medicaid,Self-Pay,,N,N,71621.68,14718.71