Hospital Service Area,Hospital County,Operating Certificate Number,Permanent Facility Id,Facility Name,Age Group,Zip Code - 3 digits,Gender,Race,Ethnicity,Length of Stay,Type of Admission,Patient Disposition,Discharge Year,CCS Diagnosis Code,CCS Diagnosis Description,CCS Procedure Code,CCS Procedure Description,APR DRG Code,APR DRG Description,APR MDC Code,APR MDC Description,APR Severity of Illness Code,APR Severity of Illness Description,APR Risk of Mortality,APR Medical Surgical Description,Payment Typology 1,Payment Typology 2,Payment Typology 3,Birth Weight,Abortion Edit Indicator,Emergency Department Indicator,Total Charges,Total Costs
New York City,Manhattan,7002001,001438,Bellevue Hospital Center,70 or Older,100,F,Other Race,Not Span/Hispanic,2,Emergency,Home or Self Care,2017,044,Neoplasms of unspecified nature or uncertain behavior,110,OT DX PRCS URINARY TRCT,694,Lymphatic & other malignancies & neoplasms of uncertain behavior,17,"Lymphatic, Hematopoietic, Other Malignancies, Chemotherapy and Radiotherapy",2,Moderate,Moderate,Medical,Medicare,Medicare,Medicaid,,N,Y,13434.99,8662.18
New York City,Manhattan,7002001,001438,Bellevue Hospital Center,50 to 69,100,M,Black/African American,Not Span/Hispanic,11,Emergency,Home or Self Care,2017,042,Secondary malignancies,231,OTHER THERAPEUTIC PRCS,694,Lymphatic & other malignancies & neoplasms of uncertain behavior,17,"Lymphatic, Hematopoietic, Other Malignancies, Chemotherapy and Radiotherapy",4,Extreme,Extreme,Medical,Medicare,Medicaid,,,N,Y,96315.93,62099.50
New York City,Manhattan,7002001,001438,Bellevue Hospital Center,50 to 69,100,F,Black/African American,Not Span/Hispanic,6,Emergency,Home or Self Care,2017,044,Neoplasms of unspecified nature or uncertain behavior,193,DX ULTRASOUND HEART,694,Lymphatic & other malignancies & neoplasms of uncertain behavior,17,"Lymphatic, Hematopoietic, Other Malignancies, Chemotherapy and Radiotherapy",3,Major,Major,Medical,Medicare,Medicare,Medicaid,,N,Y,42778.82,27581.56
New York City,Manhattan,7002001,001438,Bellevue Hospital Center,50 to 69,113,M,Black/African American,Not Span/Hispanic,4,Emergency,Home or Self Care,2017,044,Neoplasms of unspecified nature or uncertain behavior,063,OT NON-OR THER CARDIO,694,Lymphatic & other malignancies & neoplasms of uncertain behavior,17,"Lymphatic, Hematopoietic, Other Malignancies, Chemotherapy and Radiotherapy",2,Moderate,Minor,Medical,Medicaid,,,,N,Y,22804.25,14702.99
New York City,Manhattan,7002001,001438,Bellevue Hospital Center,70 or Older,104,M,Other Race,Spanish/Hispanic,2,Emergency,Home or Self Care,2017,047,Other and unspecified benign neoplasm,070,UP GASTRO ENDOSC/BIOPSY,694,Lymphatic & other malignancies & neoplasms of uncertain behavior,17,"Lymphatic, Hematopoietic, Other Malignancies, Chemotherapy and Radiotherapy",1,Minor,Minor,Medical,Medicare,Medicare,,,N,N,13176.48,8495.51
New York City,Manhattan,7002001,001438,Bellevue Hospital Center,70 or Older,112,M,Other Race,Spanish/Hispanic,1,Emergency,Home or Self Care,2017,044,Neoplasms of unspecified nature or uncertain behavior,222,BLOOD TRANSFUSION,694,Lymphatic & other malignancies & neoplasms of uncertain behavior,17,"Lymphatic, Hematopoietic, Other Malignancies, Chemotherapy and Radiotherapy",2,Moderate,Moderate,Medical,Medicaid,Medicaid,,,N,Y,7370.16,4751.90
New York City,Manhattan,7002001,001438,Bellevue Hospital Center,50 to 69,114,F,Other Race,Not Span/Hispanic,4,Emergency,Home or Self Care,2017,043,Malignant neoplasm without specification of site,180,OTHER CT SCAN,694,Lymphatic & other malignancies & neoplasms of uncertain behavior,17,"Lymphatic, Hematopoietic, Other Malignancies, Chemotherapy and Radiotherapy",3,Major,Moderate,Medical,Private Health Insurance,,,,N,Y,24699.62,15925.03
New York City,Manhattan,7002001,001438,Bellevue Hospital Center,70 or Older,113,F,Other Race,Not Span/Hispanic,3,Emergency,Home or Self Care,2017,044,Neoplasms of unspecified nature or uncertain behavior,222,BLOOD TRANSFUSION,694,Lymphatic & other malignancies & neoplasms of uncertain behavior,17,"Lymphatic, Hematopoietic, Other Malignancies, Chemotherapy and Radiotherapy",2,Moderate,Moderate,Medical,Medicaid,,,,N,Y,18717.69,12068.19
New York City,Manhattan,7002001,001438,Bellevue Hospital Center,30 to 49,113,M,Other Race,Not Span/Hispanic,3,Emergency,Home or Self Care,2017,042,Secondary malignancies,211,THERAPEUTIC RADIOLOGY,694,Lymphatic & other malignancies & neoplasms of uncertain behavior,17,"Lymphatic, Hematopoietic, Other Malignancies, Chemotherapy and Radiotherapy",3,Major,Moderate,Medical,Self-Pay,,,,N,Y,26639.22,17175.58
New York City,Manhattan,7002001,001438,Bellevue Hospital Center,50 to 69,100,F,Black/African American,Not Span/Hispanic,8,Emergency,Skilled Nursing Home,2017,044,Neoplasms of unspecified nature or uncertain behavior,202,ELECTROCARDIOGRAM,694,Lymphatic & other malignancies & neoplasms of uncertain behavior,17,"Lymphatic, Hematopoietic, Other Malignancies, Chemotherapy and Radiotherapy",2,Moderate,Minor,Medical,Medicaid,,,,N,Y,41953.36,27049.34
New York City,Manhattan,7002001,001438,Bellevue Hospital Center,70 or Older,104,M,White,Not Span/Hispanic,3,Emergency,Home or Self Care,2017,044,Neoplasms of unspecified nature or uncertain behavior,065,BONE MARROW BIOPSY,694,Lymphatic & other malignancies & neoplasms of uncertain behavior,17,"Lymphatic, Hematopoietic, Other Malignancies, Chemotherapy and Radiotherapy",2,Moderate,Major,Medical,Medicare,Medicaid,,,N,Y,22594.38,14567.68
New York City,Manhattan,7002001,001438,Bellevue Hospital Center,30 to 49,112,F,Other Race,Not Span/Hispanic,3,Emergency,Home or Self Care,2017,042,Secondary malignancies,224,CANCER CHEMOTHERAPY,694,Lymphatic & other malignancies & neoplasms of uncertain behavior,17,"Lymphatic, Hematopoietic, Other Malignancies, Chemotherapy and Radiotherapy",1,Minor,Moderate,Medical,Self-Pay,,,,N,Y,19120.17,12327.69
New York City,Manhattan,7002001,001438,Bellevue Hospital Center,50 to 69,100,F,Other Race,Not Span/Hispanic,17,Emergency,Hospice - Home,2017,042,Secondary malignancies,222,BLOOD TRANSFUSION,694,Lymphatic & other malignancies & neoplasms of uncertain behavior,17,"Lymphatic, Hematopoietic, Other Malignancies, Chemotherapy and Radiotherapy",3,Major,Major,Medical,Self-Pay,,,,N,Y,111295.12,71757.31
New York City,Manhattan,7002001,001438,Bellevue Hospital Center,30 to 49,104,M,Other Race,Spanish/Hispanic,8,Emergency,Home or Self Care,2017,043,Malignant neoplasm without specification of site,173,OT DX PRC SKIN/SUBCUTAN,694,Lymphatic & other malignancies & neoplasms of uncertain behavior,17,"Lymphatic, Hematopoietic, Other Malignancies, Chemotherapy and Radiotherapy",3,Major,Moderate,Medical,Medicaid,,,,N,Y,55541.82,35810.48
New York City,Manhattan,7002001,001438,Bellevue Hospital Center,18 to 29,112,M,Other Race,Spanish/Hispanic,5,Emergency,Home or Self Care,2017,044,Neoplasms of unspecified nature or uncertain behavior,040,OT DX PRCS OF RESP TRCT,694,Lymphatic & other malignancies & neoplasms of uncertain behavior,17,"Lymphatic, Hematopoietic, Other Malignancies, Chemotherapy and Radiotherapy",3,Major,Moderate,Medical,Medicaid,,,,N,Y,39139.52,25235.13
New York City,Manhattan,7002001,001438,Bellevue Hospital Center,18 to 29,100,M,Other Race,Not Span/Hispanic,3,Emergency,Home or Self Care,2017,044,Neoplasms of unspecified nature or uncertain behavior,179,CT SCAN ABDOMEN,694,Lymphatic & other malignancies & neoplasms of uncertain behavior,17,"Lymphatic, Hematopoietic, Other Malignancies, Chemotherapy and Radiotherapy",3,Major,Moderate,Medical,Medicaid,Medicaid,,,N,Y,21515.87,13872.31
New York City,Manhattan,7002001,001438,Bellevue Hospital Center,50 to 69,112,M,Black/African American,Not Span/Hispanic,2,Emergency,Left Against Medical Advice,2017,042,Secondary malignancies,000,NO PROC,694,Lymphatic & other malignancies & neoplasms of uncertain behavior,17,"Lymphatic, Hematopoietic, Other Malignancies, Chemotherapy and Radiotherapy",2,Moderate,Moderate,Medical,Medicaid,Medicaid,,,N,Y,15513.63,10002.38
New York City,Manhattan,7002001,001438,Bellevue Hospital Center,70 or Older,113,M,Other Race,Not Span/Hispanic,10,Emergency,Home or Self Care,2017,044,Neoplasms of unspecified nature or uncertain behavior,076,COLONOSCOPY AND BIOPSY,694,Lymphatic & other malignancies & neoplasms of uncertain behavior,17,"Lymphatic, Hematopoietic, Other Malignancies, Chemotherapy and Radiotherapy",3,Major,Major,Medical,Medicaid,,,,N,Y,67721.35,43663.20
New York City,Manhattan,7002001,001438,Bellevue Hospital Center,50 to 69,104,M,Other Race,Spanish/Hispanic,6,Emergency,Home or Self Care,2017,044,Neoplasms of unspecified nature or uncertain behavior,222,BLOOD TRANSFUSION,694,Lymphatic & other malignancies & neoplasms of uncertain behavior,17,"Lymphatic, Hematopoietic, Other Malignancies, Chemotherapy and Radiotherapy",3,Major,Major,Medical,Self-Pay,,,,N,Y,33965.87,21899.43
New York City,Manhattan,7002001,001438,Bellevue Hospital Center,0 to 17,104,M,Other Race,Spanish/Hispanic,23,Emergency,Home or Self Care,2017,044,Neoplasms of unspecified nature or uncertain behavior,041,OT NON-OR THER PRC RESP,694,Lymphatic & other malignancies & neoplasms of uncertain behavior,17,"Lymphatic, Hematopoietic, Other Malignancies, Chemotherapy and Radiotherapy",3,Major,Extreme,Medical,Medicaid,Medicaid,,02900,N,N,89693.76,57829.87
New York City,Manhattan,7002001,001438,Bellevue Hospital Center,50 to 69,114,F,Black/African American,Not Span/Hispanic,22,Emergency,Expired,2017,042,Secondary malignancies,039,INCISION OF PLEURA,694,Lymphatic & other malignancies & neoplasms of uncertain behavior,17,"Lymphatic, Hematopoietic, Other Malignancies, Chemotherapy and Radiotherapy",4,Extreme,Extreme,Medical,Medicaid,,,,N,Y,122796.18,79172.59
New York City,Manhattan,7002001,001438,Bellevue Hospital Center,50 to 69,112,F,White,Not Span/Hispanic,5,Emergency,Home or Self Care,2017,043,Malignant neoplasm without specification of site,083,BIOPSY OF LIVER,694,Lymphatic & other malignancies & neoplasms of uncertain behavior,17,"Lymphatic, Hematopoietic, Other Malignancies, Chemotherapy and Radiotherapy",3,Major,Major,Medical,Medicaid,,,,N,Y,32974.36,21260.15
New York City,Manhattan,7002001,001438,Bellevue Hospital Center,50 to 69,113,M,Black/African American,Not Span/Hispanic,4,Emergency,Home or Self Care,2017,044,Neoplasms of unspecified nature or uncertain behavior,000,NO PROC,694,Lymphatic & other malignancies & neoplasms of uncertain behavior,17,"Lymphatic, Hematopoietic, Other Malignancies, Chemotherapy and Radiotherapy",1,Minor,Minor,Medical,Medicaid,,,,N,N,22820.40,14713.41
New York City,Manhattan,7002001,001438,Bellevue Hospital Center,50 to 69,104,M,Other Race,Spanish/Hispanic,5,Emergency,Home w/ Home Health Services,2017,043,Malignant neoplasm without specification of site,098,OT NON-OR GI THER PRCS,694,Lymphatic & other malignancies & neoplasms of uncertain behavior,17,"Lymphatic, Hematopoietic, Other Malignancies, Chemotherapy and Radiotherapy",1,Minor,Minor,Medical,Medicaid,Medicaid,,,N,N,29991.18,19336.75
