Hospital Service Area,Hospital County,Operating Certificate Number,Permanent Facility Id,Facility Name,Age Group,Zip Code - 3 digits,Gender,Race,Ethnicity,Length of Stay,Type of Admission,Patient Disposition,Discharge Year,CCS Diagnosis Code,CCS Diagnosis Description,CCS Procedure Code,CCS Procedure Description,APR DRG Code,APR DRG Description,APR MDC Code,APR MDC Description,APR Severity of Illness Code,APR Severity of Illness Description,APR Risk of Mortality,APR Medical Surgical Description,Payment Typology 1,Payment Typology 2,Payment Typology 3,Birth Weight,Abortion Edit Indicator,Emergency Department Indicator,Total Charges,Total Costs
New York City,Kings,7002053,001304,NYU Langone Hospital-Brooklyn,70 or Older,112,F,Black/African American,Not Span/Hispanic,8,Emergency,Home w/ Home Health Services,2020,NEO068,MYELODYSPLASTIC SYNDROME (MDS),ADM001,TRANSFUSION OF BLOOD AND BLOOD PRODUCTS,694,LYMPHATIC & OTHER MALIGNANCIES & NEOPLASMS OF UNCERTAIN BEHAVIOR,17,"MYELOPROLIFERATIVE DISEASES AND DISORDERS, AND POORLY DIFFERENTIATED NEOPLASM",2,Moderate,Major,Medical,Medicare,,,,,Y,124252.75,29338.34
New York City,Kings,7002053,001304,NYU Langone Hospital-Brooklyn,70 or Older,112,F,White,Not Span/Hispanic,2,Emergency,Home w/ Home Health Services,2020,NEO064,LEUKEMIA - ALL OTHER TYPES,ADM001,TRANSFUSION OF BLOOD AND BLOOD PRODUCTS,694,LYMPHATIC & OTHER MALIGNANCIES & NEOPLASMS OF UNCERTAIN BEHAVIOR,17,"MYELOPROLIFERATIVE DISEASES AND DISORDERS, AND POORLY DIFFERENTIATED NEOPLASM",3,Major,Major,Medical,Medicare,Blue Cross/Blue Shield,,,,Y,29622.93,8200.57
New York City,Kings,7002053,001304,NYU Langone Hospital-Brooklyn,70 or Older,112,M,White,Not Span/Hispanic,29,Emergency,Skilled Nursing Home,2020,NEO066,MALIGNANT NEUROENDOCRINE TUMORS,RAD001,BEAM RADIATION,694,LYMPHATIC & OTHER MALIGNANCIES & NEOPLASMS OF UNCERTAIN BEHAVIOR,17,"MYELOPROLIFERATIVE DISEASES AND DISORDERS, AND POORLY DIFFERENTIATED NEOPLASM",3,Major,Major,Medical,Medicare,,,,,Y,352293.92,118746.28
New York City,Kings,7002053,001304,NYU Langone Hospital-Brooklyn,70 or Older,112,M,White,Not Span/Hispanic,1,Emergency,Home or Self Care,2020,NEO068,MYELODYSPLASTIC SYNDROME (MDS),ADM001,TRANSFUSION OF BLOOD AND BLOOD PRODUCTS,694,LYMPHATIC & OTHER MALIGNANCIES & NEOPLASMS OF UNCERTAIN BEHAVIOR,17,"MYELOPROLIFERATIVE DISEASES AND DISORDERS, AND POORLY DIFFERENTIATED NEOPLASM",2,Moderate,Minor,Medical,Medicare,,,,,Y,40180.3,9380.87
New York City,Kings,7002053,001304,NYU Langone Hospital-Brooklyn,70 or Older,112,M,Other Race,Not Span/Hispanic,5,Emergency,Home or Self Care,2020,NEO068,MYELODYSPLASTIC SYNDROME (MDS),ADM001,TRANSFUSION OF BLOOD AND BLOOD PRODUCTS,694,LYMPHATIC & OTHER MALIGNANCIES & NEOPLASMS OF UNCERTAIN BEHAVIOR,17,"MYELOPROLIFERATIVE DISEASES AND DISORDERS, AND POORLY DIFFERENTIATED NEOPLASM",3,Major,Major,Medical,Medicare,Medicaid,,,,Y,131999.93,32624.7
New York City,Kings,7002053,001304,NYU Langone Hospital-Brooklyn,70 or Older,112,F,Black/African American,Not Span/Hispanic,3,Emergency,Home w/ Home Health Services,2020,NEO068,MYELODYSPLASTIC SYNDROME (MDS),ADM001,TRANSFUSION OF BLOOD AND BLOOD PRODUCTS,694,LYMPHATIC & OTHER MALIGNANCIES & NEOPLASMS OF UNCERTAIN BEHAVIOR,17,"MYELOPROLIFERATIVE DISEASES AND DISORDERS, AND POORLY DIFFERENTIATED NEOPLASM",3,Major,Major,Medical,Medicare,,,,,Y,51093.05,11909.28
New York City,Kings,7002053,001304,NYU Langone Hospital-Brooklyn,70 or Older,112,M,Other Race,Spanish/Hispanic,4,Emergency,Hospice - Home,2020,NEO068,MYELODYSPLASTIC SYNDROME (MDS),ADM001,TRANSFUSION OF BLOOD AND BLOOD PRODUCTS,694,LYMPHATIC & OTHER MALIGNANCIES & NEOPLASMS OF UNCERTAIN BEHAVIOR,17,"MYELOPROLIFERATIVE DISEASES AND DISORDERS, AND POORLY DIFFERENTIATED NEOPLASM",3,Major,Major,Medical,Medicare,Medicaid,,,,Y,59387.34,17421.7
New York City,Kings,7002053,001304,NYU Langone Hospital-Brooklyn,70 or Older,112,F,Black/African American,Not Span/Hispanic,2,Emergency,Home w/ Home Health Services,2020,NEO068,MYELODYSPLASTIC SYNDROME (MDS),ADM001,TRANSFUSION OF BLOOD AND BLOOD PRODUCTS,694,LYMPHATIC & OTHER MALIGNANCIES & NEOPLASMS OF UNCERTAIN BEHAVIOR,17,"MYELOPROLIFERATIVE DISEASES AND DISORDERS, AND POORLY DIFFERENTIATED NEOPLASM",3,Major,Major,Medical,Medicare,,,,,Y,57389.9,13308.32
New York City,Kings,7002053,001304,NYU Langone Hospital-Brooklyn,70 or Older,112,M,White,Not Span/Hispanic,2,Emergency,Home or Self Care,2020,NEO068,MYELODYSPLASTIC SYNDROME (MDS),ADM001,TRANSFUSION OF BLOOD AND BLOOD PRODUCTS,694,LYMPHATIC & OTHER MALIGNANCIES & NEOPLASMS OF UNCERTAIN BEHAVIOR,17,"MYELOPROLIFERATIVE DISEASES AND DISORDERS, AND POORLY DIFFERENTIATED NEOPLASM",3,Major,Moderate,Medical,Medicare,Medicare,,,,Y,51313.65,9810.86
New York City,Kings,7002053,001304,NYU Langone Hospital-Brooklyn,70 or Older,112,F,Other Race,Not Span/Hispanic,4,Emergency,Hospice - Home,2020,NEO070,SECONDARY MALIGNANCIES,,,694,LYMPHATIC & OTHER MALIGNANCIES & NEOPLASMS OF UNCERTAIN BEHAVIOR,17,"MYELOPROLIFERATIVE DISEASES AND DISORDERS, AND POORLY DIFFERENTIATED NEOPLASM",3,Major,Major,Medical,Medicare,Medicaid,,,,Y,62624.49,20676.01
New York City,Kings,7002053,001304,NYU Langone Hospital-Brooklyn,70 or Older,112,M,White,Not Span/Hispanic,2,Emergency,Home or Self Care,2020,NEO068,MYELODYSPLASTIC SYNDROME (MDS),ADM001,TRANSFUSION OF BLOOD AND BLOOD PRODUCTS,694,LYMPHATIC & OTHER MALIGNANCIES & NEOPLASMS OF UNCERTAIN BEHAVIOR,17,"MYELOPROLIFERATIVE DISEASES AND DISORDERS, AND POORLY DIFFERENTIATED NEOPLASM",3,Major,Moderate,Medical,Medicare,,,,,Y,38338.44,11128.26
New York City,Kings,7002053,001304,NYU Langone Hospital-Brooklyn,50 to 69,112,M,White,Not Span/Hispanic,5,Emergency,Left Against Medical Advice,2020,NEO068,MYELODYSPLASTIC SYNDROME (MDS),OTR004,ISOLATION PROCEDURES,694,LYMPHATIC & OTHER MALIGNANCIES & NEOPLASMS OF UNCERTAIN BEHAVIOR,17,"MYELOPROLIFERATIVE DISEASES AND DISORDERS, AND POORLY DIFFERENTIATED NEOPLASM",3,Major,Major,Medical,Medicare,,,,,Y,160886.22,33674.27
New York City,Kings,7002053,001304,NYU Langone Hospital-Brooklyn,70 or Older,112,M,White,Not Span/Hispanic,6,Emergency,Home or Self Care,2020,NEO071,"MALIGNANT NEOPLASM, UNSPECIFIED",RES005,CHEST TUBE PLACEMENT AND THERAPEUTIC THORACENTESIS,694,LYMPHATIC & OTHER MALIGNANCIES & NEOPLASMS OF UNCERTAIN BEHAVIOR,17,"MYELOPROLIFERATIVE DISEASES AND DISORDERS, AND POORLY DIFFERENTIATED NEOPLASM",2,Moderate,Major,Medical,Medicare,,,,,Y,133193.48,33242.5
New York City,Kings,7002053,001304,NYU Langone Hospital-Brooklyn,70 or Older,112,M,Other Race,Spanish/Hispanic,2,Emergency,Home or Self Care,2020,NEO068,MYELODYSPLASTIC SYNDROME (MDS),ADM001,TRANSFUSION OF BLOOD AND BLOOD PRODUCTS,694,LYMPHATIC & OTHER MALIGNANCIES & NEOPLASMS OF UNCERTAIN BEHAVIOR,17,"MYELOPROLIFERATIVE DISEASES AND DISORDERS, AND POORLY DIFFERENTIATED NEOPLASM",1,Minor,Moderate,Medical,Medicare,,,,,Y,41599.32,11413.95
New York City,Kings,7002053,001304,NYU Langone Hospital-Brooklyn,70 or Older,112,M,White,Not Span/Hispanic,5,Emergency,Skilled Nursing Home,2020,NEO073,BENIGN NEOPLASMS,HEP003,DIAGNOSTIC ERCP WITH OR WITHOUT BIOPSY,694,LYMPHATIC & OTHER MALIGNANCIES & NEOPLASMS OF UNCERTAIN BEHAVIOR,17,"MYELOPROLIFERATIVE DISEASES AND DISORDERS, AND POORLY DIFFERENTIATED NEOPLASM",2,Moderate,Minor,Medical,Medicare,Medicare,,,,Y,134783.51,35807.6
New York City,Kings,7002053,001304,NYU Langone Hospital-Brooklyn,70 or Older,112,M,White,Not Span/Hispanic,3,Emergency,Home w/ Home Health Services,2020,NEO064,LEUKEMIA - ALL OTHER TYPES,ADM001,TRANSFUSION OF BLOOD AND BLOOD PRODUCTS,694,LYMPHATIC & OTHER MALIGNANCIES & NEOPLASMS OF UNCERTAIN BEHAVIOR,17,"MYELOPROLIFERATIVE DISEASES AND DISORDERS, AND POORLY DIFFERENTIATED NEOPLASM",3,Major,Major,Medical,Medicare,Private Health Insurance,,,,Y,59693.51,17040.65
New York City,Kings,7002053,001304,NYU Langone Hospital-Brooklyn,70 or Older,112,M,Black/African American,Not Span/Hispanic,2,Emergency,Home or Self Care,2020,NEO070,SECONDARY MALIGNANCIES,ADM021,"ADMINISTRATION OF THERAPEUTIC SUBSTANCES, NEC",694,LYMPHATIC & OTHER MALIGNANCIES & NEOPLASMS OF UNCERTAIN BEHAVIOR,17,"MYELOPROLIFERATIVE DISEASES AND DISORDERS, AND POORLY DIFFERENTIATED NEOPLASM",2,Moderate,Major,Medical,Medicare,,,,,Y,37445.74,11459.22
New York City,Kings,7002053,001304,NYU Langone Hospital-Brooklyn,70 or Older,112,F,Other Race,Spanish/Hispanic,10,Emergency,Expired,2020,BLD008,IMMUNITY DISORDERS,LYM007,BONE MARROW BIOPSY,694,LYMPHATIC & OTHER MALIGNANCIES & NEOPLASMS OF UNCERTAIN BEHAVIOR,17,"MYELOPROLIFERATIVE DISEASES AND DISORDERS, AND POORLY DIFFERENTIATED NEOPLASM",3,Major,Extreme,Medical,Medicare,,,,,Y,227582.07,55773.05
New York City,Kings,7002053,001304,NYU Langone Hospital-Brooklyn,50 to 69,112,F,Other Race,Spanish/Hispanic,3,Emergency,Home or Self Care,2020,NEO070,SECONDARY MALIGNANCIES,IMG006,COMPUTERIZED TOMOGRAPHY (CT) WITH CONTRAST,694,LYMPHATIC & OTHER MALIGNANCIES & NEOPLASMS OF UNCERTAIN BEHAVIOR,17,"MYELOPROLIFERATIVE DISEASES AND DISORDERS, AND POORLY DIFFERENTIATED NEOPLASM",1,Minor,Moderate,Medical,Medicare,Medicaid,,,,Y,40830.63,10719.99
New York City,Kings,7002053,001304,NYU Langone Hospital-Brooklyn,70 or Older,112,F,White,Not Span/Hispanic,3,Emergency,Home w/ Home Health Services,2020,NEO068,MYELODYSPLASTIC SYNDROME (MDS),ADM001,TRANSFUSION OF BLOOD AND BLOOD PRODUCTS,694,LYMPHATIC & OTHER MALIGNANCIES & NEOPLASMS OF UNCERTAIN BEHAVIOR,17,"MYELOPROLIFERATIVE DISEASES AND DISORDERS, AND POORLY DIFFERENTIATED NEOPLASM",4,Extreme,Extreme,Medical,Medicare,,,,,Y,58474.87,16117.75
New York City,Kings,7002053,001304,NYU Langone Hospital-Brooklyn,70 or Older,112,F,White,Not Span/Hispanic,3,Emergency,Home or Self Care,2020,NEO068,MYELODYSPLASTIC SYNDROME (MDS),ADM001,TRANSFUSION OF BLOOD AND BLOOD PRODUCTS,694,LYMPHATIC & OTHER MALIGNANCIES & NEOPLASMS OF UNCERTAIN BEHAVIOR,17,"MYELOPROLIFERATIVE DISEASES AND DISORDERS, AND POORLY DIFFERENTIATED NEOPLASM",3,Major,Major,Medical,Medicare,Blue Cross/Blue Shield,,,,Y,50832.42,15857.42
New York City,Kings,7002053,001304,NYU Langone Hospital-Brooklyn,70 or Older,112,F,White,Not Span/Hispanic,16,Emergency,Home w/ Home Health Services,2020,NEO068,MYELODYSPLASTIC SYNDROME (MDS),MST020,SUBCUTANEOUS TISSUE AND FASCIA EXCISION,694,LYMPHATIC & OTHER MALIGNANCIES & NEOPLASMS OF UNCERTAIN BEHAVIOR,17,"MYELOPROLIFERATIVE DISEASES AND DISORDERS, AND POORLY DIFFERENTIATED NEOPLASM",4,Extreme,Extreme,Medical,Medicare,,,,,Y,326950.13,86837.77
New York City,Kings,7002053,001304,NYU Langone Hospital-Brooklyn,70 or Older,112,F,White,Not Span/Hispanic,10,Emergency,Hospice - Home,2020,NEO066,MALIGNANT NEUROENDOCRINE TUMORS,ADM015,ADMINISTRATION OF ANTIBIOTICS,694,LYMPHATIC & OTHER MALIGNANCIES & NEOPLASMS OF UNCERTAIN BEHAVIOR,17,"MYELOPROLIFERATIVE DISEASES AND DISORDERS, AND POORLY DIFFERENTIATED NEOPLASM",3,Major,Major,Medical,Medicare,Blue Cross/Blue Shield,,,,Y,150882.96,50996.24
