Hospital Service Area,Hospital County,Operating Certificate Number,Permanent Facility Id,Facility Name,Age Group,Zip Code - 3 digits,Gender,Race,Ethnicity,Length of Stay,Type of Admission,Patient Disposition,Discharge Year,CCS Diagnosis Code,CCS Diagnosis Description,CCS Procedure Code,CCS Procedure Description,APR DRG Code,APR DRG Description,APR MDC Code,APR MDC Description,APR Severity of Illness Code,APR Severity of Illness Description,APR Risk of Mortality,APR Medical Surgical Description,Payment Typology 1,Payment Typology 2,Payment Typology 3,Birth Weight,Abortion Edit Indicator,Emergency Department Indicator,Total Charges,Total Costs
New York City,Manhattan,7002001,001438,Bellevue Hospital Center,30 to 49,114,M,Black/African American,Not Span/Hispanic,45,Urgent,Expired,2020,NEO066,MALIGNANT NEUROENDOCRINE TUMORS,HEP010,HEPATOBILIARY AND PANCREATIC DRAINAGE,694,LYMPHATIC & OTHER MALIGNANCIES & NEOPLASMS OF UNCERTAIN BEHAVIOR,17,"MYELOPROLIFERATIVE DISEASES AND DISORDERS, AND POORLY DIFFERENTIATED NEOPLASM",4,Extreme,Extreme,Medical,Medicaid,,,,,N,404954.82,232883.04
New York City,Manhattan,7002001,001438,Bellevue Hospital Center,50 to 69,112,M,White,Not Span/Hispanic,5,Emergency,Home or Self Care,2020,NEO070,SECONDARY MALIGNANCIES,LYM001,LYMPH NODE BIOPSY,694,LYMPHATIC & OTHER MALIGNANCIES & NEOPLASMS OF UNCERTAIN BEHAVIOR,17,"MYELOPROLIFERATIVE DISEASES AND DISORDERS, AND POORLY DIFFERENTIATED NEOPLASM",2,Moderate,Moderate,Medical,Medicaid,,,,,Y,68185.84,39212.59
New York City,Manhattan,7002001,001438,Bellevue Hospital Center,50 to 69,100,M,Black/African American,Not Span/Hispanic,2,Urgent,Home or Self Care,2020,NEO070,SECONDARY MALIGNANCIES,ADM017,ADMINISTRATION OF NUTRITIONAL AND ELECTROLYTIC SUBSTANCES,694,LYMPHATIC & OTHER MALIGNANCIES & NEOPLASMS OF UNCERTAIN BEHAVIOR,17,"MYELOPROLIFERATIVE DISEASES AND DISORDERS, AND POORLY DIFFERENTIATED NEOPLASM",2,Moderate,Moderate,Medical,Medicare,,,,,N,18917.54,10879.17
New York City,Manhattan,7002001,001438,Bellevue Hospital Center,30 to 49,100,M,Other Race,Spanish/Hispanic,1,Emergency,Home or Self Care,2020,NEO064,LEUKEMIA - ALL OTHER TYPES,ADM015,ADMINISTRATION OF ANTIBIOTICS,694,LYMPHATIC & OTHER MALIGNANCIES & NEOPLASMS OF UNCERTAIN BEHAVIOR,17,"MYELOPROLIFERATIVE DISEASES AND DISORDERS, AND POORLY DIFFERENTIATED NEOPLASM",3,Major,Major,Medical,Medicaid,,,,,Y,8248.1,4743.35
New York City,Manhattan,7002001,001438,Bellevue Hospital Center,30 to 49,113,F,Other Race,Spanish/Hispanic,1,Emergency,Home or Self Care,2020,NEO068,MYELODYSPLASTIC SYNDROME (MDS),ADM001,TRANSFUSION OF BLOOD AND BLOOD PRODUCTS,694,LYMPHATIC & OTHER MALIGNANCIES & NEOPLASMS OF UNCERTAIN BEHAVIOR,17,"MYELOPROLIFERATIVE DISEASES AND DISORDERS, AND POORLY DIFFERENTIATED NEOPLASM",3,Major,Major,Medical,Private Health Insurance,,,,,Y,13094.35,7530.35
New York City,Manhattan,7002001,001438,Bellevue Hospital Center,50 to 69,112,M,Other Race,Unknown,8,Urgent,Home or Self Care,2020,NEO073,BENIGN NEOPLASMS,HEP001,LIVER BIOPSY,694,LYMPHATIC & OTHER MALIGNANCIES & NEOPLASMS OF UNCERTAIN BEHAVIOR,17,"MYELOPROLIFERATIVE DISEASES AND DISORDERS, AND POORLY DIFFERENTIATED NEOPLASM",2,Moderate,Major,Medical,Medicare,Medicaid,,,,N,57283.36,32942.74
New York City,Manhattan,7002001,001438,Bellevue Hospital Center,70 or Older,112,M,Other Race,Spanish/Hispanic,2,Emergency,Home or Self Care,2020,NEO068,MYELODYSPLASTIC SYNDROME (MDS),IMG008,ULTRASONOGRAPHY,694,LYMPHATIC & OTHER MALIGNANCIES & NEOPLASMS OF UNCERTAIN BEHAVIOR,17,"MYELOPROLIFERATIVE DISEASES AND DISORDERS, AND POORLY DIFFERENTIATED NEOPLASM",2,Moderate,Moderate,Medical,Medicare,Medicaid,,,,Y,22476.52,12925.89
New York City,Manhattan,7002001,001438,Bellevue Hospital Center,70 or Older,111,M,Other Race,Spanish/Hispanic,10,Emergency,Home or Self Care,2020,NEO067,MESOTHELIOMA,MST003,"SUBCUTANEOUS TISSUE, FASCIA, AND MUSCLE BIOPSY",694,LYMPHATIC & OTHER MALIGNANCIES & NEOPLASMS OF UNCERTAIN BEHAVIOR,17,"MYELOPROLIFERATIVE DISEASES AND DISORDERS, AND POORLY DIFFERENTIATED NEOPLASM",2,Moderate,Moderate,Medical,Medicaid,,,,,Y,86168.9,49554.36
New York City,Manhattan,7002001,001438,Bellevue Hospital Center,50 to 69,104,M,Black/African American,Not Span/Hispanic,6,Emergency,Home or Self Care,2020,NEO070,SECONDARY MALIGNANCIES,CAR024,VENOUS AND ARTERIAL CATHETER PLACEMENT,694,LYMPHATIC & OTHER MALIGNANCIES & NEOPLASMS OF UNCERTAIN BEHAVIOR,17,"MYELOPROLIFERATIVE DISEASES AND DISORDERS, AND POORLY DIFFERENTIATED NEOPLASM",3,Major,Major,Medical,Private Health Insurance,Medicaid,,,,Y,50502.77,29043.33
New York City,Manhattan,7002001,001438,Bellevue Hospital Center,30 to 49,113,F,Other Race,Spanish/Hispanic,1,Emergency,Home or Self Care,2020,NEO021,GASTROINTESTINAL CANCERS - ALL OTHER TYPES,IMG006,COMPUTERIZED TOMOGRAPHY (CT) WITH CONTRAST,694,LYMPHATIC & OTHER MALIGNANCIES & NEOPLASMS OF UNCERTAIN BEHAVIOR,17,"MYELOPROLIFERATIVE DISEASES AND DISORDERS, AND POORLY DIFFERENTIATED NEOPLASM",2,Moderate,Minor,Medical,Medicaid,,,,,Y,10990.71,6320.58
New York City,Manhattan,7002001,001438,Bellevue Hospital Center,70 or Older,112,M,Other Race,Spanish/Hispanic,3,Emergency,Home or Self Care,2020,NEO068,MYELODYSPLASTIC SYNDROME (MDS),ADM007,INTRAVENOUS INDUCTION OF LABOR,694,LYMPHATIC & OTHER MALIGNANCIES & NEOPLASMS OF UNCERTAIN BEHAVIOR,17,"MYELOPROLIFERATIVE DISEASES AND DISORDERS, AND POORLY DIFFERENTIATED NEOPLASM",3,Major,Major,Medical,Medicare,Medicaid,,,,Y,29338.48,16872.09
New York City,Manhattan,7002001,001438,Bellevue Hospital Center,70 or Older,112,M,Other Race,Spanish/Hispanic,1,Emergency,Home or Self Care,2020,NEO068,MYELODYSPLASTIC SYNDROME (MDS),ADM001,TRANSFUSION OF BLOOD AND BLOOD PRODUCTS,694,LYMPHATIC & OTHER MALIGNANCIES & NEOPLASMS OF UNCERTAIN BEHAVIOR,17,"MYELOPROLIFERATIVE DISEASES AND DISORDERS, AND POORLY DIFFERENTIATED NEOPLASM",2,Moderate,Moderate,Medical,Medicare,Medicaid,,,,Y,12770.81,7344.29
New York City,Manhattan,7002001,001438,Bellevue Hospital Center,70 or Older,112,M,Other Race,Not Span/Hispanic,1,Emergency,Home or Self Care,2020,NEO072,NEOPLASMS OF UNSPECIFIED NATURE OR UNCERTAIN BEHAVIOR,ADM001,TRANSFUSION OF BLOOD AND BLOOD PRODUCTS,694,LYMPHATIC & OTHER MALIGNANCIES & NEOPLASMS OF UNCERTAIN BEHAVIOR,17,"MYELOPROLIFERATIVE DISEASES AND DISORDERS, AND POORLY DIFFERENTIATED NEOPLASM",2,Moderate,Minor,Medical,Medicare,Medicaid,,,,Y,15721.7,9041.3
New York City,Manhattan,7002001,001438,Bellevue Hospital Center,30 to 49,113,M,Other Race,Spanish/Hispanic,15,Emergency,Expired,2020,NEO070,SECONDARY MALIGNANCIES,MAM007,ELECTROCARDIOGRAM (ECG),694,LYMPHATIC & OTHER MALIGNANCIES & NEOPLASMS OF UNCERTAIN BEHAVIOR,17,"MYELOPROLIFERATIVE DISEASES AND DISORDERS, AND POORLY DIFFERENTIATED NEOPLASM",3,Major,Major,Medical,Medicaid,,,,,Y,100595.45,57850.83
New York City,Manhattan,7002001,001438,Bellevue Hospital Center,70 or Older,112,M,Other Race,Spanish/Hispanic,1,Emergency,Home or Self Care,2020,NEO068,MYELODYSPLASTIC SYNDROME (MDS),ADM001,TRANSFUSION OF BLOOD AND BLOOD PRODUCTS,694,LYMPHATIC & OTHER MALIGNANCIES & NEOPLASMS OF UNCERTAIN BEHAVIOR,17,"MYELOPROLIFERATIVE DISEASES AND DISORDERS, AND POORLY DIFFERENTIATED NEOPLASM",2,Moderate,Moderate,Medical,Medicaid,,,,,Y,17274.2,9934.12
New York City,Manhattan,7002001,001438,Bellevue Hospital Center,50 to 69,112,F,White,Not Span/Hispanic,4,Emergency,Home or Self Care,2020,NEO071,"MALIGNANT NEOPLASM, UNSPECIFIED",ADM021,"ADMINISTRATION OF THERAPEUTIC SUBSTANCES, NEC",694,LYMPHATIC & OTHER MALIGNANCIES & NEOPLASMS OF UNCERTAIN BEHAVIOR,17,"MYELOPROLIFERATIVE DISEASES AND DISORDERS, AND POORLY DIFFERENTIATED NEOPLASM",3,Major,Moderate,Medical,Self-Pay,,,,,Y,40507.87,23295.43
New York City,Manhattan,7002001,001438,Bellevue Hospital Center,30 to 49,105,F,Other Race,Unknown,5,Emergency,Home or Self Care,2020,NEO070,SECONDARY MALIGNANCIES,GNR009,"RETROPERITONEAL PROCEDURES, NEC",694,LYMPHATIC & OTHER MALIGNANCIES & NEOPLASMS OF UNCERTAIN BEHAVIOR,17,"MYELOPROLIFERATIVE DISEASES AND DISORDERS, AND POORLY DIFFERENTIATED NEOPLASM",2,Moderate,Moderate,Medical,Self-Pay,,,,,Y,43992.46,25299.36
New York City,Manhattan,7002001,001438,Bellevue Hospital Center,50 to 69,112,M,Black/African American,Spanish/Hispanic,3,Emergency,Home or Self Care,2020,NEO066,MALIGNANT NEUROENDOCRINE TUMORS,ADM021,"ADMINISTRATION OF THERAPEUTIC SUBSTANCES, NEC",694,LYMPHATIC & OTHER MALIGNANCIES & NEOPLASMS OF UNCERTAIN BEHAVIOR,17,"MYELOPROLIFERATIVE DISEASES AND DISORDERS, AND POORLY DIFFERENTIATED NEOPLASM",2,Moderate,Moderate,Medical,Medicaid,,,,,Y,24491.86,14084.88
New York City,Manhattan,7002001,001438,Bellevue Hospital Center,70 or Older,112,M,White,Not Span/Hispanic,6,Emergency,Home or Self Care,2020,NEO070,SECONDARY MALIGNANCIES,URN005,NEPHROSTOMY AND URETEROSTOMY PROCEDURES (INCLUDING STENTS),694,LYMPHATIC & OTHER MALIGNANCIES & NEOPLASMS OF UNCERTAIN BEHAVIOR,17,"MYELOPROLIFERATIVE DISEASES AND DISORDERS, AND POORLY DIFFERENTIATED NEOPLASM",2,Moderate,Moderate,Medical,Medicaid,,,,,Y,46788.29,26907.2
New York City,Manhattan,7002001,001438,Bellevue Hospital Center,70 or Older,100,F,Other Race,Spanish/Hispanic,4,Emergency,Home or Self Care,2020,NEO071,"MALIGNANT NEOPLASM, UNSPECIFIED",RES005,CHEST TUBE PLACEMENT AND THERAPEUTIC THORACENTESIS,694,LYMPHATIC & OTHER MALIGNANCIES & NEOPLASMS OF UNCERTAIN BEHAVIOR,17,"MYELOPROLIFERATIVE DISEASES AND DISORDERS, AND POORLY DIFFERENTIATED NEOPLASM",3,Major,Major,Medical,Medicare,,,,,Y,47492.21,27312.01
New York City,Manhattan,7002001,001438,Bellevue Hospital Center,30 to 49,111,F,Other Race,Unknown,3,Emergency,Home or Self Care,2020,NEO070,SECONDARY MALIGNANCIES,RES001,BRONCHOSCOPY (DIAGNOSTIC),694,LYMPHATIC & OTHER MALIGNANCIES & NEOPLASMS OF UNCERTAIN BEHAVIOR,17,"MYELOPROLIFERATIVE DISEASES AND DISORDERS, AND POORLY DIFFERENTIATED NEOPLASM",3,Major,Major,Medical,Medicaid,,,,,Y,53059.17,30513.48
New York City,Manhattan,7002001,001438,Bellevue Hospital Center,30 to 49,112,F,White,Spanish/Hispanic,3,Elective,Home or Self Care,2020,NEO070,SECONDARY MALIGNANCIES,NCM003,RADIONUCLIDE THERAPY AND NON-IMAGING PROCEDURES,694,LYMPHATIC & OTHER MALIGNANCIES & NEOPLASMS OF UNCERTAIN BEHAVIOR,17,"MYELOPROLIFERATIVE DISEASES AND DISORDERS, AND POORLY DIFFERENTIATED NEOPLASM",2,Moderate,Moderate,Medical,Medicaid,,,,,N,23769.25,13669.32
New York City,Manhattan,7002001,001438,Bellevue Hospital Center,30 to 49,113,M,Other Race,Not Span/Hispanic,10,Elective,Home or Self Care,2020,NEO071,"MALIGNANT NEOPLASM, UNSPECIFIED",ADM012,CHEMOTHERAPY,694,LYMPHATIC & OTHER MALIGNANCIES & NEOPLASMS OF UNCERTAIN BEHAVIOR,17,"MYELOPROLIFERATIVE DISEASES AND DISORDERS, AND POORLY DIFFERENTIATED NEOPLASM",3,Major,Moderate,Medical,Medicaid,,,,,N,69058.79,39714.61
New York City,Manhattan,7002001,001438,Bellevue Hospital Center,50 to 69,112,F,Black/African American,Not Span/Hispanic,4,Urgent,Home or Self Care,2020,NEO070,SECONDARY MALIGNANCIES,ADM016,ADMINISTRATION OF ANTI-INFLAMMATORY AGENTS,694,LYMPHATIC & OTHER MALIGNANCIES & NEOPLASMS OF UNCERTAIN BEHAVIOR,17,"MYELOPROLIFERATIVE DISEASES AND DISORDERS, AND POORLY DIFFERENTIATED NEOPLASM",2,Moderate,Moderate,Medical,Private Health Insurance,,,,,N,25609.29,14727.49
