Hospital Service Area,Hospital County,Operating Certificate Number,Permanent Facility Id,Facility Name,Age Group,Zip Code - 3 digits,Gender,Race,Ethnicity,Length of Stay,Type of Admission,Patient Disposition,Discharge Year,CCS Diagnosis Code,CCS Diagnosis Description,CCS Procedure Code,CCS Procedure Description,APR DRG Code,APR DRG Description,APR MDC Code,APR MDC Description,APR Severity of Illness Code,APR Severity of Illness Description,APR Risk of Mortality,APR Medical Surgical Description,Payment Typology 1,Payment Typology 2,Payment Typology 3,Birth Weight,Abortion Edit Indicator,Emergency Department Indicator,Total Charges,Total Costs
New York City,Manhattan,7002053,001463,NYU Langone Hospitals,50 to 69,112,M,White,Not Span/Hispanic,4,Elective,Home or Self Care,2018,FAC006,ENCOUNTER FOR ANTINEOPLASTIC THERAPIES,ADM012,CHEMOTHERAPY,695,CHEMOTHERAPY FOR ACUTE LEUKEMIA,17,"MYELOPROLIFERATIVE DISEASES AND DISORDERS, AND POORLY DIFFERENTIATED NEOPLASM",2,Moderate,Minor,Medical,Private Health Insurance,,,,,false,33312.28,13279.29
New York City,Manhattan,7002054,001458,New York-Presbyterian Hospital - New York Weill Cornell Center,70 or Older,OOS,M,Other Race,Not Span/Hispanic,3,Elective,Home or Self Care,2018,FAC006,ENCOUNTER FOR ANTINEOPLASTIC THERAPIES,CNS002,LUMBAR PUNCTURE,695,CHEMOTHERAPY FOR ACUTE LEUKEMIA,17,"MYELOPROLIFERATIVE DISEASES AND DISORDERS, AND POORLY DIFFERENTIATED NEOPLASM",3,Major,Major,Medical,Medicare,Private Health Insurance,Self-Pay,,,false,35785.89,9987.97
New York City,Bronx,7000006,001169,Montefiore Medical Center - Henry & Lucy Moses Div,0 to 17,104,F,Other Race,Spanish/Hispanic,2,Emergency,Home or Self Care,2018,FAC006,ENCOUNTER FOR ANTINEOPLASTIC THERAPIES,ADM012,CHEMOTHERAPY,695,CHEMOTHERAPY FOR ACUTE LEUKEMIA,17,"MYELOPROLIFERATIVE DISEASES AND DISORDERS, AND POORLY DIFFERENTIATED NEOPLASM",3,Major,Moderate,Medical,Medicaid,,,,,false,26105.97,7039.93
New York City,Kings,7001020,001305,Maimonides Medical Center,0 to 17,112,F,Other Race,Not Span/Hispanic,2,Urgent,Home or Self Care,2018,FAC006,ENCOUNTER FOR ANTINEOPLASTIC THERAPIES,ADM012,CHEMOTHERAPY,695,CHEMOTHERAPY FOR ACUTE LEUKEMIA,17,"MYELOPROLIFERATIVE DISEASES AND DISORDERS, AND POORLY DIFFERENTIATED NEOPLASM",2,Moderate,Moderate,Medical,Medicaid,Self-Pay,,,,false,16868.13,7399.94
New York City,Manhattan,7002054,001458,New York-Presbyterian Hospital - New York Weill Cornell Center,30 to 49,112,F,Other Race,Spanish/Hispanic,19,Emergency,Home or Self Care,2018,FAC006,ENCOUNTER FOR ANTINEOPLASTIC THERAPIES,LYM007,BONE MARROW BIOPSY,695,CHEMOTHERAPY FOR ACUTE LEUKEMIA,17,"MYELOPROLIFERATIVE DISEASES AND DISORDERS, AND POORLY DIFFERENTIATED NEOPLASM",3,Major,Moderate,Medical,Medicaid,Self-Pay,,,,true,191923.29,42625.64
New York City,Manhattan,7002054,001464,New York-Presbyterian Hospital - Columbia Presbyterian Center,0 to 17,100,M,Multi-racial,Multi-ethnic,31,Elective,Home w/ Home Health Services,2018,FAC006,ENCOUNTER FOR ANTINEOPLASTIC THERAPIES,LYM007,BONE MARROW BIOPSY,695,CHEMOTHERAPY FOR ACUTE LEUKEMIA,17,"MYELOPROLIFERATIVE DISEASES AND DISORDERS, AND POORLY DIFFERENTIATED NEOPLASM",3,Major,Moderate,Medical,Medicaid,Medicaid,Self-Pay,,,false,567678.32,232805.65
Hudson Valley,Westchester,5957001,001139,Westchester Medical Center,70 or Older,105,M,White,Not Span/Hispanic,5,Elective,Home w/ Home Health Services,2018,FAC006,ENCOUNTER FOR ANTINEOPLASTIC THERAPIES,ADM012,CHEMOTHERAPY,695,CHEMOTHERAPY FOR ACUTE LEUKEMIA,17,"MYELOPROLIFERATIVE DISEASES AND DISORDERS, AND POORLY DIFFERENTIATED NEOPLASM",2,Moderate,Moderate,Medical,Medicare,Private Health Insurance,,,,false,73254.65,13475.79
New York City,Manhattan,7002002,001439,Mount Sinai Beth Israel,30 to 49,112,F,Other Race,Spanish/Hispanic,5,Urgent,Home or Self Care,2018,FAC006,ENCOUNTER FOR ANTINEOPLASTIC THERAPIES,ADM012,CHEMOTHERAPY,695,CHEMOTHERAPY FOR ACUTE LEUKEMIA,17,"MYELOPROLIFERATIVE DISEASES AND DISORDERS, AND POORLY DIFFERENTIATED NEOPLASM",2,Moderate,Minor,Medical,Medicaid,Medicaid,Self-Pay,,,false,51966.55,11386.29
New York City,Manhattan,7002020,001453,Memorial Hospital for Cancer and Allied Diseases,0 to 17,,F,Other Race,Not Span/Hispanic,8,Elective,Home or Self Care,2018,FAC006,ENCOUNTER FOR ANTINEOPLASTIC THERAPIES,ADM012,CHEMOTHERAPY,695,CHEMOTHERAPY FOR ACUTE LEUKEMIA,17,"MYELOPROLIFERATIVE DISEASES AND DISORDERS, AND POORLY DIFFERENTIATED NEOPLASM",3,Major,Moderate,Medical,Private Health Insurance,,,,,false,98067.62,45755.6
Long Island,Suffolk,5151001,000245,Stony Brook University Hospital,0 to 17,117,F,White,Spanish/Hispanic,4,Elective,Home or Self Care,2018,FAC006,ENCOUNTER FOR ANTINEOPLASTIC THERAPIES,ADM012,CHEMOTHERAPY,695,CHEMOTHERAPY FOR ACUTE LEUKEMIA,17,"MYELOPROLIFERATIVE DISEASES AND DISORDERS, AND POORLY DIFFERENTIATED NEOPLASM",2,Moderate,Moderate,Medical,Medicaid,,,,,false,39932.68,12417.18
Long Island,Nassau,2951001,000541,North Shore University Hospital,50 to 69,113,M,Other Race,Not Span/Hispanic,5,Urgent,Home or Self Care,2018,FAC006,ENCOUNTER FOR ANTINEOPLASTIC THERAPIES,ADM012,CHEMOTHERAPY,695,CHEMOTHERAPY FOR ACUTE LEUKEMIA,17,"MYELOPROLIFERATIVE DISEASES AND DISORDERS, AND POORLY DIFFERENTIATED NEOPLASM",2,Moderate,Moderate,Medical,Medicare,Medicare,,,,false,49590.75,9627.28
Central NY,Onondaga,3301007,000635,University Hospital SUNY Health Science Center,70 or Older,134,M,White,Not Span/Hispanic,5,Elective,Home or Self Care,2018,FAC006,ENCOUNTER FOR ANTINEOPLASTIC THERAPIES,ADM012,CHEMOTHERAPY,695,CHEMOTHERAPY FOR ACUTE LEUKEMIA,17,"MYELOPROLIFERATIVE DISEASES AND DISORDERS, AND POORLY DIFFERENTIATED NEOPLASM",3,Major,Major,Medical,Medicare,Private Health Insurance,,,,false,31915.8,10364.2
Finger Lakes,Monroe,2701005,000413,Strong Memorial Hospital,0 to 17,145,M,White,Not Span/Hispanic,3,Elective,Home or Self Care,2018,FAC006,ENCOUNTER FOR ANTINEOPLASTIC THERAPIES,ADM012,CHEMOTHERAPY,695,CHEMOTHERAPY FOR ACUTE LEUKEMIA,17,"MYELOPROLIFERATIVE DISEASES AND DISORDERS, AND POORLY DIFFERENTIATED NEOPLASM",2,Moderate,Moderate,Medical,Medicaid,Medicaid,Self-Pay,,,false,8930.65,4973.37
New York City,Manhattan,7002054,001464,New York-Presbyterian Hospital - Columbia Presbyterian Center,70 or Older,104,F,White,Not Span/Hispanic,8,Urgent,Inpatient Rehabilitation Facility,2018,FAC006,ENCOUNTER FOR ANTINEOPLASTIC THERAPIES,ADM012,CHEMOTHERAPY,695,CHEMOTHERAPY FOR ACUTE LEUKEMIA,17,"MYELOPROLIFERATIVE DISEASES AND DISORDERS, AND POORLY DIFFERENTIATED NEOPLASM",3,Major,Major,Medical,Medicare,Private Health Insurance,Self-Pay,,,false,103372.06,23794.68
Western NY,Erie,1401014,000208,John R. Oishei Children's Hospital,0 to 17,147,M,Black/African American,Not Span/Hispanic,29,Elective,Home w/ Home Health Services,2018,FAC006,ENCOUNTER FOR ANTINEOPLASTIC THERAPIES,ADM012,CHEMOTHERAPY,695,CHEMOTHERAPY FOR ACUTE LEUKEMIA,17,"MYELOPROLIFERATIVE DISEASES AND DISORDERS, AND POORLY DIFFERENTIATED NEOPLASM",3,Major,Moderate,Medical,Federal/State/Local/VA,Self-Pay,,,,false,74721.06,29832.6
Capital/Adirond,Albany,0101000,000001,Albany Medical Center Hospital,50 to 69,122,F,Black/African American,Not Span/Hispanic,5,Elective,Home or Self Care,2018,FAC006,ENCOUNTER FOR ANTINEOPLASTIC THERAPIES,ADM012,CHEMOTHERAPY,695,CHEMOTHERAPY FOR ACUTE LEUKEMIA,17,"MYELOPROLIFERATIVE DISEASES AND DISORDERS, AND POORLY DIFFERENTIATED NEOPLASM",3,Major,Moderate,Medical,Medicare,,,,,false,17431.77,6335.38
Western NY,Erie,1401014,000208,John R. Oishei Children's Hospital,0 to 17,140,F,White,Not Span/Hispanic,7,Elective,Home or Self Care,2018,FAC006,ENCOUNTER FOR ANTINEOPLASTIC THERAPIES,CAR024,VENOUS AND ARTERIAL CATHETER PLACEMENT,695,CHEMOTHERAPY FOR ACUTE LEUKEMIA,17,"MYELOPROLIFERATIVE DISEASES AND DISORDERS, AND POORLY DIFFERENTIATED NEOPLASM",3,Major,Moderate,Medical,Private Health Insurance,Medicaid,Self-Pay,,,false,64897.54,28825.68
Finger Lakes,Monroe,2701005,000413,Strong Memorial Hospital,50 to 69,148,M,White,Not Span/Hispanic,35,Emergency,Home or Self Care,2018,FAC006,ENCOUNTER FOR ANTINEOPLASTIC THERAPIES,LYM007,BONE MARROW BIOPSY,695,CHEMOTHERAPY FOR ACUTE LEUKEMIA,17,"MYELOPROLIFERATIVE DISEASES AND DISORDERS, AND POORLY DIFFERENTIATED NEOPLASM",4,Extreme,Major,Medical,Private Health Insurance,Self-Pay,,,,true,136823.29,55252.07
New York City,Manhattan,7002020,001453,Memorial Hospital for Cancer and Allied Diseases,50 to 69,115,F,White,Not Span/Hispanic,3,Elective,Home or Self Care,2018,FAC006,ENCOUNTER FOR ANTINEOPLASTIC THERAPIES,ADM012,CHEMOTHERAPY,695,CHEMOTHERAPY FOR ACUTE LEUKEMIA,17,"MYELOPROLIFERATIVE DISEASES AND DISORDERS, AND POORLY DIFFERENTIATED NEOPLASM",2,Moderate,Minor,Medical,Private Health Insurance,,,,,false,53288.06,18684.59
New York City,Manhattan,7002020,001453,Memorial Hospital for Cancer and Allied Diseases,50 to 69,100,F,Other Race,Not Span/Hispanic,5,Elective,Home or Self Care,2018,FAC006,ENCOUNTER FOR ANTINEOPLASTIC THERAPIES,ADM012,CHEMOTHERAPY,695,CHEMOTHERAPY FOR ACUTE LEUKEMIA,17,"MYELOPROLIFERATIVE DISEASES AND DISORDERS, AND POORLY DIFFERENTIATED NEOPLASM",2,Moderate,Moderate,Medical,Medicare,Medicare,,,,false,50064.7,19225.83
Capital/Adirond,Albany,0101000,000001,Albany Medical Center Hospital,70 or Older,120,M,White,Not Span/Hispanic,2,Elective,Home or Self Care,2018,FAC006,ENCOUNTER FOR ANTINEOPLASTIC THERAPIES,ADM012,CHEMOTHERAPY,695,CHEMOTHERAPY FOR ACUTE LEUKEMIA,17,"MYELOPROLIFERATIVE DISEASES AND DISORDERS, AND POORLY DIFFERENTIATED NEOPLASM",2,Moderate,Minor,Medical,Medicare,,,,,false,8229.25,2716.86
New York City,Queens,7003004,003376,Cohen Children's Medical Center,0 to 17,113,M,White,Not Span/Hispanic,12,Elective,Home or Self Care,2018,FAC006,ENCOUNTER FOR ANTINEOPLASTIC THERAPIES,ADM012,CHEMOTHERAPY,695,CHEMOTHERAPY FOR ACUTE LEUKEMIA,17,"MYELOPROLIFERATIVE DISEASES AND DISORDERS, AND POORLY DIFFERENTIATED NEOPLASM",4,Extreme,Moderate,Medical,Medicaid,Medicaid,Self-Pay,,,false,114728.33,26526.11
Western NY,Erie,1401014,000208,John R. Oishei Children's Hospital,0 to 17,141,F,White,Not Span/Hispanic,4,Elective,Home w/ Home Health Services,2018,FAC006,ENCOUNTER FOR ANTINEOPLASTIC THERAPIES,ADM012,CHEMOTHERAPY,695,CHEMOTHERAPY FOR ACUTE LEUKEMIA,17,"MYELOPROLIFERATIVE DISEASES AND DISORDERS, AND POORLY DIFFERENTIATED NEOPLASM",2,Moderate,Minor,Medical,Private Health Insurance,Self-Pay,,,,false,10504.53,4367.88
Western NY,Erie,1401014,000208,John R. Oishei Children's Hospital,0 to 17,141,F,White,Not Span/Hispanic,4,Elective,Home or Self Care,2018,FAC006,ENCOUNTER FOR ANTINEOPLASTIC THERAPIES,ADM012,CHEMOTHERAPY,695,CHEMOTHERAPY FOR ACUTE LEUKEMIA,17,"MYELOPROLIFERATIVE DISEASES AND DISORDERS, AND POORLY DIFFERENTIATED NEOPLASM",2,Moderate,Moderate,Medical,Private Health Insurance,Self-Pay,,,,false,19442.73,10162.92
Central NY,Onondaga,3301007,000635,University Hospital SUNY Health Science Center,0 to 17,134,F,White,Not Span/Hispanic,5,Elective,Home or Self Care,2018,FAC006,ENCOUNTER FOR ANTINEOPLASTIC THERAPIES,ADM012,CHEMOTHERAPY,695,CHEMOTHERAPY FOR ACUTE LEUKEMIA,17,"MYELOPROLIFERATIVE DISEASES AND DISORDERS, AND POORLY DIFFERENTIATED NEOPLASM",2,Moderate,Minor,Medical,Private Health Insurance,,,,,false,38045,11301.71
Long Island,Nassau,2908000,000511,NYU Langone Hospital-Long Island,0 to 17,115,F,White,Not Span/Hispanic,3,Elective,Home w/ Home Health Services,2018,FAC006,ENCOUNTER FOR ANTINEOPLASTIC THERAPIES,ADM012,CHEMOTHERAPY,695,CHEMOTHERAPY FOR ACUTE LEUKEMIA,17,"MYELOPROLIFERATIVE DISEASES AND DISORDERS, AND POORLY DIFFERENTIATED NEOPLASM",2,Moderate,Moderate,Medical,Medicaid,Medicaid,,,,false,45355.19,6779.16
Long Island,Nassau,2951001,000541,North Shore University Hospital,70 or Older,115,M,Other Race,Spanish/Hispanic,91,Urgent,Home or Self Care,2018,FAC006,ENCOUNTER FOR ANTINEOPLASTIC THERAPIES,CAR024,VENOUS AND ARTERIAL CATHETER PLACEMENT,695,CHEMOTHERAPY FOR ACUTE LEUKEMIA,17,"MYELOPROLIFERATIVE DISEASES AND DISORDERS, AND POORLY DIFFERENTIATED NEOPLASM",4,Extreme,Major,Medical,Medicare,Private Health Insurance,,,,false,1716264.17,465369.41
Long Island,Nassau,2951001,000541,North Shore University Hospital,30 to 49,115,M,White,Not Span/Hispanic,3,Elective,Home or Self Care,2018,FAC006,ENCOUNTER FOR ANTINEOPLASTIC THERAPIES,ADM012,CHEMOTHERAPY,695,CHEMOTHERAPY FOR ACUTE LEUKEMIA,17,"MYELOPROLIFERATIVE DISEASES AND DISORDERS, AND POORLY DIFFERENTIATED NEOPLASM",2,Moderate,Minor,Medical,Blue Cross/Blue Shield,Miscellaneous/Other,,,,false,31582.27,6513.25
Long Island,Nassau,2951001,000541,North Shore University Hospital,18 to 29,114,F,Black/African American,Not Span/Hispanic,5,Elective,Home or Self Care,2018,FAC006,ENCOUNTER FOR ANTINEOPLASTIC THERAPIES,ADM012,CHEMOTHERAPY,695,CHEMOTHERAPY FOR ACUTE LEUKEMIA,17,"MYELOPROLIFERATIVE DISEASES AND DISORDERS, AND POORLY DIFFERENTIATED NEOPLASM",2,Moderate,Moderate,Medical,Blue Cross/Blue Shield,,,,,false,46328.62,8538.94
New York City,Manhattan,7002020,001453,Memorial Hospital for Cancer and Allied Diseases,30 to 49,117,M,White,Not Span/Hispanic,3,Elective,Home or Self Care,2018,FAC006,ENCOUNTER FOR ANTINEOPLASTIC THERAPIES,ADM012,CHEMOTHERAPY,695,CHEMOTHERAPY FOR ACUTE LEUKEMIA,17,"MYELOPROLIFERATIVE DISEASES AND DISORDERS, AND POORLY DIFFERENTIATED NEOPLASM",3,Major,Moderate,Medical,Private Health Insurance,,,,,false,41655.96,19840.66
New York City,Manhattan,7002024,001456,Mount Sinai Hospital,0 to 17,109,M,White,Not Span/Hispanic,4,Elective,Home or Self Care,2018,FAC006,ENCOUNTER FOR ANTINEOPLASTIC THERAPIES,ADM012,CHEMOTHERAPY,695,CHEMOTHERAPY FOR ACUTE LEUKEMIA,17,"MYELOPROLIFERATIVE DISEASES AND DISORDERS, AND POORLY DIFFERENTIATED NEOPLASM",2,Moderate,Moderate,Medical,Private Health Insurance,Self-Pay,,,,false,48906.14,32925.82
New York City,Manhattan,7002001,001438,Bellevue Hospital Center,18 to 29,112,M,Other Race,Spanish/Hispanic,6,Emergency,Home or Self Care,2018,FAC006,ENCOUNTER FOR ANTINEOPLASTIC THERAPIES,ADM012,CHEMOTHERAPY,695,CHEMOTHERAPY FOR ACUTE LEUKEMIA,17,"MYELOPROLIFERATIVE DISEASES AND DISORDERS, AND POORLY DIFFERENTIATED NEOPLASM",2,Moderate,Moderate,Medical,Medicaid,,,,,false,32501.25,21600.33
Capital/Adirond,Albany,0101000,000001,Albany Medical Center Hospital,50 to 69,120,M,White,Not Span/Hispanic,5,Urgent,Home or Self Care,2018,FAC006,ENCOUNTER FOR ANTINEOPLASTIC THERAPIES,ADM012,CHEMOTHERAPY,695,CHEMOTHERAPY FOR ACUTE LEUKEMIA,17,"MYELOPROLIFERATIVE DISEASES AND DISORDERS, AND POORLY DIFFERENTIATED NEOPLASM",2,Moderate,Moderate,Medical,"Managed Care, Unspecified",Medicare,,,,false,19230.56,6968.6
New York City,Manhattan,7002020,001453,Memorial Hospital for Cancer and Allied Diseases,0 to 17,100,M,Other Race,Spanish/Hispanic,4,Elective,Home or Self Care,2018,FAC006,ENCOUNTER FOR ANTINEOPLASTIC THERAPIES,ADM012,CHEMOTHERAPY,695,CHEMOTHERAPY FOR ACUTE LEUKEMIA,17,"MYELOPROLIFERATIVE DISEASES AND DISORDERS, AND POORLY DIFFERENTIATED NEOPLASM",2,Moderate,Moderate,Medical,Medicaid,Medicaid,,,,false,31630.22,12824.8
Long Island,Nassau,2908000,000511,NYU Langone Hospital-Long Island,0 to 17,117,M,White,Spanish/Hispanic,3,Urgent,Home or Self Care,2018,FAC006,ENCOUNTER FOR ANTINEOPLASTIC THERAPIES,ADM012,CHEMOTHERAPY,695,CHEMOTHERAPY FOR ACUTE LEUKEMIA,17,"MYELOPROLIFERATIVE DISEASES AND DISORDERS, AND POORLY DIFFERENTIATED NEOPLASM",2,Moderate,Minor,Medical,Medicaid,Medicaid,,,,false,40012.85,7341.2
New York City,Bronx,7000006,001169,Montefiore Medical Center - Henry & Lucy Moses Div,30 to 49,104,F,Black/African American,Not Span/Hispanic,5,Elective,Home or Self Care,2018,FAC006,ENCOUNTER FOR ANTINEOPLASTIC THERAPIES,ADM012,CHEMOTHERAPY,695,CHEMOTHERAPY FOR ACUTE LEUKEMIA,17,"MYELOPROLIFERATIVE DISEASES AND DISORDERS, AND POORLY DIFFERENTIATED NEOPLASM",2,Moderate,Moderate,Medical,Private Health Insurance,,,,,false,57493,10553.5
Central NY,Onondaga,3301007,000635,University Hospital SUNY Health Science Center,50 to 69,136,M,White,Not Span/Hispanic,23,Elective,Home or Self Care,2018,FAC006,ENCOUNTER FOR ANTINEOPLASTIC THERAPIES,ADM012,CHEMOTHERAPY,695,CHEMOTHERAPY FOR ACUTE LEUKEMIA,17,"MYELOPROLIFERATIVE DISEASES AND DISORDERS, AND POORLY DIFFERENTIATED NEOPLASM",3,Major,Minor,Medical,Medicare,Private Health Insurance,,,,false,161519.9,55214.72
Central NY,Onondaga,3301007,000635,University Hospital SUNY Health Science Center,50 to 69,133,F,White,Not Span/Hispanic,21,Elective,Home or Self Care,2018,FAC006,ENCOUNTER FOR ANTINEOPLASTIC THERAPIES,ADM012,CHEMOTHERAPY,695,CHEMOTHERAPY FOR ACUTE LEUKEMIA,17,"MYELOPROLIFERATIVE DISEASES AND DISORDERS, AND POORLY DIFFERENTIATED NEOPLASM",3,Major,Moderate,Medical,Private Health Insurance,,,,,false,137807.7,43683.63
New York City,Manhattan,7002001,001438,Bellevue Hospital Center,30 to 49,112,F,Other Race,Spanish/Hispanic,4,Emergency,Home or Self Care,2018,FAC006,ENCOUNTER FOR ANTINEOPLASTIC THERAPIES,ADM012,CHEMOTHERAPY,695,CHEMOTHERAPY FOR ACUTE LEUKEMIA,17,"MYELOPROLIFERATIVE DISEASES AND DISORDERS, AND POORLY DIFFERENTIATED NEOPLASM",2,Moderate,Minor,Medical,Medicaid,,,,,false,22548.75,14985.9
New York City,Manhattan,7002001,001438,Bellevue Hospital Center,18 to 29,112,M,Other Race,Spanish/Hispanic,4,Emergency,Home or Self Care,2018,FAC006,ENCOUNTER FOR ANTINEOPLASTIC THERAPIES,ADM012,CHEMOTHERAPY,695,CHEMOTHERAPY FOR ACUTE LEUKEMIA,17,"MYELOPROLIFERATIVE DISEASES AND DISORDERS, AND POORLY DIFFERENTIATED NEOPLASM",2,Moderate,Minor,Medical,Medicaid,,,,,false,22522.53,14968.47
New York City,Manhattan,7002053,001463,NYU Langone Hospitals,0 to 17,103,M,Other Race,Spanish/Hispanic,18,Elective,Home or Self Care,2018,FAC006,ENCOUNTER FOR ANTINEOPLASTIC THERAPIES,ADM012,CHEMOTHERAPY,695,CHEMOTHERAPY FOR ACUTE LEUKEMIA,17,"MYELOPROLIFERATIVE DISEASES AND DISORDERS, AND POORLY DIFFERENTIATED NEOPLASM",3,Major,Minor,Medical,Medicaid,,,,,false,162905.81,49609.34
New York City,Manhattan,7002053,001463,NYU Langone Hospitals,30 to 49,112,F,White,Not Span/Hispanic,5,Elective,Home or Self Care,2018,FAC006,ENCOUNTER FOR ANTINEOPLASTIC THERAPIES,ADM012,CHEMOTHERAPY,695,CHEMOTHERAPY FOR ACUTE LEUKEMIA,17,"MYELOPROLIFERATIVE DISEASES AND DISORDERS, AND POORLY DIFFERENTIATED NEOPLASM",2,Moderate,Moderate,Medical,Blue Cross/Blue Shield,,,,,false,40467.24,16348.26
New York City,Manhattan,7002054,001458,New York-Presbyterian Hospital - New York Weill Cornell Center,50 to 69,112,F,Other Race,Not Span/Hispanic,42,Elective,Home or Self Care,2018,FAC006,ENCOUNTER FOR ANTINEOPLASTIC THERAPIES,LYM007,BONE MARROW BIOPSY,695,CHEMOTHERAPY FOR ACUTE LEUKEMIA,17,"MYELOPROLIFERATIVE DISEASES AND DISORDERS, AND POORLY DIFFERENTIATED NEOPLASM",4,Extreme,Major,Medical,"Managed Care, Unspecified",Medicaid,Self-Pay,,,false,628921.53,210271.61
Long Island,Nassau,2908000,000511,NYU Langone Hospital-Long Island,30 to 49,115,F,White,Spanish/Hispanic,9,Elective,Home or Self Care,2018,FAC006,ENCOUNTER FOR ANTINEOPLASTIC THERAPIES,CNS002,LUMBAR PUNCTURE,695,CHEMOTHERAPY FOR ACUTE LEUKEMIA,17,"MYELOPROLIFERATIVE DISEASES AND DISORDERS, AND POORLY DIFFERENTIATED NEOPLASM",4,Extreme,Major,Medical,Medicaid,,,,,false,256222.04,33589.55
New York City,Queens,7003004,003376,Cohen Children's Medical Center,0 to 17,114,F,Other Race,Not Span/Hispanic,24,Elective,Home or Self Care,2018,FAC006,ENCOUNTER FOR ANTINEOPLASTIC THERAPIES,ADM015,ADMINISTRATION OF ANTIBIOTICS,695,CHEMOTHERAPY FOR ACUTE LEUKEMIA,17,"MYELOPROLIFERATIVE DISEASES AND DISORDERS, AND POORLY DIFFERENTIATED NEOPLASM",2,Moderate,Minor,Medical,Blue Cross/Blue Shield,Medicaid,Medicaid,,,false,317633.51,90634.97
New York City,Manhattan,7002054,001458,New York-Presbyterian Hospital - New York Weill Cornell Center,18 to 29,104,M,Other Race,Multi-ethnic,3,Elective,Home w/ Home Health Services,2018,FAC006,ENCOUNTER FOR ANTINEOPLASTIC THERAPIES,ADM012,CHEMOTHERAPY,695,CHEMOTHERAPY FOR ACUTE LEUKEMIA,17,"MYELOPROLIFERATIVE DISEASES AND DISORDERS, AND POORLY DIFFERENTIATED NEOPLASM",2,Moderate,Moderate,Medical,"Managed Care, Unspecified",Medicaid,Self-Pay,,,false,32576.16,7940.54
Hudson Valley,Westchester,5957001,001139,Westchester Medical Center,50 to 69,105,M,White,Not Span/Hispanic,5,Elective,Home w/ Home Health Services,2018,FAC006,ENCOUNTER FOR ANTINEOPLASTIC THERAPIES,ADM012,CHEMOTHERAPY,695,CHEMOTHERAPY FOR ACUTE LEUKEMIA,17,"MYELOPROLIFERATIVE DISEASES AND DISORDERS, AND POORLY DIFFERENTIATED NEOPLASM",2,Moderate,Moderate,Medical,Private Health Insurance,,,,,false,96303.47,17822.55
Hudson Valley,Westchester,5957001,001139,Westchester Medical Center,18 to 29,105,M,Other Race,Unknown,4,Elective,Home or Self Care,2018,FAC006,ENCOUNTER FOR ANTINEOPLASTIC THERAPIES,ADM012,CHEMOTHERAPY,695,CHEMOTHERAPY FOR ACUTE LEUKEMIA,17,"MYELOPROLIFERATIVE DISEASES AND DISORDERS, AND POORLY DIFFERENTIATED NEOPLASM",2,Moderate,Moderate,Medical,Medicaid,,,,,false,84982.68,15719.56
Hudson Valley,Westchester,5957001,001139,Westchester Medical Center,50 to 69,125,F,White,Not Span/Hispanic,36,Emergency,Home w/ Home Health Services,2018,FAC006,ENCOUNTER FOR ANTINEOPLASTIC THERAPIES,ADM012,CHEMOTHERAPY,695,CHEMOTHERAPY FOR ACUTE LEUKEMIA,17,"MYELOPROLIFERATIVE DISEASES AND DISORDERS, AND POORLY DIFFERENTIATED NEOPLASM",4,Extreme,Major,Medical,Medicaid,Medicaid,,,,true,625591.38,120377.51
New York City,Manhattan,7002020,001453,Memorial Hospital for Cancer and Allied Diseases,50 to 69,OOS,M,White,Not Span/Hispanic,3,Elective,Home or Self Care,2018,FAC006,ENCOUNTER FOR ANTINEOPLASTIC THERAPIES,ADM012,CHEMOTHERAPY,695,CHEMOTHERAPY FOR ACUTE LEUKEMIA,17,"MYELOPROLIFERATIVE DISEASES AND DISORDERS, AND POORLY DIFFERENTIATED NEOPLASM",2,Moderate,Moderate,Medical,Private Health Insurance,,,,,false,26012.93,9677.28
New York City,Manhattan,7002054,001464,New York-Presbyterian Hospital - Columbia Presbyterian Center,0 to 17,100,M,White,Spanish/Hispanic,6,Urgent,Home or Self Care,2018,FAC006,ENCOUNTER FOR ANTINEOPLASTIC THERAPIES,ADM012,CHEMOTHERAPY,695,CHEMOTHERAPY FOR ACUTE LEUKEMIA,17,"MYELOPROLIFERATIVE DISEASES AND DISORDERS, AND POORLY DIFFERENTIATED NEOPLASM",3,Major,Major,Medical,Medicaid,Self-Pay,,,,false,106452.26,34476.11
Long Island,Suffolk,5151001,000245,Stony Brook University Hospital,30 to 49,119,M,White,Not Span/Hispanic,4,Elective,Home or Self Care,2018,FAC006,ENCOUNTER FOR ANTINEOPLASTIC THERAPIES,ADM012,CHEMOTHERAPY,695,CHEMOTHERAPY FOR ACUTE LEUKEMIA,17,"MYELOPROLIFERATIVE DISEASES AND DISORDERS, AND POORLY DIFFERENTIATED NEOPLASM",3,Major,Moderate,Medical,Blue Cross/Blue Shield,Self-Pay,,,,false,59335.81,18368.13
Long Island,Nassau,2953000,000563,St. Francis Hospital & Heart Center,50 to 69,110,M,White,Not Span/Hispanic,7,Elective,Home or Self Care,2018,FAC006,ENCOUNTER FOR ANTINEOPLASTIC THERAPIES,ADM012,CHEMOTHERAPY,695,CHEMOTHERAPY FOR ACUTE LEUKEMIA,17,"MYELOPROLIFERATIVE DISEASES AND DISORDERS, AND POORLY DIFFERENTIATED NEOPLASM",3,Major,Moderate,Medical,Medicare,Private Health Insurance,,,,false,206823,38277.27
New York City,Manhattan,7002053,001463,NYU Langone Hospitals,50 to 69,112,M,White,Not Span/Hispanic,6,Elective,Home or Self Care,2018,FAC006,ENCOUNTER FOR ANTINEOPLASTIC THERAPIES,ADM012,CHEMOTHERAPY,695,CHEMOTHERAPY FOR ACUTE LEUKEMIA,17,"MYELOPROLIFERATIVE DISEASES AND DISORDERS, AND POORLY DIFFERENTIATED NEOPLASM",4,Extreme,Moderate,Medical,Private Health Insurance,,,,,false,62368.36,21681.89
New York City,Manhattan,7002054,001464,New York-Presbyterian Hospital - Columbia Presbyterian Center,70 or Older,105,M,White,Not Span/Hispanic,18,Urgent,Home or Self Care,2018,FAC006,ENCOUNTER FOR ANTINEOPLASTIC THERAPIES,ADM012,CHEMOTHERAPY,695,CHEMOTHERAPY FOR ACUTE LEUKEMIA,17,"MYELOPROLIFERATIVE DISEASES AND DISORDERS, AND POORLY DIFFERENTIATED NEOPLASM",4,Extreme,Major,Medical,Medicare,Private Health Insurance,Self-Pay,,,false,267817.43,64992.44