Hospital Service Area,Hospital County,Operating Certificate Number,Permanent Facility Id,Facility Name,Age Group,Zip Code - 3 digits,Gender,Race,Ethnicity,Length of Stay,Type of Admission,Patient Disposition,Discharge Year,CCS Diagnosis Code,CCS Diagnosis Description,CCS Procedure Code,CCS Procedure Description,APR DRG Code,APR DRG Description,APR MDC Code,APR MDC Description,APR Severity of Illness Code,APR Severity of Illness Description,APR Risk of Mortality,APR Medical Surgical Description,Payment Typology 1,Payment Typology 2,Payment Typology 3,Birth Weight,Abortion Edit Indicator,Emergency Department Indicator,Total Charges,Total Costs
New York City,Manhattan,7002001,001438,Bellevue Hospital Center,30 to 49,112,M,Other Race,Spanish/Hispanic,30,Emergency,Home or Self Care,2019,FAC006,ENCOUNTER FOR ANTINEOPLASTIC THERAPIES,ADM012,CHEMOTHERAPY,695,CHEMOTHERAPY FOR ACUTE LEUKEMIA,17,"MYELOPROLIFERATIVE DISEASES AND DISORDERS, AND POORLY DIFFERENTIATED NEOPLASM",3,Major,Moderate,Medical,Medicaid,Medicaid,,,,false,146157.86,97136.51
New York City,Manhattan,7002001,001438,Bellevue Hospital Center,50 to 69,112,F,Other Race,Spanish/Hispanic,5,Emergency,Home or Self Care,2019,FAC006,ENCOUNTER FOR ANTINEOPLASTIC THERAPIES,CNS013,SPINAL EPIDURAL CATHETER PLACEMENT,695,CHEMOTHERAPY FOR ACUTE LEUKEMIA,17,"MYELOPROLIFERATIVE DISEASES AND DISORDERS, AND POORLY DIFFERENTIATED NEOPLASM",3,Major,Moderate,Medical,Medicaid,,,,,false,27069.85,17990.62
New York City,Manhattan,7002001,001438,Bellevue Hospital Center,30 to 49,113,M,Other Race,Not Span/Hispanic,3,Emergency,Home or Self Care,2019,FAC006,ENCOUNTER FOR ANTINEOPLASTIC THERAPIES,ADM012,CHEMOTHERAPY,695,CHEMOTHERAPY FOR ACUTE LEUKEMIA,17,"MYELOPROLIFERATIVE DISEASES AND DISORDERS, AND POORLY DIFFERENTIATED NEOPLASM",4,Extreme,Moderate,Medical,Medicaid,,,,,false,17411.93,11571.97
New York City,Manhattan,7002001,001438,Bellevue Hospital Center,50 to 69,104,M,Other Race,Spanish/Hispanic,8,Emergency,Home w/ Home Health Services,2019,FAC006,ENCOUNTER FOR ANTINEOPLASTIC THERAPIES,ADM012,CHEMOTHERAPY,695,CHEMOTHERAPY FOR ACUTE LEUKEMIA,17,"MYELOPROLIFERATIVE DISEASES AND DISORDERS, AND POORLY DIFFERENTIATED NEOPLASM",4,Extreme,Major,Medical,Medicare,Blue Cross/Blue Shield,,,,true,41414.96,27524.38
New York City,Manhattan,7002001,001438,Bellevue Hospital Center,30 to 49,112,M,Other Race,Not Span/Hispanic,26,Emergency,Home or Self Care,2019,FAC006,ENCOUNTER FOR ANTINEOPLASTIC THERAPIES,ADM012,CHEMOTHERAPY,695,CHEMOTHERAPY FOR ACUTE LEUKEMIA,17,"MYELOPROLIFERATIVE DISEASES AND DISORDERS, AND POORLY DIFFERENTIATED NEOPLASM",4,Extreme,Major,Medical,Self-Pay,,,,,false,132220.85,87873.98
New York City,Manhattan,7002001,001438,Bellevue Hospital Center,50 to 69,112,F,Other Race,Not Span/Hispanic,6,Elective,Home or Self Care,2019,FAC006,ENCOUNTER FOR ANTINEOPLASTIC THERAPIES,ADM012,CHEMOTHERAPY,695,CHEMOTHERAPY FOR ACUTE LEUKEMIA,17,"MYELOPROLIFERATIVE DISEASES AND DISORDERS, AND POORLY DIFFERENTIATED NEOPLASM",4,Extreme,Major,Medical,Medicaid,,,,,false,33272.22,22112.72
New York City,Manhattan,7002001,001438,Bellevue Hospital Center,50 to 69,114,F,Other Race,Not Span/Hispanic,29,Emergency,Home w/ Home Health Services,2019,FAC006,ENCOUNTER FOR ANTINEOPLASTIC THERAPIES,ADM012,CHEMOTHERAPY,695,CHEMOTHERAPY FOR ACUTE LEUKEMIA,17,"MYELOPROLIFERATIVE DISEASES AND DISORDERS, AND POORLY DIFFERENTIATED NEOPLASM",4,Extreme,Moderate,Medical,Medicaid,,,,,false,154537.55,102705.66
New York City,Manhattan,7002001,001438,Bellevue Hospital Center,30 to 49,112,M,Multi-racial,Unknown,6,Elective,Home or Self Care,2019,FAC006,ENCOUNTER FOR ANTINEOPLASTIC THERAPIES,ADM012,CHEMOTHERAPY,695,CHEMOTHERAPY FOR ACUTE LEUKEMIA,17,"MYELOPROLIFERATIVE DISEASES AND DISORDERS, AND POORLY DIFFERENTIATED NEOPLASM",2,Moderate,Moderate,Medical,Private Health Insurance,,,,,false,32271.57,21447.69
New York City,Manhattan,7002001,001438,Bellevue Hospital Center,50 to 69,114,F,Other Race,Not Span/Hispanic,5,Emergency,Home or Self Care,2019,FAC006,ENCOUNTER FOR ANTINEOPLASTIC THERAPIES,ADM012,CHEMOTHERAPY,695,CHEMOTHERAPY FOR ACUTE LEUKEMIA,17,"MYELOPROLIFERATIVE DISEASES AND DISORDERS, AND POORLY DIFFERENTIATED NEOPLASM",3,Major,Moderate,Medical,Medicaid,Medicaid,,,,false,27389.97,18203.37
New York City,Manhattan,7002001,001438,Bellevue Hospital Center,30 to 49,100,M,Other Race,Spanish/Hispanic,11,Emergency,Home or Self Care,2019,FAC006,ENCOUNTER FOR ANTINEOPLASTIC THERAPIES,ADM012,CHEMOTHERAPY,695,CHEMOTHERAPY FOR ACUTE LEUKEMIA,17,"MYELOPROLIFERATIVE DISEASES AND DISORDERS, AND POORLY DIFFERENTIATED NEOPLASM",3,Major,Moderate,Medical,Medicaid,,,,,false,57670.23,38327.63
New York City,Manhattan,7002001,001438,Bellevue Hospital Center,50 to 69,112,F,Other Race,Spanish/Hispanic,8,Elective,Home or Self Care,2019,FAC006,ENCOUNTER FOR ANTINEOPLASTIC THERAPIES,ADM012,CHEMOTHERAPY,695,CHEMOTHERAPY FOR ACUTE LEUKEMIA,17,"MYELOPROLIFERATIVE DISEASES AND DISORDERS, AND POORLY DIFFERENTIATED NEOPLASM",3,Major,Moderate,Medical,Medicaid,,,,,false,42055.89,27950.34
New York City,Manhattan,7002001,001438,Bellevue Hospital Center,70 or Older,112,M,Other Race,Spanish/Hispanic,8,Emergency,Home or Self Care,2019,FAC006,ENCOUNTER FOR ANTINEOPLASTIC THERAPIES,ADM012,CHEMOTHERAPY,695,CHEMOTHERAPY FOR ACUTE LEUKEMIA,17,"MYELOPROLIFERATIVE DISEASES AND DISORDERS, AND POORLY DIFFERENTIATED NEOPLASM",3,Major,Major,Medical,Medicare,Medicare,Medicaid,,,false,42268.9,28091.91
New York City,Manhattan,7002001,001438,Bellevue Hospital Center,70 or Older,112,M,Other Race,Spanish/Hispanic,5,Elective,Home or Self Care,2019,FAC006,ENCOUNTER FOR ANTINEOPLASTIC THERAPIES,ADM012,CHEMOTHERAPY,695,CHEMOTHERAPY FOR ACUTE LEUKEMIA,17,"MYELOPROLIFERATIVE DISEASES AND DISORDERS, AND POORLY DIFFERENTIATED NEOPLASM",4,Extreme,Major,Medical,Medicare,Medicaid,,,,false,53091.08,35284.33
New York City,Manhattan,7002001,001438,Bellevue Hospital Center,30 to 49,112,M,Black/African American,Unknown,5,Elective,Home or Self Care,2019,FAC006,ENCOUNTER FOR ANTINEOPLASTIC THERAPIES,ADM016,ADMINISTRATION OF ANTI-INFLAMMATORY AGENTS,695,CHEMOTHERAPY FOR ACUTE LEUKEMIA,17,"MYELOPROLIFERATIVE DISEASES AND DISORDERS, AND POORLY DIFFERENTIATED NEOPLASM",3,Major,Moderate,Medical,Private Health Insurance,,,,,false,34374.58,22845.35
New York City,Manhattan,7002001,001438,Bellevue Hospital Center,50 to 69,114,F,Black/African American,Unknown,5,Elective,Home w/ Home Health Services,2019,FAC006,ENCOUNTER FOR ANTINEOPLASTIC THERAPIES,ADM012,CHEMOTHERAPY,695,CHEMOTHERAPY FOR ACUTE LEUKEMIA,17,"MYELOPROLIFERATIVE DISEASES AND DISORDERS, AND POORLY DIFFERENTIATED NEOPLASM",2,Moderate,Moderate,Medical,Medicaid,,,,,false,36626.12,24341.72
New York City,Manhattan,7002001,001438,Bellevue Hospital Center,30 to 49,112,M,Black/African American,Unknown,5,Elective,Home or Self Care,2019,FAC006,ENCOUNTER FOR ANTINEOPLASTIC THERAPIES,ADM012,CHEMOTHERAPY,695,CHEMOTHERAPY FOR ACUTE LEUKEMIA,17,"MYELOPROLIFERATIVE DISEASES AND DISORDERS, AND POORLY DIFFERENTIATED NEOPLASM",2,Moderate,Moderate,Medical,Private Health Insurance,,,,,false,34080.71,22650.04
New York City,Manhattan,7002001,001438,Bellevue Hospital Center,50 to 69,112,F,Other Race,Spanish/Hispanic,8,Elective,Home or Self Care,2019,FAC006,ENCOUNTER FOR ANTINEOPLASTIC THERAPIES,ADM012,CHEMOTHERAPY,695,CHEMOTHERAPY FOR ACUTE LEUKEMIA,17,"MYELOPROLIFERATIVE DISEASES AND DISORDERS, AND POORLY DIFFERENTIATED NEOPLASM",3,Major,Moderate,Medical,Medicare,Medicaid,,,,true,89894.98,59744.2
New York City,Manhattan,7002001,001438,Bellevue Hospital Center,50 to 69,112,F,Other Race,Spanish/Hispanic,9,Elective,Home or Self Care,2019,FAC006,ENCOUNTER FOR ANTINEOPLASTIC THERAPIES,ADM012,CHEMOTHERAPY,695,CHEMOTHERAPY FOR ACUTE LEUKEMIA,17,"MYELOPROLIFERATIVE DISEASES AND DISORDERS, AND POORLY DIFFERENTIATED NEOPLASM",4,Extreme,Moderate,Medical,Medicare,Medicaid,,,,false,88863.33,59058.57
New York City,Manhattan,7002001,001438,Bellevue Hospital Center,30 to 49,100,F,Black/African American,Spanish/Hispanic,6,Urgent,Left Against Medical Advice,2019,FAC006,ENCOUNTER FOR ANTINEOPLASTIC THERAPIES,ADM012,CHEMOTHERAPY,695,CHEMOTHERAPY FOR ACUTE LEUKEMIA,17,"MYELOPROLIFERATIVE DISEASES AND DISORDERS, AND POORLY DIFFERENTIATED NEOPLASM",4,Extreme,Major,Medical,Medicaid,,,,,false,75912.21,50451.25
New York City,Manhattan,7002001,001438,Bellevue Hospital Center,50 to 69,112,F,Other Race,Spanish/Hispanic,22,Elective,Home or Self Care,2019,FAC006,ENCOUNTER FOR ANTINEOPLASTIC THERAPIES,ADM012,CHEMOTHERAPY,695,CHEMOTHERAPY FOR ACUTE LEUKEMIA,17,"MYELOPROLIFERATIVE DISEASES AND DISORDERS, AND POORLY DIFFERENTIATED NEOPLASM",4,Extreme,Moderate,Medical,Medicare,,,,,false,196239.84,130421
New York City,Manhattan,7002001,001438,Bellevue Hospital Center,30 to 49,113,M,Other Race,Unknown,7,Elective,Court/Law Enforcement,2019,FAC006,ENCOUNTER FOR ANTINEOPLASTIC THERAPIES,CNS002,LUMBAR PUNCTURE,695,CHEMOTHERAPY FOR ACUTE LEUKEMIA,17,"MYELOPROLIFERATIVE DISEASES AND DISORDERS, AND POORLY DIFFERENTIATED NEOPLASM",3,Major,Moderate,Medical,Medicaid,,,,,false,49820.55,33110.74
New York City,Manhattan,7002001,001438,Bellevue Hospital Center,30 to 49,113,M,Other Race,Unknown,1,Elective,Court/Law Enforcement,2019,FAC006,ENCOUNTER FOR ANTINEOPLASTIC THERAPIES,ADM012,CHEMOTHERAPY,695,CHEMOTHERAPY FOR ACUTE LEUKEMIA,17,"MYELOPROLIFERATIVE DISEASES AND DISORDERS, AND POORLY DIFFERENTIATED NEOPLASM",2,Moderate,Minor,Medical,Medicaid,,,,,false,7538.24,5009.91
New York City,Manhattan,7002001,001438,Bellevue Hospital Center,50 to 69,114,M,Other Race,Not Span/Hispanic,8,Elective,Home or Self Care,2019,FAC006,ENCOUNTER FOR ANTINEOPLASTIC THERAPIES,ADM012,CHEMOTHERAPY,695,CHEMOTHERAPY FOR ACUTE LEUKEMIA,17,"MYELOPROLIFERATIVE DISEASES AND DISORDERS, AND POORLY DIFFERENTIATED NEOPLASM",3,Major,Moderate,Medical,Medicaid,,,,,false,73051.5,48550.03
New York City,Manhattan,7002001,001438,Bellevue Hospital Center,50 to 69,112,F,Other Race,Spanish/Hispanic,6,Elective,Home or Self Care,2019,FAC006,ENCOUNTER FOR ANTINEOPLASTIC THERAPIES,ADM012,CHEMOTHERAPY,695,CHEMOTHERAPY FOR ACUTE LEUKEMIA,17,"MYELOPROLIFERATIVE DISEASES AND DISORDERS, AND POORLY DIFFERENTIATED NEOPLASM",3,Major,Moderate,Medical,Medicaid,,,,,false,51883.54,34481.8
New York City,Manhattan,7002001,001438,Bellevue Hospital Center,50 to 69,112,F,Other Race,Spanish/Hispanic,7,Elective,Home or Self Care,2019,FAC006,ENCOUNTER FOR ANTINEOPLASTIC THERAPIES,ADM012,CHEMOTHERAPY,695,CHEMOTHERAPY FOR ACUTE LEUKEMIA,17,"MYELOPROLIFERATIVE DISEASES AND DISORDERS, AND POORLY DIFFERENTIATED NEOPLASM",2,Moderate,Moderate,Medical,Medicaid,,,,,false,56891.76,37810.26
New York City,Manhattan,7002001,001438,Bellevue Hospital Center,50 to 69,112,F,Other Race,Spanish/Hispanic,5,Elective,Home or Self Care,2019,FAC006,ENCOUNTER FOR ANTINEOPLASTIC THERAPIES,ADM012,CHEMOTHERAPY,695,CHEMOTHERAPY FOR ACUTE LEUKEMIA,17,"MYELOPROLIFERATIVE DISEASES AND DISORDERS, AND POORLY DIFFERENTIATED NEOPLASM",3,Major,Moderate,Medical,Medicaid,,,,,false,41044.05,27277.88
New York City,Manhattan,7002001,001438,Bellevue Hospital Center,50 to 69,112,F,Other Race,Spanish/Hispanic,1,Urgent,Home or Self Care,2019,FAC006,ENCOUNTER FOR ANTINEOPLASTIC THERAPIES,ADM017,ADMINISTRATION OF NUTRITIONAL AND ELECTROLYTIC SUBSTANCES,695,CHEMOTHERAPY FOR ACUTE LEUKEMIA,17,"MYELOPROLIFERATIVE DISEASES AND DISORDERS, AND POORLY DIFFERENTIATED NEOPLASM",4,Extreme,Moderate,Medical,Medicaid,,,,,false,7020.6,4665.89
New York City,Manhattan,7002001,001438,Bellevue Hospital Center,50 to 69,112,F,Other Race,Spanish/Hispanic,6,Elective,Home or Self Care,2019,FAC006,ENCOUNTER FOR ANTINEOPLASTIC THERAPIES,ADM012,CHEMOTHERAPY,695,CHEMOTHERAPY FOR ACUTE LEUKEMIA,17,"MYELOPROLIFERATIVE DISEASES AND DISORDERS, AND POORLY DIFFERENTIATED NEOPLASM",4,Extreme,Moderate,Medical,Medicaid,,,,,false,50931.21,33848.88
New York City,Manhattan,7002001,001438,Bellevue Hospital Center,30 to 49,113,M,Other Race,Unknown,7,Elective,Court/Law Enforcement,2019,FAC006,ENCOUNTER FOR ANTINEOPLASTIC THERAPIES,ADM012,CHEMOTHERAPY,695,CHEMOTHERAPY FOR ACUTE LEUKEMIA,17,"MYELOPROLIFERATIVE DISEASES AND DISORDERS, AND POORLY DIFFERENTIATED NEOPLASM",3,Major,Minor,Medical,Medicaid,,,,,false,46369.68,30817.29
New York City,Manhattan,7002001,001438,Bellevue Hospital Center,30 to 49,113,M,Other Race,Unknown,1,Elective,Court/Law Enforcement,2019,FAC006,ENCOUNTER FOR ANTINEOPLASTIC THERAPIES,ADM012,CHEMOTHERAPY,695,CHEMOTHERAPY FOR ACUTE LEUKEMIA,17,"MYELOPROLIFERATIVE DISEASES AND DISORDERS, AND POORLY DIFFERENTIATED NEOPLASM",3,Major,Moderate,Medical,Medicaid,,,,,false,13998.3,9303.27
New York City,Manhattan,7002001,001438,Bellevue Hospital Center,30 to 49,113,M,Other Race,Unknown,3,Elective,Court/Law Enforcement,2019,FAC006,ENCOUNTER FOR ANTINEOPLASTIC THERAPIES,CAR024,VENOUS AND ARTERIAL CATHETER PLACEMENT,695,CHEMOTHERAPY FOR ACUTE LEUKEMIA,17,"MYELOPROLIFERATIVE DISEASES AND DISORDERS, AND POORLY DIFFERENTIATED NEOPLASM",3,Major,Moderate,Medical,Medicaid,,,,,false,23881.78,15871.83
New York City,Manhattan,7002001,001438,Bellevue Hospital Center,30 to 49,113,M,Other Race,Unknown,1,Urgent,Court/Law Enforcement,2019,FAC006,ENCOUNTER FOR ANTINEOPLASTIC THERAPIES,ADM012,CHEMOTHERAPY,695,CHEMOTHERAPY FOR ACUTE LEUKEMIA,17,"MYELOPROLIFERATIVE DISEASES AND DISORDERS, AND POORLY DIFFERENTIATED NEOPLASM",2,Moderate,Minor,Medical,Medicaid,,,,,false,7495.91,4981.78
New York City,Manhattan,7002001,001438,Bellevue Hospital Center,30 to 49,113,M,Other Race,Unknown,4,Elective,Home or Self Care,2019,FAC006,ENCOUNTER FOR ANTINEOPLASTIC THERAPIES,ADM012,CHEMOTHERAPY,695,CHEMOTHERAPY FOR ACUTE LEUKEMIA,17,"MYELOPROLIFERATIVE DISEASES AND DISORDERS, AND POORLY DIFFERENTIATED NEOPLASM",2,Moderate,Minor,Medical,Medicaid,,,,,false,25387.97,16872.84
New York City,Manhattan,7002001,001438,Bellevue Hospital Center,30 to 49,113,M,Other Race,Unknown,2,Elective,Court/Law Enforcement,2019,FAC006,ENCOUNTER FOR ANTINEOPLASTIC THERAPIES,ADM012,CHEMOTHERAPY,695,CHEMOTHERAPY FOR ACUTE LEUKEMIA,17,"MYELOPROLIFERATIVE DISEASES AND DISORDERS, AND POORLY DIFFERENTIATED NEOPLASM",3,Major,Minor,Medical,Medicaid,,,,,false,12763.99,8482.95
