Hospital Service Area,Hospital County,Operating Certificate Number,Permanent Facility Id,Facility Name,Age Group,Zip Code - 3 digits,Gender,Race,Ethnicity,Length of Stay,Type of Admission,Patient Disposition,Discharge Year,CCS Diagnosis Code,CCS Diagnosis Description,CCS Procedure Code,CCS Procedure Description,APR DRG Code,APR DRG Description,APR MDC Code,APR MDC Description,APR Severity of Illness Code,APR Severity of Illness Description,APR Risk of Mortality,APR Medical Surgical Description,Payment Typology 1,Payment Typology 2,Payment Typology 3,Birth Weight,Abortion Edit Indicator,Emergency Department Indicator,Total Charges,Total Costs
Long Island,Nassau,2908000,000511,NYU Langone Hospital-Long Island,0 to 17,115,M,Black/African American,Not Span/Hispanic,3,Elective,Home w/ Home Health Services,2020,FAC006,ENCOUNTER FOR ANTINEOPLASTIC THERAPIES,CAR024,VENOUS AND ARTERIAL CATHETER PLACEMENT,696,OTHER CHEMOTHERAPY,17,"MYELOPROLIFERATIVE DISEASES AND DISORDERS, AND POORLY DIFFERENTIATED NEOPLASM",2,Moderate,Moderate,Medical,Private Health Insurance,,,,,N,120875.34,11030.29
Long Island,Nassau,2908000,000511,NYU Langone Hospital-Long Island,0 to 17,115,M,Black/African American,Not Span/Hispanic,4,Elective,Home or Self Care,2020,FAC006,ENCOUNTER FOR ANTINEOPLASTIC THERAPIES,ADM012,CHEMOTHERAPY,696,OTHER CHEMOTHERAPY,17,"MYELOPROLIFERATIVE DISEASES AND DISORDERS, AND POORLY DIFFERENTIATED NEOPLASM",2,Moderate,Moderate,Medical,Private Health Insurance,,,,,N,77809.11,11294.38
Long Island,Nassau,2908000,000511,NYU Langone Hospital-Long Island,0 to 17,115,M,Black/African American,Not Span/Hispanic,2,Urgent,Home w/ Home Health Services,2020,FAC006,ENCOUNTER FOR ANTINEOPLASTIC THERAPIES,ADM012,CHEMOTHERAPY,696,OTHER CHEMOTHERAPY,17,"MYELOPROLIFERATIVE DISEASES AND DISORDERS, AND POORLY DIFFERENTIATED NEOPLASM",2,Moderate,Moderate,Medical,Private Health Insurance,,,,,N,54384.41,6102.03
Long Island,Nassau,2908000,000511,NYU Langone Hospital-Long Island,70 or Older,110,M,White,Spanish/Hispanic,2,Elective,Home or Self Care,2020,FAC006,ENCOUNTER FOR ANTINEOPLASTIC THERAPIES,ADM012,CHEMOTHERAPY,696,OTHER CHEMOTHERAPY,17,"MYELOPROLIFERATIVE DISEASES AND DISORDERS, AND POORLY DIFFERENTIATED NEOPLASM",3,Major,Moderate,Medical,Medicare,,,,,N,26419.16,7053.52
Long Island,Nassau,2908000,000511,NYU Langone Hospital-Long Island,0 to 17,115,M,Black/African American,Spanish/Hispanic,1,Elective,Home or Self Care,2020,FAC006,ENCOUNTER FOR ANTINEOPLASTIC THERAPIES,ADM012,CHEMOTHERAPY,696,OTHER CHEMOTHERAPY,17,"MYELOPROLIFERATIVE DISEASES AND DISORDERS, AND POORLY DIFFERENTIATED NEOPLASM",2,Moderate,Moderate,Medical,Medicaid,,,,,N,38865.66,3474.61
Long Island,Nassau,2908000,000511,NYU Langone Hospital-Long Island,50 to 69,112,M,Other Race,Not Span/Hispanic,6,Urgent,Home or Self Care,2020,FAC006,ENCOUNTER FOR ANTINEOPLASTIC THERAPIES,ADM012,CHEMOTHERAPY,696,OTHER CHEMOTHERAPY,17,"MYELOPROLIFERATIVE DISEASES AND DISORDERS, AND POORLY DIFFERENTIATED NEOPLASM",2,Moderate,Major,Medical,Medicaid,,,,,N,77972.26,20863.73
Long Island,Nassau,2908000,000511,NYU Langone Hospital-Long Island,0 to 17,115,M,Black/African American,Not Span/Hispanic,2,Elective,Home w/ Home Health Services,2020,FAC006,ENCOUNTER FOR ANTINEOPLASTIC THERAPIES,ADM012,CHEMOTHERAPY,696,OTHER CHEMOTHERAPY,17,"MYELOPROLIFERATIVE DISEASES AND DISORDERS, AND POORLY DIFFERENTIATED NEOPLASM",2,Moderate,Moderate,Medical,Private Health Insurance,,,,,N,99738.62,8197.53
Long Island,Nassau,2908000,000511,NYU Langone Hospital-Long Island,0 to 17,117,F,Other Race,Spanish/Hispanic,4,Elective,Home or Self Care,2020,FAC006,ENCOUNTER FOR ANTINEOPLASTIC THERAPIES,ADM012,CHEMOTHERAPY,696,OTHER CHEMOTHERAPY,17,"MYELOPROLIFERATIVE DISEASES AND DISORDERS, AND POORLY DIFFERENTIATED NEOPLASM",3,Major,Moderate,Medical,Medicaid,,,,,N,172836.88,23561.76
Long Island,Nassau,2908000,000511,NYU Langone Hospital-Long Island,0 to 17,115,M,Black/African American,Not Span/Hispanic,3,Elective,Home or Self Care,2020,FAC006,ENCOUNTER FOR ANTINEOPLASTIC THERAPIES,ADM012,CHEMOTHERAPY,696,OTHER CHEMOTHERAPY,17,"MYELOPROLIFERATIVE DISEASES AND DISORDERS, AND POORLY DIFFERENTIATED NEOPLASM",2,Moderate,Moderate,Medical,Private Health Insurance,,,,,N,65737.14,8439.13
Long Island,Nassau,2908000,000511,NYU Langone Hospital-Long Island,0 to 17,115,M,Black/African American,Not Span/Hispanic,3,Elective,Home or Self Care,2020,FAC006,ENCOUNTER FOR ANTINEOPLASTIC THERAPIES,ADM012,CHEMOTHERAPY,696,OTHER CHEMOTHERAPY,17,"MYELOPROLIFERATIVE DISEASES AND DISORDERS, AND POORLY DIFFERENTIATED NEOPLASM",2,Moderate,Moderate,Medical,Private Health Insurance,,,,,N,90305.3,10015.86
Long Island,Nassau,2908000,000511,NYU Langone Hospital-Long Island,50 to 69,112,M,Other Race,Not Span/Hispanic,3,Elective,Home or Self Care,2020,FAC006,ENCOUNTER FOR ANTINEOPLASTIC THERAPIES,ADM012,CHEMOTHERAPY,696,OTHER CHEMOTHERAPY,17,"MYELOPROLIFERATIVE DISEASES AND DISORDERS, AND POORLY DIFFERENTIATED NEOPLASM",2,Moderate,Moderate,Medical,Medicaid,,,,,N,32794.66,10175.21
Long Island,Nassau,2908000,000511,NYU Langone Hospital-Long Island,50 to 69,112,M,Other Race,Not Span/Hispanic,3,Elective,Home or Self Care,2020,FAC006,ENCOUNTER FOR ANTINEOPLASTIC THERAPIES,ADM012,CHEMOTHERAPY,696,OTHER CHEMOTHERAPY,17,"MYELOPROLIFERATIVE DISEASES AND DISORDERS, AND POORLY DIFFERENTIATED NEOPLASM",2,Moderate,Moderate,Medical,Medicaid,,,,,N,30253.37,9708.56
Long Island,Nassau,2908000,000511,NYU Langone Hospital-Long Island,0 to 17,115,M,Black/African American,Spanish/Hispanic,1,Elective,Home or Self Care,2020,FAC006,ENCOUNTER FOR ANTINEOPLASTIC THERAPIES,ADM012,CHEMOTHERAPY,696,OTHER CHEMOTHERAPY,17,"MYELOPROLIFERATIVE DISEASES AND DISORDERS, AND POORLY DIFFERENTIATED NEOPLASM",2,Moderate,Moderate,Medical,Medicaid,,,,,N,37893.21,3388.39
Long Island,Nassau,2908000,000511,NYU Langone Hospital-Long Island,50 to 69,112,M,Other Race,Not Span/Hispanic,3,Elective,Home or Self Care,2020,FAC006,ENCOUNTER FOR ANTINEOPLASTIC THERAPIES,MAM011,ELECTROENCEPHALOGRAM (EEG),696,OTHER CHEMOTHERAPY,17,"MYELOPROLIFERATIVE DISEASES AND DISORDERS, AND POORLY DIFFERENTIATED NEOPLASM",3,Major,Extreme,Medical,Medicaid,,,,,N,64004.93,11486.38
Long Island,Nassau,2908000,000511,NYU Langone Hospital-Long Island,50 to 69,112,M,Other Race,Not Span/Hispanic,3,Elective,Home or Self Care,2020,FAC006,ENCOUNTER FOR ANTINEOPLASTIC THERAPIES,ADM012,CHEMOTHERAPY,696,OTHER CHEMOTHERAPY,17,"MYELOPROLIFERATIVE DISEASES AND DISORDERS, AND POORLY DIFFERENTIATED NEOPLASM",3,Major,Major,Medical,Medicaid,,,,,N,41537.32,14326.98
Long Island,Nassau,2908000,000511,NYU Langone Hospital-Long Island,50 to 69,117,M,White,Not Span/Hispanic,10,Emergency,Skilled Nursing Home,2020,FAC006,ENCOUNTER FOR ANTINEOPLASTIC THERAPIES,ADM012,CHEMOTHERAPY,696,OTHER CHEMOTHERAPY,17,"MYELOPROLIFERATIVE DISEASES AND DISORDERS, AND POORLY DIFFERENTIATED NEOPLASM",4,Extreme,Major,Medical,Private Health Insurance,,,,,N,171947.57,50620.27
Long Island,Nassau,2908000,000511,NYU Langone Hospital-Long Island,50 to 69,117,M,White,Not Span/Hispanic,8,Elective,Skilled Nursing Home,2020,FAC006,ENCOUNTER FOR ANTINEOPLASTIC THERAPIES,ESA004,NON-INVASIVE VENTILATION,696,OTHER CHEMOTHERAPY,17,"MYELOPROLIFERATIVE DISEASES AND DISORDERS, AND POORLY DIFFERENTIATED NEOPLASM",4,Extreme,Major,Medical,Private Health Insurance,,,,,N,99536.68,38392.73
Long Island,Nassau,2908000,000511,NYU Langone Hospital-Long Island,0 to 17,115,M,Black/African American,Not Span/Hispanic,3,Elective,Home or Self Care,2020,FAC006,ENCOUNTER FOR ANTINEOPLASTIC THERAPIES,ADM012,CHEMOTHERAPY,696,OTHER CHEMOTHERAPY,17,"MYELOPROLIFERATIVE DISEASES AND DISORDERS, AND POORLY DIFFERENTIATED NEOPLASM",2,Moderate,Moderate,Medical,Private Health Insurance,,,,,N,61539.77,10423.18
Long Island,Nassau,2908000,000511,NYU Langone Hospital-Long Island,70 or Older,110,F,White,Not Span/Hispanic,6,Elective,Skilled Nursing Home,2020,FAC006,ENCOUNTER FOR ANTINEOPLASTIC THERAPIES,ADM012,CHEMOTHERAPY,696,OTHER CHEMOTHERAPY,17,"MYELOPROLIFERATIVE DISEASES AND DISORDERS, AND POORLY DIFFERENTIATED NEOPLASM",4,Extreme,Extreme,Medical,Medicare,Blue Cross/Blue Shield,,,,N,98530.27,29782.67
Long Island,Nassau,2908000,000511,NYU Langone Hospital-Long Island,0 to 17,115,M,Black/African American,Not Span/Hispanic,4,Elective,Home or Self Care,2020,FAC006,ENCOUNTER FOR ANTINEOPLASTIC THERAPIES,ADM012,CHEMOTHERAPY,696,OTHER CHEMOTHERAPY,17,"MYELOPROLIFERATIVE DISEASES AND DISORDERS, AND POORLY DIFFERENTIATED NEOPLASM",2,Moderate,Moderate,Medical,Private Health Insurance,,,,,N,74537.38,14468.42
Long Island,Nassau,2908000,000511,NYU Langone Hospital-Long Island,70 or Older,110,F,White,Not Span/Hispanic,5,Elective,Skilled Nursing Home,2020,FAC006,ENCOUNTER FOR ANTINEOPLASTIC THERAPIES,ADM012,CHEMOTHERAPY,696,OTHER CHEMOTHERAPY,17,"MYELOPROLIFERATIVE DISEASES AND DISORDERS, AND POORLY DIFFERENTIATED NEOPLASM",3,Major,Extreme,Medical,Medicare,Blue Cross/Blue Shield,,,,N,82290.17,24632.16
Long Island,Nassau,2908000,000511,NYU Langone Hospital-Long Island,70 or Older,110,F,White,Not Span/Hispanic,4,Elective,Skilled Nursing Home,2020,FAC006,ENCOUNTER FOR ANTINEOPLASTIC THERAPIES,ADM012,CHEMOTHERAPY,696,OTHER CHEMOTHERAPY,17,"MYELOPROLIFERATIVE DISEASES AND DISORDERS, AND POORLY DIFFERENTIATED NEOPLASM",4,Extreme,Major,Medical,Medicare,Blue Cross/Blue Shield,,,,Y,69301.89,20555.91
Long Island,Nassau,2908000,000511,NYU Langone Hospital-Long Island,18 to 29,115,F,Black/African American,Not Span/Hispanic,6,Elective,Home or Self Care,2020,FAC006,ENCOUNTER FOR ANTINEOPLASTIC THERAPIES,ADM012,CHEMOTHERAPY,696,OTHER CHEMOTHERAPY,17,"MYELOPROLIFERATIVE DISEASES AND DISORDERS, AND POORLY DIFFERENTIATED NEOPLASM",2,Moderate,Moderate,Medical,Medicaid,,,,,N,144664.68,21348.19
Long Island,Nassau,2908000,000511,NYU Langone Hospital-Long Island,0 to 17,115,M,Black/African American,Not Span/Hispanic,3,Elective,Home or Self Care,2020,FAC006,ENCOUNTER FOR ANTINEOPLASTIC THERAPIES,ADM012,CHEMOTHERAPY,696,OTHER CHEMOTHERAPY,17,"MYELOPROLIFERATIVE DISEASES AND DISORDERS, AND POORLY DIFFERENTIATED NEOPLASM",2,Moderate,Moderate,Medical,Private Health Insurance,,,,,N,62394.8,14497.36
Long Island,Nassau,2908000,000511,NYU Langone Hospital-Long Island,70 or Older,115,M,White,Not Span/Hispanic,4,Elective,Home or Self Care,2020,FAC006,ENCOUNTER FOR ANTINEOPLASTIC THERAPIES,ADM012,CHEMOTHERAPY,696,OTHER CHEMOTHERAPY,17,"MYELOPROLIFERATIVE DISEASES AND DISORDERS, AND POORLY DIFFERENTIATED NEOPLASM",3,Major,Major,Medical,Medicare,Private Health Insurance,,,,N,67413.9,19846.45
Long Island,Nassau,2908000,000511,NYU Langone Hospital-Long Island,0 to 17,115,M,Black/African American,Not Span/Hispanic,3,Elective,Home or Self Care,2020,FAC006,ENCOUNTER FOR ANTINEOPLASTIC THERAPIES,ADM012,CHEMOTHERAPY,696,OTHER CHEMOTHERAPY,17,"MYELOPROLIFERATIVE DISEASES AND DISORDERS, AND POORLY DIFFERENTIATED NEOPLASM",2,Moderate,Moderate,Medical,Private Health Insurance,,,,,N,52504.83,10052.9
Long Island,Nassau,2908000,000511,NYU Langone Hospital-Long Island,18 to 29,115,F,Black/African American,Not Span/Hispanic,4,Elective,Home w/ Home Health Services,2020,FAC006,ENCOUNTER FOR ANTINEOPLASTIC THERAPIES,ADM012,CHEMOTHERAPY,696,OTHER CHEMOTHERAPY,17,"MYELOPROLIFERATIVE DISEASES AND DISORDERS, AND POORLY DIFFERENTIATED NEOPLASM",2,Moderate,Moderate,Medical,Medicaid,,,,,N,83944.4,15066.28
Long Island,Nassau,2908000,000511,NYU Langone Hospital-Long Island,30 to 49,115,M,Other Race,Spanish/Hispanic,4,Emergency,Home or Self Care,2020,FAC006,ENCOUNTER FOR ANTINEOPLASTIC THERAPIES,ADM012,CHEMOTHERAPY,696,OTHER CHEMOTHERAPY,17,"MYELOPROLIFERATIVE DISEASES AND DISORDERS, AND POORLY DIFFERENTIATED NEOPLASM",2,Moderate,Moderate,Medical,Medicaid,,,,,Y,84792.55,20926.49
Long Island,Nassau,2908000,000511,NYU Langone Hospital-Long Island,0 to 17,115,M,Black/African American,Not Span/Hispanic,2,Elective,Home w/ Home Health Services,2020,FAC006,ENCOUNTER FOR ANTINEOPLASTIC THERAPIES,ADM012,CHEMOTHERAPY,696,OTHER CHEMOTHERAPY,17,"MYELOPROLIFERATIVE DISEASES AND DISORDERS, AND POORLY DIFFERENTIATED NEOPLASM",3,Major,Major,Medical,Medicare,,,,,N,94059.67,10033.5
Long Island,Nassau,2908000,000511,NYU Langone Hospital-Long Island,50 to 69,119,M,White,Not Span/Hispanic,2,Elective,Home or Self Care,2020,FAC006,ENCOUNTER FOR ANTINEOPLASTIC THERAPIES,ADM012,CHEMOTHERAPY,696,OTHER CHEMOTHERAPY,17,"MYELOPROLIFERATIVE DISEASES AND DISORDERS, AND POORLY DIFFERENTIATED NEOPLASM",1,Minor,Minor,Medical,Blue Cross/Blue Shield,,,,,N,27605.31,9529.76
Long Island,Nassau,2908000,000511,NYU Langone Hospital-Long Island,18 to 29,115,F,Black/African American,Not Span/Hispanic,5,Elective,Home or Self Care,2020,FAC006,ENCOUNTER FOR ANTINEOPLASTIC THERAPIES,ADM012,CHEMOTHERAPY,696,OTHER CHEMOTHERAPY,17,"MYELOPROLIFERATIVE DISEASES AND DISORDERS, AND POORLY DIFFERENTIATED NEOPLASM",2,Moderate,Moderate,Medical,Medicaid,,,,,N,97582.38,17824.26
Long Island,Nassau,2908000,000511,NYU Langone Hospital-Long Island,70 or Older,115,M,White,Not Span/Hispanic,4,Elective,Home or Self Care,2020,FAC006,ENCOUNTER FOR ANTINEOPLASTIC THERAPIES,ADM012,CHEMOTHERAPY,696,OTHER CHEMOTHERAPY,17,"MYELOPROLIFERATIVE DISEASES AND DISORDERS, AND POORLY DIFFERENTIATED NEOPLASM",3,Major,Major,Medical,Medicare,Private Health Insurance,,,,N,62888.95,19154.49
Long Island,Nassau,2908000,000511,NYU Langone Hospital-Long Island,50 to 69,110,F,White,Not Span/Hispanic,4,Elective,Home or Self Care,2020,FAC006,ENCOUNTER FOR ANTINEOPLASTIC THERAPIES,ADM012,CHEMOTHERAPY,696,OTHER CHEMOTHERAPY,17,"MYELOPROLIFERATIVE DISEASES AND DISORDERS, AND POORLY DIFFERENTIATED NEOPLASM",2,Moderate,Moderate,Medical,Medicare,,,,,N,93205.23,20648.36
Long Island,Nassau,2908000,000511,NYU Langone Hospital-Long Island,70 or Older,110,F,White,Not Span/Hispanic,21,Elective,Skilled Nursing Home,2020,FAC006,ENCOUNTER FOR ANTINEOPLASTIC THERAPIES,MST020,SUBCUTANEOUS TISSUE AND FASCIA EXCISION,696,OTHER CHEMOTHERAPY,17,"MYELOPROLIFERATIVE DISEASES AND DISORDERS, AND POORLY DIFFERENTIATED NEOPLASM",4,Extreme,Extreme,Medical,Medicare,Blue Cross/Blue Shield,,,,N,379005.34,112668.2
Long Island,Nassau,2908000,000511,NYU Langone Hospital-Long Island,70 or Older,115,F,White,Not Span/Hispanic,4,Emergency,Home or Self Care,2020,FAC006,ENCOUNTER FOR ANTINEOPLASTIC THERAPIES,ADM012,CHEMOTHERAPY,696,OTHER CHEMOTHERAPY,17,"MYELOPROLIFERATIVE DISEASES AND DISORDERS, AND POORLY DIFFERENTIATED NEOPLASM",3,Major,Major,Medical,Medicare,Blue Cross/Blue Shield,,,,N,58874.56,19808.49
Long Island,Nassau,2908000,000511,NYU Langone Hospital-Long Island,18 to 29,115,F,Black/African American,Not Span/Hispanic,6,Elective,Home or Self Care,2020,FAC006,ENCOUNTER FOR ANTINEOPLASTIC THERAPIES,ADM012,CHEMOTHERAPY,696,OTHER CHEMOTHERAPY,17,"MYELOPROLIFERATIVE DISEASES AND DISORDERS, AND POORLY DIFFERENTIATED NEOPLASM",3,Major,Moderate,Medical,Medicaid,,,,,N,129252.66,20371.07
Long Island,Nassau,2908000,000511,NYU Langone Hospital-Long Island,0 to 17,115,M,Black/African American,Not Span/Hispanic,1,Elective,Home or Self Care,2020,FAC006,ENCOUNTER FOR ANTINEOPLASTIC THERAPIES,ADM012,CHEMOTHERAPY,696,OTHER CHEMOTHERAPY,17,"MYELOPROLIFERATIVE DISEASES AND DISORDERS, AND POORLY DIFFERENTIATED NEOPLASM",3,Major,Moderate,Medical,Medicare,,,,,N,82737.54,6226.77
Long Island,Nassau,2908000,000511,NYU Langone Hospital-Long Island,70 or Older,115,M,White,Not Span/Hispanic,4,Elective,Home or Self Care,2020,FAC006,ENCOUNTER FOR ANTINEOPLASTIC THERAPIES,ADM012,CHEMOTHERAPY,696,OTHER CHEMOTHERAPY,17,"MYELOPROLIFERATIVE DISEASES AND DISORDERS, AND POORLY DIFFERENTIATED NEOPLASM",2,Moderate,Moderate,Medical,Medicare,Private Health Insurance,,,,N,56410.82,19292.53
Long Island,Nassau,2908000,000511,NYU Langone Hospital-Long Island,70 or Older,115,F,White,Not Span/Hispanic,5,Elective,Home or Self Care,2020,FAC006,ENCOUNTER FOR ANTINEOPLASTIC THERAPIES,ADM012,CHEMOTHERAPY,696,OTHER CHEMOTHERAPY,17,"MYELOPROLIFERATIVE DISEASES AND DISORDERS, AND POORLY DIFFERENTIATED NEOPLASM",2,Moderate,Moderate,Medical,Medicare,Blue Cross/Blue Shield,,,,N,67269.7,23598.76
Long Island,Nassau,2908000,000511,NYU Langone Hospital-Long Island,50 to 69,110,F,White,Not Span/Hispanic,6,Elective,Home or Self Care,2020,FAC006,ENCOUNTER FOR ANTINEOPLASTIC THERAPIES,ADM012,CHEMOTHERAPY,696,OTHER CHEMOTHERAPY,17,"MYELOPROLIFERATIVE DISEASES AND DISORDERS, AND POORLY DIFFERENTIATED NEOPLASM",2,Moderate,Moderate,Medical,Medicare,,,,,N,73817.6,27864.21
Long Island,Nassau,2908000,000511,NYU Langone Hospital-Long Island,0 to 17,115,M,Black/African American,Not Span/Hispanic,2,Elective,Home or Self Care,2020,FAC006,ENCOUNTER FOR ANTINEOPLASTIC THERAPIES,ADM012,CHEMOTHERAPY,696,OTHER CHEMOTHERAPY,17,"MYELOPROLIFERATIVE DISEASES AND DISORDERS, AND POORLY DIFFERENTIATED NEOPLASM",2,Moderate,Moderate,Medical,Medicare,,,,,N,86563.26,9019.24
Long Island,Nassau,2908000,000511,NYU Langone Hospital-Long Island,50 to 69,119,M,White,Not Span/Hispanic,2,Elective,Home or Self Care,2020,FAC006,ENCOUNTER FOR ANTINEOPLASTIC THERAPIES,ADM012,CHEMOTHERAPY,696,OTHER CHEMOTHERAPY,17,"MYELOPROLIFERATIVE DISEASES AND DISORDERS, AND POORLY DIFFERENTIATED NEOPLASM",2,Moderate,Minor,Medical,Blue Cross/Blue Shield,,,,,N,26832.29,9663.71
Long Island,Nassau,2908000,000511,NYU Langone Hospital-Long Island,18 to 29,115,F,Black/African American,Not Span/Hispanic,5,Elective,Home or Self Care,2020,FAC006,ENCOUNTER FOR ANTINEOPLASTIC THERAPIES,ADM012,CHEMOTHERAPY,696,OTHER CHEMOTHERAPY,17,"MYELOPROLIFERATIVE DISEASES AND DISORDERS, AND POORLY DIFFERENTIATED NEOPLASM",2,Moderate,Moderate,Medical,Medicaid,,,,,N,91559.48,16803.75
Long Island,Nassau,2908000,000511,NYU Langone Hospital-Long Island,70 or Older,115,M,White,Not Span/Hispanic,4,Elective,Home w/ Home Health Services,2020,FAC006,ENCOUNTER FOR ANTINEOPLASTIC THERAPIES,,,696,OTHER CHEMOTHERAPY,17,"MYELOPROLIFERATIVE DISEASES AND DISORDERS, AND POORLY DIFFERENTIATED NEOPLASM",2,Moderate,Moderate,Medical,Medicare,Private Health Insurance,,,,N,50990.99,18689.58
Long Island,Nassau,2908000,000511,NYU Langone Hospital-Long Island,70 or Older,115,F,White,Not Span/Hispanic,5,Elective,Home or Self Care,2020,FAC006,ENCOUNTER FOR ANTINEOPLASTIC THERAPIES,ADM012,CHEMOTHERAPY,696,OTHER CHEMOTHERAPY,17,"MYELOPROLIFERATIVE DISEASES AND DISORDERS, AND POORLY DIFFERENTIATED NEOPLASM",2,Moderate,Moderate,Medical,Medicare,Blue Cross/Blue Shield,,,,N,66259.5,23762.73
Long Island,Nassau,2908000,000511,NYU Langone Hospital-Long Island,0 to 17,117,M,White,Not Span/Hispanic,1,Urgent,Home or Self Care,2020,FAC006,ENCOUNTER FOR ANTINEOPLASTIC THERAPIES,ADM012,CHEMOTHERAPY,696,OTHER CHEMOTHERAPY,17,"MYELOPROLIFERATIVE DISEASES AND DISORDERS, AND POORLY DIFFERENTIATED NEOPLASM",2,Moderate,Moderate,Medical,Private Health Insurance,,,,,N,77919.08,6196.93
Long Island,Nassau,2908000,000511,NYU Langone Hospital-Long Island,18 to 29,115,F,Black/African American,Not Span/Hispanic,5,Elective,Home or Self Care,2020,FAC006,ENCOUNTER FOR ANTINEOPLASTIC THERAPIES,ADM001,TRANSFUSION OF BLOOD AND BLOOD PRODUCTS,696,OTHER CHEMOTHERAPY,17,"MYELOPROLIFERATIVE DISEASES AND DISORDERS, AND POORLY DIFFERENTIATED NEOPLASM",3,Major,Major,Medical,Medicaid,,,,,N,90108.59,18148.62
Long Island,Nassau,2908000,000511,NYU Langone Hospital-Long Island,70 or Older,115,M,White,Not Span/Hispanic,4,Elective,Home w/ Home Health Services,2020,FAC006,ENCOUNTER FOR ANTINEOPLASTIC THERAPIES,ADM012,CHEMOTHERAPY,696,OTHER CHEMOTHERAPY,17,"MYELOPROLIFERATIVE DISEASES AND DISORDERS, AND POORLY DIFFERENTIATED NEOPLASM",2,Moderate,Moderate,Medical,Medicare,Private Health Insurance,,,,N,55285.42,19063.36
Long Island,Nassau,2908000,000511,NYU Langone Hospital-Long Island,50 to 69,110,F,White,Not Span/Hispanic,7,Elective,Home w/ Home Health Services,2020,FAC006,ENCOUNTER FOR ANTINEOPLASTIC THERAPIES,ADM012,CHEMOTHERAPY,696,OTHER CHEMOTHERAPY,17,"MYELOPROLIFERATIVE DISEASES AND DISORDERS, AND POORLY DIFFERENTIATED NEOPLASM",2,Moderate,Major,Medical,Medicare,,,,,N,100766.03,33668.65
Long Island,Nassau,2908000,000511,NYU Langone Hospital-Long Island,50 to 69,110,F,White,Not Span/Hispanic,6,Elective,Home w/ Home Health Services,2020,FAC006,ENCOUNTER FOR ANTINEOPLASTIC THERAPIES,ADM012,CHEMOTHERAPY,696,OTHER CHEMOTHERAPY,17,"MYELOPROLIFERATIVE DISEASES AND DISORDERS, AND POORLY DIFFERENTIATED NEOPLASM",2,Moderate,Moderate,Medical,Medicare,,,,,N,73836.24,27909.55
Long Island,Nassau,2908000,000511,NYU Langone Hospital-Long Island,70 or Older,115,F,White,Not Span/Hispanic,7,Elective,Home or Self Care,2020,FAC006,ENCOUNTER FOR ANTINEOPLASTIC THERAPIES,ADM012,CHEMOTHERAPY,696,OTHER CHEMOTHERAPY,17,"MYELOPROLIFERATIVE DISEASES AND DISORDERS, AND POORLY DIFFERENTIATED NEOPLASM",2,Moderate,Moderate,Medical,Medicare,Blue Cross/Blue Shield,,,,N,88338.68,32901.91
Long Island,Nassau,2908000,000511,NYU Langone Hospital-Long Island,70 or Older,115,M,White,Not Span/Hispanic,4,Elective,Home or Self Care,2020,FAC006,ENCOUNTER FOR ANTINEOPLASTIC THERAPIES,ADM012,CHEMOTHERAPY,696,OTHER CHEMOTHERAPY,17,"MYELOPROLIFERATIVE DISEASES AND DISORDERS, AND POORLY DIFFERENTIATED NEOPLASM",2,Moderate,Moderate,Medical,Medicare,Private Health Insurance,,,,N,53205.27,18920.57
Long Island,Nassau,2908000,000511,NYU Langone Hospital-Long Island,50 to 69,119,M,White,Not Span/Hispanic,2,Elective,Home or Self Care,2020,FAC006,ENCOUNTER FOR ANTINEOPLASTIC THERAPIES,OTR004,ISOLATION PROCEDURES,696,OTHER CHEMOTHERAPY,17,"MYELOPROLIFERATIVE DISEASES AND DISORDERS, AND POORLY DIFFERENTIATED NEOPLASM",2,Moderate,Minor,Medical,Blue Cross/Blue Shield,,,,,N,24496.51,9290.65
Long Island,Nassau,2908000,000511,NYU Langone Hospital-Long Island,50 to 69,117,M,Other Race,Spanish/Hispanic,5,Elective,Home or Self Care,2020,FAC006,ENCOUNTER FOR ANTINEOPLASTIC THERAPIES,ADM012,CHEMOTHERAPY,696,OTHER CHEMOTHERAPY,17,"MYELOPROLIFERATIVE DISEASES AND DISORDERS, AND POORLY DIFFERENTIATED NEOPLASM",2,Moderate,Moderate,Medical,Medicare,Medicaid,,,,N,74253.66,32071.68
Long Island,Nassau,2908000,000511,NYU Langone Hospital-Long Island,50 to 69,110,F,White,Not Span/Hispanic,7,Elective,Home or Self Care,2020,FAC006,ENCOUNTER FOR ANTINEOPLASTIC THERAPIES,ADM012,CHEMOTHERAPY,696,OTHER CHEMOTHERAPY,17,"MYELOPROLIFERATIVE DISEASES AND DISORDERS, AND POORLY DIFFERENTIATED NEOPLASM",2,Moderate,Moderate,Medical,Medicare,,,,,N,82874.03,32165.05
Long Island,Nassau,2908000,000511,NYU Langone Hospital-Long Island,0 to 17,115,M,Black/African American,Not Span/Hispanic,2,Elective,Home or Self Care,2020,FAC006,ENCOUNTER FOR ANTINEOPLASTIC THERAPIES,ADM012,CHEMOTHERAPY,696,OTHER CHEMOTHERAPY,17,"MYELOPROLIFERATIVE DISEASES AND DISORDERS, AND POORLY DIFFERENTIATED NEOPLASM",3,Major,Major,Medical,Medicare,,,,,N,91194.22,9906.49
Long Island,Nassau,2908000,000511,NYU Langone Hospital-Long Island,70 or Older,115,M,White,Not Span/Hispanic,4,Elective,Home or Self Care,2020,FAC006,ENCOUNTER FOR ANTINEOPLASTIC THERAPIES,OTR004,ISOLATION PROCEDURES,696,OTHER CHEMOTHERAPY,17,"MYELOPROLIFERATIVE DISEASES AND DISORDERS, AND POORLY DIFFERENTIATED NEOPLASM",2,Moderate,Moderate,Medical,Medicare,Private Health Insurance,,,,N,52896.5,18991
