Hospital Service Area,Hospital County,Operating Certificate Number,Permanent Facility Id,Facility Name,Age Group,Zip Code - 3 digits,Gender,Race,Ethnicity,Length of Stay,Type of Admission,Patient Disposition,Discharge Year,CCS Diagnosis Code,CCS Diagnosis Description,CCS Procedure Code,CCS Procedure Description,APR DRG Code,APR DRG Description,APR MDC Code,APR MDC Description,APR Severity of Illness Code,APR Severity of Illness Description,APR Risk of Mortality,APR Medical Surgical Description,Payment Typology 1,Payment Typology 2,Payment Typology 3,Birth Weight,Abortion Edit Indicator,Emergency Department Indicator,Total Charges,Total Costs
New York City,Manhattan,7002053,001463,NYU Langone Hospitals,30 to 49,112,F,White,Not Span/Hispanic,21,Emergency,Home or Self Care,2019,NEO064,LEUKEMIA - ALL OTHER TYPES,ADM011,"ADMINISTRATION AND TRANSFUSION OF BONE MARROW, STEM CELLS, PANCREATIC ISLET CELLS, AND T-CELLS",007,ALLOGENEIC BONE MARROW TRANSPLANT,17,"MYELOPROLIFERATIVE DISEASES AND DISORDERS, AND POORLY DIFFERENTIATED NEOPLASM",3,Major,Moderate,Surgical,Medicare,Medicaid,,,,false,529327.54,94758.48
New York City,Manhattan,7002053,001463,NYU Langone Hospitals,50 to 69,,F,Other Race,Not Span/Hispanic,23,Elective,Home or Self Care,2019,NEO060,LEUKEMIA - ACUTE MYELOID LEUKEMIA (AML),ADM011,"ADMINISTRATION AND TRANSFUSION OF BONE MARROW, STEM CELLS, PANCREATIC ISLET CELLS, AND T-CELLS",007,ALLOGENEIC BONE MARROW TRANSPLANT,17,"MYELOPROLIFERATIVE DISEASES AND DISORDERS, AND POORLY DIFFERENTIATED NEOPLASM",4,Extreme,Major,Surgical,Medicare,Medicaid,,,,false,351089.64,92556.8
New York City,Manhattan,7002053,001463,NYU Langone Hospitals,70 or Older,,F,Black/African American,Unknown,54,Elective,Hospice - Home,2019,NEO064,LEUKEMIA - ALL OTHER TYPES,ADM011,"ADMINISTRATION AND TRANSFUSION OF BONE MARROW, STEM CELLS, PANCREATIC ISLET CELLS, AND T-CELLS",007,ALLOGENEIC BONE MARROW TRANSPLANT,17,"MYELOPROLIFERATIVE DISEASES AND DISORDERS, AND POORLY DIFFERENTIATED NEOPLASM",4,Extreme,Major,Surgical,Medicaid,,,,,false,1068011.64,245509.97
New York City,Manhattan,7002053,001463,NYU Langone Hospitals,30 to 49,115,M,White,Not Span/Hispanic,23,Elective,Home or Self Care,2019,NEO064,LEUKEMIA - ALL OTHER TYPES,ADM011,"ADMINISTRATION AND TRANSFUSION OF BONE MARROW, STEM CELLS, PANCREATIC ISLET CELLS, AND T-CELLS",007,ALLOGENEIC BONE MARROW TRANSPLANT,17,"MYELOPROLIFERATIVE DISEASES AND DISORDERS, AND POORLY DIFFERENTIATED NEOPLASM",3,Major,Minor,Surgical,Private Health Insurance,,,,,false,474153.81,133000.82
New York City,Manhattan,7002053,001463,NYU Langone Hospitals,70 or Older,110,F,White,Not Span/Hispanic,19,Elective,Home or Self Care,2019,NEO068,MYELODYSPLASTIC SYNDROME (MDS),ADM011,"ADMINISTRATION AND TRANSFUSION OF BONE MARROW, STEM CELLS, PANCREATIC ISLET CELLS, AND T-CELLS",007,ALLOGENEIC BONE MARROW TRANSPLANT,17,"MYELOPROLIFERATIVE DISEASES AND DISORDERS, AND POORLY DIFFERENTIATED NEOPLASM",3,Major,Moderate,Surgical,Medicare,Blue Cross/Blue Shield,,,,false,494116.25,100979.82
New York City,Manhattan,7002053,001463,NYU Langone Hospitals,50 to 69,113,M,Other Race,Not Span/Hispanic,26,Elective,Home or Self Care,2019,NEO058,NON-HODGKIN LYMPHOMA,ADM011,"ADMINISTRATION AND TRANSFUSION OF BONE MARROW, STEM CELLS, PANCREATIC ISLET CELLS, AND T-CELLS",007,ALLOGENEIC BONE MARROW TRANSPLANT,17,"MYELOPROLIFERATIVE DISEASES AND DISORDERS, AND POORLY DIFFERENTIATED NEOPLASM",3,Major,Moderate,Surgical,Private Health Insurance,,,,,false,840836.2,131464.22
New York City,Manhattan,7002053,001463,NYU Langone Hospitals,30 to 49,112,M,Other Race,Spanish/Hispanic,49,Emergency,Home w/ Home Health Services,2019,NEO059,LEUKEMIA - ACUTE LYMPHOBLASTIC LEUKEMIA (ALL),ADM011,"ADMINISTRATION AND TRANSFUSION OF BONE MARROW, STEM CELLS, PANCREATIC ISLET CELLS, AND T-CELLS",007,ALLOGENEIC BONE MARROW TRANSPLANT,17,"MYELOPROLIFERATIVE DISEASES AND DISORDERS, AND POORLY DIFFERENTIATED NEOPLASM",4,Extreme,Major,Surgical,Private Health Insurance,,,,,false,2339617.96,289715.59
New York City,Manhattan,7002053,001463,NYU Langone Hospitals,70 or Older,110,F,White,Not Span/Hispanic,19,Elective,Home or Self Care,2019,NEO068,MYELODYSPLASTIC SYNDROME (MDS),ADM011,"ADMINISTRATION AND TRANSFUSION OF BONE MARROW, STEM CELLS, PANCREATIC ISLET CELLS, AND T-CELLS",007,ALLOGENEIC BONE MARROW TRANSPLANT,17,"MYELOPROLIFERATIVE DISEASES AND DISORDERS, AND POORLY DIFFERENTIATED NEOPLASM",3,Major,Moderate,Surgical,Medicare,Blue Cross/Blue Shield,,,,false,502507.13,106506.25
New York City,Manhattan,7002053,001463,NYU Langone Hospitals,30 to 49,117,M,White,Not Span/Hispanic,22,Elective,Home or Self Care,2019,NEO059,LEUKEMIA - ACUTE LYMPHOBLASTIC LEUKEMIA (ALL),ADM011,"ADMINISTRATION AND TRANSFUSION OF BONE MARROW, STEM CELLS, PANCREATIC ISLET CELLS, AND T-CELLS",007,ALLOGENEIC BONE MARROW TRANSPLANT,17,"MYELOPROLIFERATIVE DISEASES AND DISORDERS, AND POORLY DIFFERENTIATED NEOPLASM",3,Major,Moderate,Surgical,Blue Cross/Blue Shield,Medicaid,,,,false,418891.72,104158.23
New York City,Manhattan,7002053,001463,NYU Langone Hospitals,70 or Older,117,M,White,Not Span/Hispanic,24,Elective,Home or Self Care,2019,NEO068,MYELODYSPLASTIC SYNDROME (MDS),ADM011,"ADMINISTRATION AND TRANSFUSION OF BONE MARROW, STEM CELLS, PANCREATIC ISLET CELLS, AND T-CELLS",007,ALLOGENEIC BONE MARROW TRANSPLANT,17,"MYELOPROLIFERATIVE DISEASES AND DISORDERS, AND POORLY DIFFERENTIATED NEOPLASM",2,Moderate,Moderate,Surgical,Medicare,Blue Cross/Blue Shield,,,,false,708348.16,102962.05
New York City,Manhattan,7002053,001463,NYU Langone Hospitals,50 to 69,103,M,Other Race,Not Span/Hispanic,25,Elective,Home or Self Care,2019,NEO060,LEUKEMIA - ACUTE MYELOID LEUKEMIA (AML),ADM011,"ADMINISTRATION AND TRANSFUSION OF BONE MARROW, STEM CELLS, PANCREATIC ISLET CELLS, AND T-CELLS",007,ALLOGENEIC BONE MARROW TRANSPLANT,17,"MYELOPROLIFERATIVE DISEASES AND DISORDERS, AND POORLY DIFFERENTIATED NEOPLASM",4,Extreme,Major,Surgical,Medicaid,,,,,false,820273.49,120457.91
New York City,Manhattan,7002053,001463,NYU Langone Hospitals,50 to 69,113,M,White,Not Span/Hispanic,22,Elective,Home w/ Home Health Services,2019,NEO068,MYELODYSPLASTIC SYNDROME (MDS),ADM011,"ADMINISTRATION AND TRANSFUSION OF BONE MARROW, STEM CELLS, PANCREATIC ISLET CELLS, AND T-CELLS",007,ALLOGENEIC BONE MARROW TRANSPLANT,17,"MYELOPROLIFERATIVE DISEASES AND DISORDERS, AND POORLY DIFFERENTIATED NEOPLASM",3,Major,Major,Surgical,Private Health Insurance,,,,,false,760728.47,98508.67
New York City,Manhattan,7002053,001463,NYU Langone Hospitals,30 to 49,112,F,Other Race,Not Span/Hispanic,24,Elective,Home or Self Care,2019,NEO059,LEUKEMIA - ACUTE LYMPHOBLASTIC LEUKEMIA (ALL),ADM011,"ADMINISTRATION AND TRANSFUSION OF BONE MARROW, STEM CELLS, PANCREATIC ISLET CELLS, AND T-CELLS",007,ALLOGENEIC BONE MARROW TRANSPLANT,17,"MYELOPROLIFERATIVE DISEASES AND DISORDERS, AND POORLY DIFFERENTIATED NEOPLASM",3,Major,Moderate,Surgical,Medicaid,,,,,false,464563.1,113396.39
New York City,Manhattan,7002053,001463,NYU Langone Hospitals,30 to 49,114,F,Other Race,Not Span/Hispanic,30,Elective,Home w/ Home Health Services,2019,NEO060,LEUKEMIA - ACUTE MYELOID LEUKEMIA (AML),ADM011,"ADMINISTRATION AND TRANSFUSION OF BONE MARROW, STEM CELLS, PANCREATIC ISLET CELLS, AND T-CELLS",007,ALLOGENEIC BONE MARROW TRANSPLANT,17,"MYELOPROLIFERATIVE DISEASES AND DISORDERS, AND POORLY DIFFERENTIATED NEOPLASM",3,Major,Moderate,Surgical,Private Health Insurance,,,,,false,669204.3,121840.69
New York City,Manhattan,7002053,001463,NYU Langone Hospitals,50 to 69,112,F,White,Not Span/Hispanic,24,Elective,Home or Self Care,2019,NEO060,LEUKEMIA - ACUTE MYELOID LEUKEMIA (AML),ADM011,"ADMINISTRATION AND TRANSFUSION OF BONE MARROW, STEM CELLS, PANCREATIC ISLET CELLS, AND T-CELLS",007,ALLOGENEIC BONE MARROW TRANSPLANT,17,"MYELOPROLIFERATIVE DISEASES AND DISORDERS, AND POORLY DIFFERENTIATED NEOPLASM",3,Major,Moderate,Surgical,Medicare,Medicare,,,,false,682137.74,104008.61
New York City,Manhattan,7002053,001463,NYU Langone Hospitals,50 to 69,112,F,Other Race,Spanish/Hispanic,23,Elective,Home w/ Home Health Services,2019,NEO060,LEUKEMIA - ACUTE MYELOID LEUKEMIA (AML),CAR025,PLACEMENT OF TUNNELED OR IMPLANTABLE PORTION OF A VASCULAR ACCESS DEVICE,007,ALLOGENEIC BONE MARROW TRANSPLANT,17,"MYELOPROLIFERATIVE DISEASES AND DISORDERS, AND POORLY DIFFERENTIATED NEOPLASM",3,Major,Minor,Surgical,Blue Cross/Blue Shield,,,,,false,359038.21,97074.11
New York City,Manhattan,7002053,001463,NYU Langone Hospitals,30 to 49,110,M,White,Not Span/Hispanic,21,Elective,Home or Self Care,2019,NEO058,NON-HODGKIN LYMPHOMA,ADM011,"ADMINISTRATION AND TRANSFUSION OF BONE MARROW, STEM CELLS, PANCREATIC ISLET CELLS, AND T-CELLS",007,ALLOGENEIC BONE MARROW TRANSPLANT,17,"MYELOPROLIFERATIVE DISEASES AND DISORDERS, AND POORLY DIFFERENTIATED NEOPLASM",2,Moderate,Moderate,Surgical,Private Health Insurance,,,,,false,332267.24,85958.19
New York City,Manhattan,7002053,001463,NYU Langone Hospitals,50 to 69,OOS,F,Other Race,Spanish/Hispanic,29,Elective,Home or Self Care,2019,NEO060,LEUKEMIA - ACUTE MYELOID LEUKEMIA (AML),ADM011,"ADMINISTRATION AND TRANSFUSION OF BONE MARROW, STEM CELLS, PANCREATIC ISLET CELLS, AND T-CELLS",007,ALLOGENEIC BONE MARROW TRANSPLANT,17,"MYELOPROLIFERATIVE DISEASES AND DISORDERS, AND POORLY DIFFERENTIATED NEOPLASM",4,Extreme,Moderate,Surgical,Blue Cross/Blue Shield,,,,,false,751325.95,130638.4
New York City,Manhattan,7002053,001463,NYU Langone Hospitals,70 or Older,100,M,White,Spanish/Hispanic,27,Elective,Home or Self Care,2019,NEO068,MYELODYSPLASTIC SYNDROME (MDS),ADM011,"ADMINISTRATION AND TRANSFUSION OF BONE MARROW, STEM CELLS, PANCREATIC ISLET CELLS, AND T-CELLS",007,ALLOGENEIC BONE MARROW TRANSPLANT,17,"MYELOPROLIFERATIVE DISEASES AND DISORDERS, AND POORLY DIFFERENTIATED NEOPLASM",4,Extreme,Major,Surgical,Medicare,Medicare,,,,false,547666.46,124944.76
New York City,Manhattan,7002053,001463,NYU Langone Hospitals,50 to 69,110,F,Black/African American,Not Span/Hispanic,24,Elective,Home or Self Care,2019,NEO065,MULTIPLE MYELOMA,ADM011,"ADMINISTRATION AND TRANSFUSION OF BONE MARROW, STEM CELLS, PANCREATIC ISLET CELLS, AND T-CELLS",007,ALLOGENEIC BONE MARROW TRANSPLANT,17,"MYELOPROLIFERATIVE DISEASES AND DISORDERS, AND POORLY DIFFERENTIATED NEOPLASM",3,Major,Moderate,Surgical,Medicare,Private Health Insurance,,,,false,442589.39,106206.24
New York City,Manhattan,7002053,001463,NYU Langone Hospitals,50 to 69,112,F,Other Race,Not Span/Hispanic,23,Elective,Home or Self Care,2019,NEO064,LEUKEMIA - ALL OTHER TYPES,ADM011,"ADMINISTRATION AND TRANSFUSION OF BONE MARROW, STEM CELLS, PANCREATIC ISLET CELLS, AND T-CELLS",007,ALLOGENEIC BONE MARROW TRANSPLANT,17,"MYELOPROLIFERATIVE DISEASES AND DISORDERS, AND POORLY DIFFERENTIATED NEOPLASM",3,Major,Moderate,Surgical,Medicare,,,,,false,424690.16,97938.59
New York City,Manhattan,7002053,001463,NYU Langone Hospitals,30 to 49,113,F,Black/African American,Not Span/Hispanic,46,Elective,Skilled Nursing Home,2019,BLD003,APLASTIC ANEMIA,ADM011,"ADMINISTRATION AND TRANSFUSION OF BONE MARROW, STEM CELLS, PANCREATIC ISLET CELLS, AND T-CELLS",007,ALLOGENEIC BONE MARROW TRANSPLANT,16,DISEASES AND DISORDERS OF THE BLOOD AND BLOOD FORMING ORGANS AND IMMUNOLOGICAL DISORDERS,3,Major,Major,Surgical,Medicare,Medicaid,,,,false,1557555.34,328677.53
New York City,Manhattan,7002053,001463,NYU Langone Hospitals,50 to 69,110,F,Black/African American,Not Span/Hispanic,24,Elective,Home or Self Care,2019,NEO065,MULTIPLE MYELOMA,ADM011,"ADMINISTRATION AND TRANSFUSION OF BONE MARROW, STEM CELLS, PANCREATIC ISLET CELLS, AND T-CELLS",007,ALLOGENEIC BONE MARROW TRANSPLANT,17,"MYELOPROLIFERATIVE DISEASES AND DISORDERS, AND POORLY DIFFERENTIATED NEOPLASM",3,Major,Moderate,Surgical,Medicare,Private Health Insurance,,,,false,444494.83,107461.21
New York City,Manhattan,7002053,001463,NYU Langone Hospitals,18 to 29,112,F,Multi-racial,Not Span/Hispanic,27,Elective,Home w/ Home Health Services,2019,NEO060,LEUKEMIA - ACUTE MYELOID LEUKEMIA (AML),ADM011,"ADMINISTRATION AND TRANSFUSION OF BONE MARROW, STEM CELLS, PANCREATIC ISLET CELLS, AND T-CELLS",007,ALLOGENEIC BONE MARROW TRANSPLANT,17,"MYELOPROLIFERATIVE DISEASES AND DISORDERS, AND POORLY DIFFERENTIATED NEOPLASM",4,Extreme,Moderate,Surgical,Private Health Insurance,Private Health Insurance,,,,false,655788.44,118345.48
New York City,Manhattan,7002053,001463,NYU Langone Hospitals,18 to 29,114,F,Other Race,Not Span/Hispanic,29,Elective,Home or Self Care,2019,NEO060,LEUKEMIA - ACUTE MYELOID LEUKEMIA (AML),ADM011,"ADMINISTRATION AND TRANSFUSION OF BONE MARROW, STEM CELLS, PANCREATIC ISLET CELLS, AND T-CELLS",007,ALLOGENEIC BONE MARROW TRANSPLANT,17,"MYELOPROLIFERATIVE DISEASES AND DISORDERS, AND POORLY DIFFERENTIATED NEOPLASM",3,Major,Moderate,Surgical,Private Health Insurance,,,,,false,783441.34,192839.36
New York City,Manhattan,7002053,001463,NYU Langone Hospitals,18 to 29,113,M,Other Race,Not Span/Hispanic,31,Elective,Home or Self Care,2019,NEO059,LEUKEMIA - ACUTE LYMPHOBLASTIC LEUKEMIA (ALL),ADM011,"ADMINISTRATION AND TRANSFUSION OF BONE MARROW, STEM CELLS, PANCREATIC ISLET CELLS, AND T-CELLS",007,ALLOGENEIC BONE MARROW TRANSPLANT,17,"MYELOPROLIFERATIVE DISEASES AND DISORDERS, AND POORLY DIFFERENTIATED NEOPLASM",4,Extreme,Major,Surgical,Medicaid,,,,,false,623095.68,164909.38
New York City,Manhattan,7002053,001463,NYU Langone Hospitals,50 to 69,112,M,Other Race,Spanish/Hispanic,21,Elective,Home or Self Care,2019,NEO060,LEUKEMIA - ACUTE MYELOID LEUKEMIA (AML),ADM011,"ADMINISTRATION AND TRANSFUSION OF BONE MARROW, STEM CELLS, PANCREATIC ISLET CELLS, AND T-CELLS",007,ALLOGENEIC BONE MARROW TRANSPLANT,17,"MYELOPROLIFERATIVE DISEASES AND DISORDERS, AND POORLY DIFFERENTIATED NEOPLASM",3,Major,Minor,Surgical,Medicaid,,,,,false,613342.48,87069.09
New York City,Manhattan,7002053,001463,NYU Langone Hospitals,50 to 69,112,F,White,Not Span/Hispanic,27,Elective,Home or Self Care,2019,NEO068,MYELODYSPLASTIC SYNDROME (MDS),ADM011,"ADMINISTRATION AND TRANSFUSION OF BONE MARROW, STEM CELLS, PANCREATIC ISLET CELLS, AND T-CELLS",007,ALLOGENEIC BONE MARROW TRANSPLANT,17,"MYELOPROLIFERATIVE DISEASES AND DISORDERS, AND POORLY DIFFERENTIATED NEOPLASM",3,Major,Moderate,Surgical,Medicaid,,,,,false,756601.02,125196.52
New York City,Manhattan,7002053,001463,NYU Langone Hospitals,18 to 29,OOS,M,White,Not Span/Hispanic,32,Emergency,Expired,2019,INF008,VIRAL INFECTION,ADM011,"ADMINISTRATION AND TRANSFUSION OF BONE MARROW, STEM CELLS, PANCREATIC ISLET CELLS, AND T-CELLS",007,ALLOGENEIC BONE MARROW TRANSPLANT,18,INFECTIOUS AND PARASITIC DISEASES (SYSTEMIC OR UNSPECIFIED SITES),4,Extreme,Extreme,Surgical,Private Health Insurance,,,,,false,1615812.72,210719.5
