Hospital Service Area,Hospital County,Operating Certificate Number,Permanent Facility Id,Facility Name,Age Group,Zip Code - 3 digits,Gender,Race,Ethnicity,Length of Stay,Type of Admission,Patient Disposition,Discharge Year,CCS Diagnosis Code,CCS Diagnosis Description,CCS Procedure Code,CCS Procedure Description,APR DRG Code,APR DRG Description,APR MDC Code,APR MDC Description,APR Severity of Illness Code,APR Severity of Illness Description,APR Risk of Mortality,APR Medical Surgical Description,Payment Typology 1,Payment Typology 2,Payment Typology 3,Birth Weight,Abortion Edit Indicator,Emergency Department Indicator,Total Charges,Total Costs
New York City,Manhattan,7002053,001463,NYU Langone Hospitals,50 to 69,112,M,Other Race,Not Span/Hispanic,28,Elective,Home or Self Care,2020,NEO068,MYELODYSPLASTIC SYNDROME (MDS),ADM011,"ADMINISTRATION AND TRANSFUSION OF BONE MARROW, STEM CELLS, PANCREATIC ISLET CELLS, AND T-CELLS",007,ALLOGENEIC BONE MARROW TRANSPLANT,17,"MYELOPROLIFERATIVE DISEASES AND DISORDERS, AND POORLY DIFFERENTIATED NEOPLASM",4,Extreme,Extreme,Surgical,Medicare,,,,,N,829488.25,132273.75
New York City,Manhattan,7002053,001463,NYU Langone Hospitals,50 to 69,112,M,Black/African American,Not Span/Hispanic,33,Elective,Home or Self Care,2020,NEO068,MYELODYSPLASTIC SYNDROME (MDS),ADM011,"ADMINISTRATION AND TRANSFUSION OF BONE MARROW, STEM CELLS, PANCREATIC ISLET CELLS, AND T-CELLS",007,ALLOGENEIC BONE MARROW TRANSPLANT,17,"MYELOPROLIFERATIVE DISEASES AND DISORDERS, AND POORLY DIFFERENTIATED NEOPLASM",3,Major,Moderate,Surgical,Medicare,Medicaid,,,,N,647850.23,139378.3
New York City,Manhattan,7002053,001463,NYU Langone Hospitals,50 to 69,114,F,Other Race,Not Span/Hispanic,22,Elective,Home or Self Care,2020,NEO060,LEUKEMIA - ACUTE MYELOID LEUKEMIA (AML),ADM011,"ADMINISTRATION AND TRANSFUSION OF BONE MARROW, STEM CELLS, PANCREATIC ISLET CELLS, AND T-CELLS",007,ALLOGENEIC BONE MARROW TRANSPLANT,17,"MYELOPROLIFERATIVE DISEASES AND DISORDERS, AND POORLY DIFFERENTIATED NEOPLASM",2,Moderate,Minor,Surgical,Private Health Insurance,,,,,N,438056.03,86087.21
New York City,Manhattan,7002053,001463,NYU Langone Hospitals,70 or Older,114,M,Other Race,Unknown,30,Elective,Home or Self Care,2020,NEO062,LEUKEMIA - CHRONIC MYELOID LEUKEMIA (CML),ADM011,"ADMINISTRATION AND TRANSFUSION OF BONE MARROW, STEM CELLS, PANCREATIC ISLET CELLS, AND T-CELLS",007,ALLOGENEIC BONE MARROW TRANSPLANT,17,"MYELOPROLIFERATIVE DISEASES AND DISORDERS, AND POORLY DIFFERENTIATED NEOPLASM",3,Major,Major,Surgical,Medicare,,,,,N,688688.84,123514.19
New York City,Manhattan,7002053,001463,NYU Langone Hospitals,50 to 69,104,F,Black/African American,Not Span/Hispanic,22,Elective,Skilled Nursing Home,2020,NEO060,LEUKEMIA - ACUTE MYELOID LEUKEMIA (AML),ADM011,"ADMINISTRATION AND TRANSFUSION OF BONE MARROW, STEM CELLS, PANCREATIC ISLET CELLS, AND T-CELLS",007,ALLOGENEIC BONE MARROW TRANSPLANT,17,"MYELOPROLIFERATIVE DISEASES AND DISORDERS, AND POORLY DIFFERENTIATED NEOPLASM",4,Extreme,Major,Surgical,Medicare,Medicaid,,,,N,620763.59,94553.05
New York City,Manhattan,7002053,001463,NYU Langone Hospitals,50 to 69,114,F,Black/African American,Not Span/Hispanic,25,Elective,Home w/ Home Health Services,2020,NEO060,LEUKEMIA - ACUTE MYELOID LEUKEMIA (AML),ADM011,"ADMINISTRATION AND TRANSFUSION OF BONE MARROW, STEM CELLS, PANCREATIC ISLET CELLS, AND T-CELLS",007,ALLOGENEIC BONE MARROW TRANSPLANT,17,"MYELOPROLIFERATIVE DISEASES AND DISORDERS, AND POORLY DIFFERENTIATED NEOPLASM",3,Major,Moderate,Surgical,Private Health Insurance,,,,,N,441492.19,106359
New York City,Manhattan,7002053,001463,NYU Langone Hospitals,30 to 49,100,M,Other Race,Not Span/Hispanic,38,Elective,Home w/ Home Health Services,2020,NEO068,MYELODYSPLASTIC SYNDROME (MDS),CAR025,PLACEMENT OF TUNNELED OR IMPLANTABLE PORTION OF A VASCULAR ACCESS DEVICE,007,ALLOGENEIC BONE MARROW TRANSPLANT,17,"MYELOPROLIFERATIVE DISEASES AND DISORDERS, AND POORLY DIFFERENTIATED NEOPLASM",3,Major,Moderate,Surgical,Blue Cross/Blue Shield,,,,,N,907236.13,160705.49
New York City,Manhattan,7002053,001463,NYU Langone Hospitals,18 to 29,110,M,White,Not Span/Hispanic,26,Elective,Home or Self Care,2020,NEO059,LEUKEMIA - ACUTE LYMPHOBLASTIC LEUKEMIA (ALL),ADM011,"ADMINISTRATION AND TRANSFUSION OF BONE MARROW, STEM CELLS, PANCREATIC ISLET CELLS, AND T-CELLS",007,ALLOGENEIC BONE MARROW TRANSPLANT,17,"MYELOPROLIFERATIVE DISEASES AND DISORDERS, AND POORLY DIFFERENTIATED NEOPLASM",3,Major,Minor,Surgical,Private Health Insurance,,,,,N,469189.44,115429.79
New York City,Manhattan,7002053,001463,NYU Langone Hospitals,30 to 49,118,M,Other Race,Spanish/Hispanic,49,Elective,Home w/ Home Health Services,2020,NEO059,LEUKEMIA - ACUTE LYMPHOBLASTIC LEUKEMIA (ALL),ADM011,"ADMINISTRATION AND TRANSFUSION OF BONE MARROW, STEM CELLS, PANCREATIC ISLET CELLS, AND T-CELLS",007,ALLOGENEIC BONE MARROW TRANSPLANT,17,"MYELOPROLIFERATIVE DISEASES AND DISORDERS, AND POORLY DIFFERENTIATED NEOPLASM",4,Extreme,Extreme,Surgical,Medicaid,,,,,N,1600632.13,277965.11
New York City,Manhattan,7002053,001463,NYU Langone Hospitals,30 to 49,118,M,White,Spanish/Hispanic,31,Elective,Home or Self Care,2020,NEO060,LEUKEMIA - ACUTE MYELOID LEUKEMIA (AML),ADM011,"ADMINISTRATION AND TRANSFUSION OF BONE MARROW, STEM CELLS, PANCREATIC ISLET CELLS, AND T-CELLS",007,ALLOGENEIC BONE MARROW TRANSPLANT,17,"MYELOPROLIFERATIVE DISEASES AND DISORDERS, AND POORLY DIFFERENTIATED NEOPLASM",3,Major,Major,Surgical,Blue Cross/Blue Shield,,,,,N,736976.35,130977.27
New York City,Manhattan,7002053,001463,NYU Langone Hospitals,50 to 69,OOS,F,White,Not Span/Hispanic,27,Elective,Home w/ Home Health Services,2020,NEO060,LEUKEMIA - ACUTE MYELOID LEUKEMIA (AML),ADM011,"ADMINISTRATION AND TRANSFUSION OF BONE MARROW, STEM CELLS, PANCREATIC ISLET CELLS, AND T-CELLS",007,ALLOGENEIC BONE MARROW TRANSPLANT,17,"MYELOPROLIFERATIVE DISEASES AND DISORDERS, AND POORLY DIFFERENTIATED NEOPLASM",3,Major,Major,Surgical,Private Health Insurance,,,,,N,579198.94,111205.85
New York City,Manhattan,7002053,001463,NYU Langone Hospitals,50 to 69,115,M,White,Not Span/Hispanic,32,Elective,Home or Self Care,2020,FAC006,ENCOUNTER FOR ANTINEOPLASTIC THERAPIES,ADM012,CHEMOTHERAPY,007,ALLOGENEIC BONE MARROW TRANSPLANT,17,"MYELOPROLIFERATIVE DISEASES AND DISORDERS, AND POORLY DIFFERENTIATED NEOPLASM",4,Extreme,Moderate,Surgical,Medicare,Private Health Insurance,,,,N,721979.13,142286.01
New York City,Manhattan,7002053,001463,NYU Langone Hospitals,18 to 29,112,F,White,Not Span/Hispanic,22,Elective,Home or Self Care,2020,NEO060,LEUKEMIA - ACUTE MYELOID LEUKEMIA (AML),ADM011,"ADMINISTRATION AND TRANSFUSION OF BONE MARROW, STEM CELLS, PANCREATIC ISLET CELLS, AND T-CELLS",007,ALLOGENEIC BONE MARROW TRANSPLANT,17,"MYELOPROLIFERATIVE DISEASES AND DISORDERS, AND POORLY DIFFERENTIATED NEOPLASM",2,Moderate,Minor,Surgical,Blue Cross/Blue Shield,,,,,N,441746.89,88999.55
New York City,Manhattan,7002053,001463,NYU Langone Hospitals,50 to 69,103,F,Other Race,Unknown,26,Elective,Home w/ Home Health Services,2020,NEO060,LEUKEMIA - ACUTE MYELOID LEUKEMIA (AML),ADM011,"ADMINISTRATION AND TRANSFUSION OF BONE MARROW, STEM CELLS, PANCREATIC ISLET CELLS, AND T-CELLS",007,ALLOGENEIC BONE MARROW TRANSPLANT,17,"MYELOPROLIFERATIVE DISEASES AND DISORDERS, AND POORLY DIFFERENTIATED NEOPLASM",4,Extreme,Major,Surgical,Private Health Insurance,,,,,N,680525.19,114967.9
New York City,Manhattan,7002053,001463,NYU Langone Hospitals,50 to 69,113,F,Other Race,Spanish/Hispanic,32,Elective,Home w/ Home Health Services,2020,NEO068,MYELODYSPLASTIC SYNDROME (MDS),ADM011,"ADMINISTRATION AND TRANSFUSION OF BONE MARROW, STEM CELLS, PANCREATIC ISLET CELLS, AND T-CELLS",007,ALLOGENEIC BONE MARROW TRANSPLANT,17,"MYELOPROLIFERATIVE DISEASES AND DISORDERS, AND POORLY DIFFERENTIATED NEOPLASM",4,Extreme,Major,Surgical,Private Health Insurance,,,,,N,654567.62,150857.63
New York City,Manhattan,7002053,001463,NYU Langone Hospitals,30 to 49,100,M,Other Race,Not Span/Hispanic,5,Elective,Home or Self Care,2020,NEO068,MYELODYSPLASTIC SYNDROME (MDS),ADM011,"ADMINISTRATION AND TRANSFUSION OF BONE MARROW, STEM CELLS, PANCREATIC ISLET CELLS, AND T-CELLS",007,ALLOGENEIC BONE MARROW TRANSPLANT,17,"MYELOPROLIFERATIVE DISEASES AND DISORDERS, AND POORLY DIFFERENTIATED NEOPLASM",4,Extreme,Moderate,Surgical,Blue Cross/Blue Shield,,,,,N,123723.75,32623.07
New York City,Manhattan,7002053,001463,NYU Langone Hospitals,50 to 69,OOS,F,White,Not Span/Hispanic,36,Elective,Home or Self Care,2020,NEO060,LEUKEMIA - ACUTE MYELOID LEUKEMIA (AML),ADM011,"ADMINISTRATION AND TRANSFUSION OF BONE MARROW, STEM CELLS, PANCREATIC ISLET CELLS, AND T-CELLS",007,ALLOGENEIC BONE MARROW TRANSPLANT,17,"MYELOPROLIFERATIVE DISEASES AND DISORDERS, AND POORLY DIFFERENTIATED NEOPLASM",3,Major,Major,Surgical,Medicare,Medicaid,,,,N,866852.04,200398.53
New York City,Manhattan,7002053,001463,NYU Langone Hospitals,30 to 49,100,F,White,Not Span/Hispanic,30,Elective,Home or Self Care,2020,NEO062,LEUKEMIA - CHRONIC MYELOID LEUKEMIA (CML),ADM011,"ADMINISTRATION AND TRANSFUSION OF BONE MARROW, STEM CELLS, PANCREATIC ISLET CELLS, AND T-CELLS",007,ALLOGENEIC BONE MARROW TRANSPLANT,17,"MYELOPROLIFERATIVE DISEASES AND DISORDERS, AND POORLY DIFFERENTIATED NEOPLASM",2,Moderate,Moderate,Surgical,Private Health Insurance,,,,,N,1299670.98,206056.96
New York City,Manhattan,7002053,001463,NYU Langone Hospitals,30 to 49,113,M,Other Race,Not Span/Hispanic,22,Elective,Home or Self Care,2020,NEO059,LEUKEMIA - ACUTE LYMPHOBLASTIC LEUKEMIA (ALL),ADM011,"ADMINISTRATION AND TRANSFUSION OF BONE MARROW, STEM CELLS, PANCREATIC ISLET CELLS, AND T-CELLS",007,ALLOGENEIC BONE MARROW TRANSPLANT,17,"MYELOPROLIFERATIVE DISEASES AND DISORDERS, AND POORLY DIFFERENTIATED NEOPLASM",2,Moderate,Moderate,Surgical,Medicaid,,,,,N,481962.9,137623.66
New York City,Manhattan,7002053,001463,NYU Langone Hospitals,50 to 69,104,M,Black/African American,Not Span/Hispanic,26,Elective,Home w/ Home Health Services,2020,NEO064,LEUKEMIA - ALL OTHER TYPES,CAR024,VENOUS AND ARTERIAL CATHETER PLACEMENT,007,ALLOGENEIC BONE MARROW TRANSPLANT,17,"MYELOPROLIFERATIVE DISEASES AND DISORDERS, AND POORLY DIFFERENTIATED NEOPLASM",3,Major,Moderate,Surgical,Private Health Insurance,,,,,N,637670.24,146018.45
New York City,Manhattan,7002053,001463,NYU Langone Hospitals,50 to 69,112,F,Black/African American,Not Span/Hispanic,27,Elective,Home or Self Care,2020,NEO060,LEUKEMIA - ACUTE MYELOID LEUKEMIA (AML),ADM011,"ADMINISTRATION AND TRANSFUSION OF BONE MARROW, STEM CELLS, PANCREATIC ISLET CELLS, AND T-CELLS",007,ALLOGENEIC BONE MARROW TRANSPLANT,17,"MYELOPROLIFERATIVE DISEASES AND DISORDERS, AND POORLY DIFFERENTIATED NEOPLASM",3,Major,Major,Surgical,Medicare,Medicaid,,,,N,642962.83,153147.52
New York City,Manhattan,7002053,001463,NYU Langone Hospitals,50 to 69,115,M,Black/African American,Not Span/Hispanic,16,Elective,Home or Self Care,2020,NEO065,MULTIPLE MYELOMA,ADM012,CHEMOTHERAPY,007,ALLOGENEIC BONE MARROW TRANSPLANT,17,"MYELOPROLIFERATIVE DISEASES AND DISORDERS, AND POORLY DIFFERENTIATED NEOPLASM",3,Major,Major,Surgical,Medicare,Medicare,,,,N,608779.87,104545.58
New York City,Manhattan,7002053,001463,NYU Langone Hospitals,50 to 69,112,F,Black/African American,Not Span/Hispanic,27,Elective,Inpatient Rehabilitation Facility,2020,NEO059,LEUKEMIA - ACUTE LYMPHOBLASTIC LEUKEMIA (ALL),ADM011,"ADMINISTRATION AND TRANSFUSION OF BONE MARROW, STEM CELLS, PANCREATIC ISLET CELLS, AND T-CELLS",007,ALLOGENEIC BONE MARROW TRANSPLANT,17,"MYELOPROLIFERATIVE DISEASES AND DISORDERS, AND POORLY DIFFERENTIATED NEOPLASM",4,Extreme,Major,Surgical,Medicaid,,,,,N,738447.92,163023.81
New York City,Manhattan,7002053,001463,NYU Langone Hospitals,30 to 49,103,F,White,Not Span/Hispanic,22,Elective,Home or Self Care,2020,NEO068,MYELODYSPLASTIC SYNDROME (MDS),ADM012,CHEMOTHERAPY,007,ALLOGENEIC BONE MARROW TRANSPLANT,17,"MYELOPROLIFERATIVE DISEASES AND DISORDERS, AND POORLY DIFFERENTIATED NEOPLASM",3,Major,Moderate,Surgical,Medicare,,,,,N,663590.55,135685.18
New York City,Manhattan,7002053,001463,NYU Langone Hospitals,30 to 49,103,M,White,Not Span/Hispanic,33,Elective,Home or Self Care,2020,NEO057,HODGKIN LYMPHOMA,ADM011,"ADMINISTRATION AND TRANSFUSION OF BONE MARROW, STEM CELLS, PANCREATIC ISLET CELLS, AND T-CELLS",007,ALLOGENEIC BONE MARROW TRANSPLANT,17,"MYELOPROLIFERATIVE DISEASES AND DISORDERS, AND POORLY DIFFERENTIATED NEOPLASM",4,Extreme,Moderate,Surgical,Medicaid,,,,,N,873397.26,194541.54
New York City,Manhattan,7002053,001463,NYU Langone Hospitals,50 to 69,104,F,Black/African American,Not Span/Hispanic,29,Elective,Home or Self Care,2020,NEO059,LEUKEMIA - ACUTE LYMPHOBLASTIC LEUKEMIA (ALL),ADM011,"ADMINISTRATION AND TRANSFUSION OF BONE MARROW, STEM CELLS, PANCREATIC ISLET CELLS, AND T-CELLS",007,ALLOGENEIC BONE MARROW TRANSPLANT,17,"MYELOPROLIFERATIVE DISEASES AND DISORDERS, AND POORLY DIFFERENTIATED NEOPLASM",3,Major,Moderate,Surgical,Blue Cross/Blue Shield,,,,,N,539842.21,158714.77
New York City,Manhattan,7002053,001463,NYU Langone Hospitals,18 to 29,100,M,Other Race,Spanish/Hispanic,24,Elective,Home or Self Care,2020,NEO059,LEUKEMIA - ACUTE LYMPHOBLASTIC LEUKEMIA (ALL),ADM012,CHEMOTHERAPY,007,ALLOGENEIC BONE MARROW TRANSPLANT,17,"MYELOPROLIFERATIVE DISEASES AND DISORDERS, AND POORLY DIFFERENTIATED NEOPLASM",3,Major,Major,Surgical,Medicaid,,,,,N,723198.99,160306.57
New York City,Manhattan,7002053,001463,NYU Langone Hospitals,30 to 49,112,M,Other Race,Not Span/Hispanic,25,Elective,Home or Self Care,2020,NEO058,NON-HODGKIN LYMPHOMA,ADM011,"ADMINISTRATION AND TRANSFUSION OF BONE MARROW, STEM CELLS, PANCREATIC ISLET CELLS, AND T-CELLS",007,ALLOGENEIC BONE MARROW TRANSPLANT,17,"MYELOPROLIFERATIVE DISEASES AND DISORDERS, AND POORLY DIFFERENTIATED NEOPLASM",3,Major,Moderate,Surgical,Private Health Insurance,,,,,N,612713.27,177854.88
New York City,Manhattan,7002053,001463,NYU Langone Hospitals,18 to 29,112,F,Other Race,Spanish/Hispanic,22,Elective,Home or Self Care,2020,NEO059,LEUKEMIA - ACUTE LYMPHOBLASTIC LEUKEMIA (ALL),ADM012,CHEMOTHERAPY,007,ALLOGENEIC BONE MARROW TRANSPLANT,17,"MYELOPROLIFERATIVE DISEASES AND DISORDERS, AND POORLY DIFFERENTIATED NEOPLASM",3,Major,Major,Surgical,Medicaid,,,,,N,617820.72,152962.45
New York City,Manhattan,7002053,001463,NYU Langone Hospitals,30 to 49,116,F,Black/African American,Not Span/Hispanic,28,Elective,Home or Self Care,2020,NEO064,LEUKEMIA - ALL OTHER TYPES,ADM011,"ADMINISTRATION AND TRANSFUSION OF BONE MARROW, STEM CELLS, PANCREATIC ISLET CELLS, AND T-CELLS",007,ALLOGENEIC BONE MARROW TRANSPLANT,17,"MYELOPROLIFERATIVE DISEASES AND DISORDERS, AND POORLY DIFFERENTIATED NEOPLASM",4,Extreme,Major,Surgical,Medicaid,,,,,N,667498.69,158902.78
New York City,Manhattan,7002053,001463,NYU Langone Hospitals,50 to 69,100,F,White,Unknown,54,Elective,Expired,2020,FAC006,ENCOUNTER FOR ANTINEOPLASTIC THERAPIES,ADM011,"ADMINISTRATION AND TRANSFUSION OF BONE MARROW, STEM CELLS, PANCREATIC ISLET CELLS, AND T-CELLS",007,ALLOGENEIC BONE MARROW TRANSPLANT,17,"MYELOPROLIFERATIVE DISEASES AND DISORDERS, AND POORLY DIFFERENTIATED NEOPLASM",4,Extreme,Major,Surgical,Medicaid,,,,,N,2400561.89,302572.18
New York City,Manhattan,7002053,001463,NYU Langone Hospitals,18 to 29,115,M,Black/African American,Not Span/Hispanic,38,Elective,Home w/ Home Health Services,2020,NEO068,MYELODYSPLASTIC SYNDROME (MDS),ADM011,"ADMINISTRATION AND TRANSFUSION OF BONE MARROW, STEM CELLS, PANCREATIC ISLET CELLS, AND T-CELLS",007,ALLOGENEIC BONE MARROW TRANSPLANT,17,"MYELOPROLIFERATIVE DISEASES AND DISORDERS, AND POORLY DIFFERENTIATED NEOPLASM",4,Extreme,Moderate,Surgical,Medicaid,,,,,N,1566988.98,256707.48
