Hospital Service Area,Hospital County,Operating Certificate Number,Permanent Facility Id,Facility Name,Age Group,Zip Code - 3 digits,Gender,Race,Ethnicity,Length of Stay,Type of Admission,Patient Disposition,Discharge Year,CCS Diagnosis Code,CCS Diagnosis Description,CCS Procedure Code,CCS Procedure Description,APR DRG Code,APR DRG Description,APR MDC Code,APR MDC Description,APR Severity of Illness Code,APR Severity of Illness Description,APR Risk of Mortality,APR Medical Surgical Description,Payment Typology 1,Payment Typology 2,Payment Typology 3,Birth Weight,Abortion Edit Indicator,Emergency Department Indicator,Total Charges,Total Costs
New York City,Manhattan,7002001,001438,Bellevue Hospital Center,30 to 49,100,M,Other Race,Not Span/Hispanic,2,Emergency,Home or Self Care,2017,228,Skull and face fractures,144,"TRTMNT,FACE FRACT/DISLC",070,Orbital procedures,02,Diseases and Disorders of the Eye,1,Minor,Minor,Surgical,Medicaid,Medicaid,,,N,N,13258.69,8548.51
New York City,Manhattan,7002001,001438,Bellevue Hospital Center,30 to 49,104,M,Other Race,Not Span/Hispanic,6,Emergency,Home or Self Care,2017,090,Inflammation; infection of eye (except that caused by tuberculosis or sexually transmitteddisease),019,OT THER PRCS EYELIDS,070,Orbital procedures,02,Diseases and Disorders of the Eye,2,Moderate,Minor,Surgical,Self-Pay,,,,N,Y,34087.83,21978.06
New York City,Manhattan,7002001,001438,Bellevue Hospital Center,30 to 49,112,M,Black/African American,Not Span/Hispanic,4,Emergency,Home or Self Care,2017,090,Inflammation; infection of eye (except that caused by tuberculosis or sexually transmitteddisease),018,DX PRCS ON EYE,070,Orbital procedures,02,Diseases and Disorders of the Eye,1,Minor,Minor,Surgical,Medicaid,Medicaid,,,N,Y,22455.40,14478.07
New York City,Manhattan,7002001,001438,Bellevue Hospital Center,30 to 49,105,M,Other Race,Not Span/Hispanic,1,Emergency,Home or Self Care,2017,235,Open wounds of head; neck; and trunk,175,OT OR THER PRC SKN/BRST,070,Orbital procedures,02,Diseases and Disorders of the Eye,2,Moderate,Minor,Surgical,Self-Pay,,,,N,Y,12584.12,8113.59
New York City,Manhattan,7002001,001438,Bellevue Hospital Center,30 to 49,112,M,White,Not Span/Hispanic,5,Emergency,Home or Self Care,2017,228,Skull and face fractures,144,"TRTMNT,FACE FRACT/DISLC",070,Orbital procedures,02,Diseases and Disorders of the Eye,2,Moderate,Minor,Surgical,Medicare,Medicaid,,,N,Y,31381.46,20233.13
New York City,Manhattan,7002001,001438,Bellevue Hospital Center,30 to 49,112,F,Black/African American,Not Span/Hispanic,14,Emergency,Home or Self Care,2017,228,Skull and face fractures,144,"TRTMNT,FACE FRACT/DISLC",070,Orbital procedures,02,Diseases and Disorders of the Eye,2,Moderate,Minor,Surgical,Medicaid,Medicaid,,,N,Y,81445.99,52512.14
New York City,Manhattan,7002001,001438,Bellevue Hospital Center,18 to 29,100,M,Other Race,Not Span/Hispanic,2,Emergency,Home or Self Care,2017,228,Skull and face fractures,144,"TRTMNT,FACE FRACT/DISLC",070,Orbital procedures,02,Diseases and Disorders of the Eye,1,Minor,Minor,Surgical,Private Health Insurance,,,,N,Y,18262.35,11774.61
New York City,Manhattan,7002001,001438,Bellevue Hospital Center,30 to 49,112,M,White,Not Span/Hispanic,3,Emergency,Home or Self Care,2017,228,Skull and face fractures,144,"TRTMNT,FACE FRACT/DISLC",070,Orbital procedures,02,Diseases and Disorders of the Eye,2,Moderate,Minor,Surgical,Medicaid,Medicaid,,,N,N,22256.42,14349.78
New York City,Manhattan,7002001,001438,Bellevue Hospital Center,30 to 49,113,M,Other Race,Not Span/Hispanic,2,Emergency,Home or Self Care,2017,228,Skull and face fractures,144,"TRTMNT,FACE FRACT/DISLC",070,Orbital procedures,02,Diseases and Disorders of the Eye,1,Minor,Minor,Surgical,Medicaid,,,,N,Y,15883.20,10240.66
New York City,Manhattan,7002001,001438,Bellevue Hospital Center,30 to 49,113,M,Other Race,Spanish/Hispanic,2,Emergency,Home or Self Care,2017,228,Skull and face fractures,144,"TRTMNT,FACE FRACT/DISLC",070,Orbital procedures,02,Diseases and Disorders of the Eye,2,Moderate,Minor,Surgical,Medicaid,,,,N,Y,14472.72,9331.26
New York City,Manhattan,7002001,001438,Bellevue Hospital Center,30 to 49,OOS,M,Black/African American,Not Span/Hispanic,2,Emergency,Home or Self Care,2017,235,Open wounds of head; neck; and trunk,019,OT THER PRCS EYELIDS,070,Orbital procedures,02,Diseases and Disorders of the Eye,2,Moderate,Minor,Surgical,Miscellaneous/Other,Private Health Insurance,,,N,Y,15490.67,9987.58
New York City,Manhattan,7002001,001438,Bellevue Hospital Center,70 or Older,112,F,White,Not Span/Hispanic,9,Emergency,Hospice - Home,2017,235,Open wounds of head; neck; and trunk,019,OT THER PRCS EYELIDS,070,Orbital procedures,02,Diseases and Disorders of the Eye,2,Moderate,Moderate,Surgical,Medicare,Medicaid,,,N,Y,54048.82,34847.87
New York City,Manhattan,7002001,001438,Bellevue Hospital Center,30 to 49,112,M,Other Race,Not Span/Hispanic,4,Emergency,Home or Self Care,2017,228,Skull and face fractures,144,"TRTMNT,FACE FRACT/DISLC",070,Orbital procedures,02,Diseases and Disorders of the Eye,1,Minor,Minor,Surgical,Medicaid,Medicaid,,,N,Y,27782.30,17912.58
New York City,Manhattan,7002001,001438,Bellevue Hospital Center,30 to 49,113,M,Other Race,Not Span/Hispanic,6,Emergency,Home or Self Care,2017,228,Skull and face fractures,144,"TRTMNT,FACE FRACT/DISLC",070,Orbital procedures,02,Diseases and Disorders of the Eye,2,Moderate,Minor,Surgical,Medicaid,,,,N,Y,37334.67,24071.45
