Hospital Service Area,Hospital County,Operating Certificate Number,Permanent Facility Id,Facility Name,Age Group,Zip Code - 3 digits,Gender,Race,Ethnicity,Length of Stay,Type of Admission,Patient Disposition,Discharge Year,CCS Diagnosis Code,CCS Diagnosis Description,CCS Procedure Code,CCS Procedure Description,APR DRG Code,APR DRG Description,APR MDC Code,APR MDC Description,APR Severity of Illness Code,APR Severity of Illness Description,APR Risk of Mortality,APR Medical Surgical Description,Payment Typology 1,Payment Typology 2,Payment Typology 3,Birth Weight,Abortion Edit Indicator,Emergency Department Indicator,Total Charges,Total Costs
New York City,Manhattan,7002001,001438,Bellevue Hospital Center,70 or Older,111,F,Other Race,Not Span/Hispanic,34,Emergency,Home or Self Care,2020,INF002,SEPTICEMIA,CAR024,VENOUS AND ARTERIAL CATHETER PLACEMENT,710,INFECTIOUS & PARASITIC DISEASES INCLUDING HIV W O.R. PROCEDURE,18,INFECTIOUS AND PARASITIC DISEASES (SYSTEMIC OR UNSPECIFIED SITES),4,Extreme,Extreme,Surgical,Medicaid,,,,,Y,307493.93,176834.84
New York City,Manhattan,7002001,001438,Bellevue Hospital Center,18 to 29,112,F,Black/African American,Not Span/Hispanic,16,Urgent,Expired,2020,INF002,SEPTICEMIA,ESA003,MECHANICAL VENTILATION,710,INFECTIOUS & PARASITIC DISEASES INCLUDING HIV W O.R. PROCEDURE,18,INFECTIOUS AND PARASITIC DISEASES (SYSTEMIC OR UNSPECIFIED SITES),4,Extreme,Extreme,Surgical,Private Health Insurance,,,,,N,316167.82,181823.05
New York City,Manhattan,7002001,001438,Bellevue Hospital Center,30 to 49,112,F,Black/African American,Not Span/Hispanic,38,Urgent,Home or Self Care,2020,INF002,SEPTICEMIA,CAR022,HEART VALVE REPLACEMENT AND OTHER VALVE PROCEDURES (NON-ENDOVASCULAR),710,INFECTIOUS & PARASITIC DISEASES INCLUDING HIV W O.R. PROCEDURE,18,INFECTIOUS AND PARASITIC DISEASES (SYSTEMIC OR UNSPECIFIED SITES),4,Extreme,Major,Surgical,Medicaid,,,,,N,343512.47,197548.53
New York City,Manhattan,7002001,001438,Bellevue Hospital Center,50 to 69,100,M,Other Race,Unknown,10,Emergency,Inpatient Rehabilitation Facility,2020,INF002,SEPTICEMIA,MST024,BELOW KNEE AMPUTATION,710,INFECTIOUS & PARASITIC DISEASES INCLUDING HIV W O.R. PROCEDURE,18,INFECTIOUS AND PARASITIC DISEASES (SYSTEMIC OR UNSPECIFIED SITES),3,Major,Major,Surgical,Medicaid,,,,,Y,99391.15,57158.26
New York City,Manhattan,7002001,001438,Bellevue Hospital Center,18 to 29,111,M,Black/African American,Not Span/Hispanic,98,Emergency,Home w/ Home Health Services,2020,INF002,SEPTICEMIA,SKB007,SKIN GRAFT,710,INFECTIOUS & PARASITIC DISEASES INCLUDING HIV W O.R. PROCEDURE,18,INFECTIOUS AND PARASITIC DISEASES (SYSTEMIC OR UNSPECIFIED SITES),3,Major,Moderate,Surgical,Medicaid,,,,,Y,751392.16,432113.61
New York City,Manhattan,7002001,001438,Bellevue Hospital Center,50 to 69,114,M,Other Race,Spanish/Hispanic,7,Emergency,Home or Self Care,2020,INF002,SEPTICEMIA,MRS003,PROSTATECTOMY,710,INFECTIOUS & PARASITIC DISEASES INCLUDING HIV W O.R. PROCEDURE,18,INFECTIOUS AND PARASITIC DISEASES (SYSTEMIC OR UNSPECIFIED SITES),2,Moderate,Moderate,Surgical,Medicare,Medicare,Medicaid,,,Y,65682.69,37773.06
New York City,Manhattan,7002001,001438,Bellevue Hospital Center,70 or Older,112,M,Black/African American,Not Span/Hispanic,3,Emergency,Home w/ Home Health Services,2020,INF002,SEPTICEMIA,MST023,TOE AND MID FOOT AMPUTATION,710,INFECTIOUS & PARASITIC DISEASES INCLUDING HIV W O.R. PROCEDURE,18,INFECTIOUS AND PARASITIC DISEASES (SYSTEMIC OR UNSPECIFIED SITES),2,Moderate,Moderate,Surgical,Medicare,Medicaid,,,,Y,32560.87,18725.24
New York City,Manhattan,7002001,001438,Bellevue Hospital Center,50 to 69,101,M,White,Not Span/Hispanic,30,Emergency,Skilled Nursing Home,2020,INF002,SEPTICEMIA,ADM015,ADMINISTRATION OF ANTIBIOTICS,710,INFECTIOUS & PARASITIC DISEASES INCLUDING HIV W O.R. PROCEDURE,18,INFECTIOUS AND PARASITIC DISEASES (SYSTEMIC OR UNSPECIFIED SITES),3,Major,Major,Surgical,Medicaid,,,,,Y,221329.44,127283.02
New York City,Manhattan,7002001,001438,Bellevue Hospital Center,30 to 49,112,M,Other Race,Spanish/Hispanic,22,Urgent,Skilled Nursing Home,2020,INF002,SEPTICEMIA,RES014,"RESPIRATORY SYSTEM PROCEDURES, NEC",710,INFECTIOUS & PARASITIC DISEASES INCLUDING HIV W O.R. PROCEDURE,18,INFECTIOUS AND PARASITIC DISEASES (SYSTEMIC OR UNSPECIFIED SITES),4,Extreme,Extreme,Surgical,Medicaid,,,,,N,349709.36,201112.26
New York City,Manhattan,7002001,001438,Bellevue Hospital Center,50 to 69,113,M,Other Race,Spanish/Hispanic,8,Emergency,Home or Self Care,2020,INF002,SEPTICEMIA,HEP006,CHOLECYSTECTOMY,710,INFECTIOUS & PARASITIC DISEASES INCLUDING HIV W O.R. PROCEDURE,18,INFECTIOUS AND PARASITIC DISEASES (SYSTEMIC OR UNSPECIFIED SITES),3,Major,Moderate,Surgical,Medicaid,,,,,Y,82882,47664.11
New York City,Manhattan,7002001,001438,Bellevue Hospital Center,50 to 69,100,M,Black/African American,Not Span/Hispanic,6,Emergency,Home w/ Home Health Services,2020,MUS002,OSTEOMYELITIS,MST023,TOE AND MID FOOT AMPUTATION,710,INFECTIOUS & PARASITIC DISEASES INCLUDING HIV W O.R. PROCEDURE,18,INFECTIOUS AND PARASITIC DISEASES (SYSTEMIC OR UNSPECIFIED SITES),2,Moderate,Moderate,Surgical,Medicare,Medicaid,,,,Y,54852.25,31544.65
New York City,Manhattan,7002001,001438,Bellevue Hospital Center,50 to 69,100,M,White,Spanish/Hispanic,14,Emergency,Home or Self Care,2020,INF002,SEPTICEMIA,MST024,BELOW KNEE AMPUTATION,710,INFECTIOUS & PARASITIC DISEASES INCLUDING HIV W O.R. PROCEDURE,18,INFECTIOUS AND PARASITIC DISEASES (SYSTEMIC OR UNSPECIFIED SITES),3,Major,Major,Surgical,Medicare,,,,,Y,135130.08,77711.15
New York City,Manhattan,7002001,001438,Bellevue Hospital Center,30 to 49,113,M,Multi-racial,Spanish/Hispanic,28,Emergency,Home or Self Care,2020,CIR020,CEREBRAL INFARCTION,ADM015,ADMINISTRATION OF ANTIBIOTICS,710,INFECTIOUS & PARASITIC DISEASES INCLUDING HIV W O.R. PROCEDURE,18,INFECTIOUS AND PARASITIC DISEASES (SYSTEMIC OR UNSPECIFIED SITES),3,Major,Extreme,Surgical,Medicaid,,,,,Y,351251.28,201998.99
New York City,Manhattan,7002001,001438,Bellevue Hospital Center,70 or Older,114,M,Black/African American,Not Span/Hispanic,29,Urgent,Expired,2020,INF002,SEPTICEMIA,ESA003,MECHANICAL VENTILATION,710,INFECTIOUS & PARASITIC DISEASES INCLUDING HIV W O.R. PROCEDURE,18,INFECTIOUS AND PARASITIC DISEASES (SYSTEMIC OR UNSPECIFIED SITES),4,Extreme,Extreme,Surgical,Medicare,,,,,N,274289.96,157739.77
New York City,Manhattan,7002001,001438,Bellevue Hospital Center,30 to 49,100,M,Black/African American,Not Span/Hispanic,28,Emergency,Skilled Nursing Home,2020,INF002,SEPTICEMIA,MST017,JOINT TISSUE EXCISION (EXCLUDING DISCECTOMY),710,INFECTIOUS & PARASITIC DISEASES INCLUDING HIV W O.R. PROCEDURE,18,INFECTIOUS AND PARASITIC DISEASES (SYSTEMIC OR UNSPECIFIED SITES),3,Major,Major,Surgical,Medicare,Medicaid,,,,Y,201258.87,115740.76
New York City,Manhattan,7002001,001438,Bellevue Hospital Center,50 to 69,104,M,Black/African American,Not Span/Hispanic,38,Emergency,Expired,2020,INF002,SEPTICEMIA,ESA003,MECHANICAL VENTILATION,710,INFECTIOUS & PARASITIC DISEASES INCLUDING HIV W O.R. PROCEDURE,18,INFECTIOUS AND PARASITIC DISEASES (SYSTEMIC OR UNSPECIFIED SITES),4,Extreme,Extreme,Surgical,Medicaid,,,,,Y,438007.44,251891.07
New York City,Manhattan,7002001,001438,Bellevue Hospital Center,50 to 69,113,F,Other Race,Unknown,51,Emergency,Home or Self Care,2020,INF002,SEPTICEMIA,MST023,TOE AND MID FOOT AMPUTATION,710,INFECTIOUS & PARASITIC DISEASES INCLUDING HIV W O.R. PROCEDURE,18,INFECTIOUS AND PARASITIC DISEASES (SYSTEMIC OR UNSPECIFIED SITES),4,Extreme,Extreme,Surgical,Medicaid,,,,,Y,449513.18,258507.84
New York City,Manhattan,7002001,001438,Bellevue Hospital Center,50 to 69,112,F,Other Race,Not Span/Hispanic,5,Emergency,Left Against Medical Advice,2020,INF002,SEPTICEMIA,MST026,FINGER AND OTHER UPPER EXTREMITY AMPUTATION,710,INFECTIOUS & PARASITIC DISEASES INCLUDING HIV W O.R. PROCEDURE,18,INFECTIOUS AND PARASITIC DISEASES (SYSTEMIC OR UNSPECIFIED SITES),3,Major,Major,Surgical,Medicaid,,,,,Y,43418.16,24969.09
New York City,Manhattan,7002001,001438,Bellevue Hospital Center,50 to 69,100,M,Other Race,Spanish/Hispanic,5,Emergency,Home or Self Care,2020,INF002,SEPTICEMIA,HEP006,CHOLECYSTECTOMY,710,INFECTIOUS & PARASITIC DISEASES INCLUDING HIV W O.R. PROCEDURE,18,INFECTIOUS AND PARASITIC DISEASES (SYSTEMIC OR UNSPECIFIED SITES),2,Moderate,Moderate,Surgical,Medicaid,,,,,Y,107416.01,61773.23
New York City,Manhattan,7002001,001438,Bellevue Hospital Center,30 to 49,100,M,Black/African American,Not Span/Hispanic,11,Emergency,Home or Self Care,2020,INF002,SEPTICEMIA,GIS008,APPENDECTOMY,710,INFECTIOUS & PARASITIC DISEASES INCLUDING HIV W O.R. PROCEDURE,18,INFECTIOUS AND PARASITIC DISEASES (SYSTEMIC OR UNSPECIFIED SITES),3,Major,Moderate,Surgical,Medicaid,,,,,Y,105542.55,60695.83
New York City,Manhattan,7002001,001438,Bellevue Hospital Center,30 to 49,112,M,Other Race,Spanish/Hispanic,23,Emergency,Home or Self Care,2020,INF004,FUNGAL INFECTIONS,ENT008,NASAL AND SINUS EXCISION,710,INFECTIOUS & PARASITIC DISEASES INCLUDING HIV W O.R. PROCEDURE,18,INFECTIOUS AND PARASITIC DISEASES (SYSTEMIC OR UNSPECIFIED SITES),2,Moderate,Major,Surgical,Medicaid,,,,,Y,246663.6,141852.29
New York City,Manhattan,7002001,001438,Bellevue Hospital Center,0 to 17,112,F,Other Race,Spanish/Hispanic,10,Emergency,Home or Self Care,2020,INF002,SEPTICEMIA,GIS008,APPENDECTOMY,710,INFECTIOUS & PARASITIC DISEASES INCLUDING HIV W O.R. PROCEDURE,18,INFECTIOUS AND PARASITIC DISEASES (SYSTEMIC OR UNSPECIFIED SITES),2,Moderate,Moderate,Surgical,Medicaid,,,,,Y,80664.28,46388.74
New York City,Manhattan,7002001,001438,Bellevue Hospital Center,30 to 49,112,M,Other Race,Spanish/Hispanic,18,Emergency,Home w/ Home Health Services,2020,INF002,SEPTICEMIA,MST023,TOE AND MID FOOT AMPUTATION,710,INFECTIOUS & PARASITIC DISEASES INCLUDING HIV W O.R. PROCEDURE,18,INFECTIOUS AND PARASITIC DISEASES (SYSTEMIC OR UNSPECIFIED SITES),3,Major,Moderate,Surgical,Medicaid,,,,,Y,169302.76,97363.31
New York City,Manhattan,7002001,001438,Bellevue Hospital Center,50 to 69,114,M,Black/African American,Not Span/Hispanic,9,Urgent,Home w/ Home Health Services,2020,INF002,SEPTICEMIA,RES008,"LUNG, PLEURA, OR DIAPHRAGM RESECTION (OPEN AND THORACOSCOPIC)",710,INFECTIOUS & PARASITIC DISEASES INCLUDING HIV W O.R. PROCEDURE,18,INFECTIOUS AND PARASITIC DISEASES (SYSTEMIC OR UNSPECIFIED SITES),4,Extreme,Major,Surgical,Private Health Insurance,,,,,N,120101.1,69068.22
New York City,Manhattan,7002001,001438,Bellevue Hospital Center,30 to 49,112,F,Other Race,Not Span/Hispanic,10,Emergency,Home or Self Care,2020,INF002,SEPTICEMIA,MST020,SUBCUTANEOUS TISSUE AND FASCIA EXCISION,710,INFECTIOUS & PARASITIC DISEASES INCLUDING HIV W O.R. PROCEDURE,18,INFECTIOUS AND PARASITIC DISEASES (SYSTEMIC OR UNSPECIFIED SITES),3,Major,Moderate,Surgical,Medicaid,,,,,Y,90482.68,52035.14
New York City,Manhattan,7002001,001438,Bellevue Hospital Center,70 or Older,114,M,Other Race,Not Span/Hispanic,21,Emergency,Skilled Nursing Home,2020,INF002,SEPTICEMIA,MST023,TOE AND MID FOOT AMPUTATION,710,INFECTIOUS & PARASITIC DISEASES INCLUDING HIV W O.R. PROCEDURE,18,INFECTIOUS AND PARASITIC DISEASES (SYSTEMIC OR UNSPECIFIED SITES),3,Major,Major,Surgical,Medicare,Medicaid,,,,N,210598.4,121111.77
New York City,Manhattan,7002001,001438,Bellevue Hospital Center,50 to 69,115,M,Other Race,Not Span/Hispanic,6,Emergency,Home w/ Home Health Services,2020,INF002,SEPTICEMIA,MST023,TOE AND MID FOOT AMPUTATION,710,INFECTIOUS & PARASITIC DISEASES INCLUDING HIV W O.R. PROCEDURE,18,INFECTIOUS AND PARASITIC DISEASES (SYSTEMIC OR UNSPECIFIED SITES),3,Major,Extreme,Surgical,Medicaid,,,,,Y,97799.44,56242.89
New York City,Manhattan,7002001,001438,Bellevue Hospital Center,70 or Older,100,F,Other Race,Not Span/Hispanic,5,Emergency,Home w/ Home Health Services,2020,INF002,SEPTICEMIA,HEP006,CHOLECYSTECTOMY,710,INFECTIOUS & PARASITIC DISEASES INCLUDING HIV W O.R. PROCEDURE,18,INFECTIOUS AND PARASITIC DISEASES (SYSTEMIC OR UNSPECIFIED SITES),3,Major,Moderate,Surgical,Medicaid,Medicaid,,,,Y,107508.67,61826.52
New York City,Manhattan,7002001,001438,Bellevue Hospital Center,70 or Older,100,M,Other Race,Spanish/Hispanic,16,Emergency,Home w/ Home Health Services,2020,INF002,SEPTICEMIA,RES002,"LUNG, PLEURA, OR DIAPHRAGM BIOPSY (NON-ENDOSCOPIC)",710,INFECTIOUS & PARASITIC DISEASES INCLUDING HIV W O.R. PROCEDURE,18,INFECTIOUS AND PARASITIC DISEASES (SYSTEMIC OR UNSPECIFIED SITES),3,Major,Major,Surgical,Medicare,,,,,Y,173898.49,100006.24
New York City,Manhattan,7002001,001438,Bellevue Hospital Center,50 to 69,104,M,Other Race,Spanish/Hispanic,6,Urgent,Home or Self Care,2020,INF002,SEPTICEMIA,HEP006,CHOLECYSTECTOMY,710,INFECTIOUS & PARASITIC DISEASES INCLUDING HIV W O.R. PROCEDURE,18,INFECTIOUS AND PARASITIC DISEASES (SYSTEMIC OR UNSPECIFIED SITES),3,Major,Moderate,Surgical,Medicare,Medicaid,,,,N,91428.29,52578.95
New York City,Manhattan,7002001,001438,Bellevue Hospital Center,30 to 49,104,M,White,Not Span/Hispanic,18,Urgent,Skilled Nursing Home,2020,INF002,SEPTICEMIA,MST001,ARTHROCENTESIS,710,INFECTIOUS & PARASITIC DISEASES INCLUDING HIV W O.R. PROCEDURE,18,INFECTIOUS AND PARASITIC DISEASES (SYSTEMIC OR UNSPECIFIED SITES),4,Extreme,Extreme,Surgical,Medicaid,,,,,N,224291.91,128986.69
New York City,Manhattan,7002001,001438,Bellevue Hospital Center,50 to 69,100,M,Other Race,Spanish/Hispanic,7,Emergency,Home or Self Care,2020,INF002,SEPTICEMIA,SKB002,INCISION AND DRAINAGE OF SKIN,710,INFECTIOUS & PARASITIC DISEASES INCLUDING HIV W O.R. PROCEDURE,18,INFECTIOUS AND PARASITIC DISEASES (SYSTEMIC OR UNSPECIFIED SITES),2,Moderate,Moderate,Surgical,Medicare,Medicaid,,,,Y,67156.44,38620.59
New York City,Manhattan,7002001,001438,Bellevue Hospital Center,30 to 49,113,M,Other Race,Spanish/Hispanic,1,Emergency,Home or Self Care,2020,INF002,SEPTICEMIA,HEP006,CHOLECYSTECTOMY,710,INFECTIOUS & PARASITIC DISEASES INCLUDING HIV W O.R. PROCEDURE,18,INFECTIOUS AND PARASITIC DISEASES (SYSTEMIC OR UNSPECIFIED SITES),3,Major,Moderate,Surgical,Medicaid,,,,,Y,55890.96,32142
New York City,Manhattan,7002001,001438,Bellevue Hospital Center,50 to 69,104,M,Other Race,Unknown,26,Urgent,Skilled Nursing Home,2020,INF002,SEPTICEMIA,EYP001,EYE PROCEDURES,710,INFECTIOUS & PARASITIC DISEASES INCLUDING HIV W O.R. PROCEDURE,18,INFECTIOUS AND PARASITIC DISEASES (SYSTEMIC OR UNSPECIFIED SITES),3,Major,Major,Surgical,Medicare,,,,,N,266984.55,153538.54
New York City,Manhattan,7002001,001438,Bellevue Hospital Center,50 to 69,112,M,Other Race,Spanish/Hispanic,20,Emergency,Inpatient Rehabilitation Facility,2020,INF002,SEPTICEMIA,MST024,BELOW KNEE AMPUTATION,710,INFECTIOUS & PARASITIC DISEASES INCLUDING HIV W O.R. PROCEDURE,18,INFECTIOUS AND PARASITIC DISEASES (SYSTEMIC OR UNSPECIFIED SITES),3,Major,Major,Surgical,Medicaid,,,,,Y,221080.43,127139.82
New York City,Manhattan,7002001,001438,Bellevue Hospital Center,70 or Older,100,F,Other Race,Spanish/Hispanic,5,Urgent,Home w/ Home Health Services,2020,INF002,SEPTICEMIA,CAR004,PERCUTANEOUS CORONARY INTERVENTIONS (PCI),710,INFECTIOUS & PARASITIC DISEASES INCLUDING HIV W O.R. PROCEDURE,18,INFECTIOUS AND PARASITIC DISEASES (SYSTEMIC OR UNSPECIFIED SITES),3,Major,Major,Surgical,Medicare,,,,,N,57572.49,33109.02
New York City,Manhattan,7002001,001438,Bellevue Hospital Center,30 to 49,113,F,Other Race,Spanish/Hispanic,7,Emergency,Home or Self Care,2020,INF002,SEPTICEMIA,HEP006,CHOLECYSTECTOMY,710,INFECTIOUS & PARASITIC DISEASES INCLUDING HIV W O.R. PROCEDURE,18,INFECTIOUS AND PARASITIC DISEASES (SYSTEMIC OR UNSPECIFIED SITES),3,Major,Moderate,Surgical,Medicaid,,,,,Y,96397.55,55436.69
New York City,Manhattan,7002001,001438,Bellevue Hospital Center,50 to 69,113,M,Other Race,Spanish/Hispanic,21,Emergency,Inpatient Rehabilitation Facility,2020,INF002,SEPTICEMIA,MST024,BELOW KNEE AMPUTATION,710,INFECTIOUS & PARASITIC DISEASES INCLUDING HIV W O.R. PROCEDURE,18,INFECTIOUS AND PARASITIC DISEASES (SYSTEMIC OR UNSPECIFIED SITES),4,Extreme,Extreme,Surgical,Medicaid,,,,,Y,169001.03,97189.79
New York City,Manhattan,7002001,001438,Bellevue Hospital Center,30 to 49,100,F,Black/African American,Unknown,6,Emergency,Home or Self Care,2020,INF002,SEPTICEMIA,FRS002,OOPHORECTOMY,710,INFECTIOUS & PARASITIC DISEASES INCLUDING HIV W O.R. PROCEDURE,18,INFECTIOUS AND PARASITIC DISEASES (SYSTEMIC OR UNSPECIFIED SITES),1,Minor,Moderate,Surgical,Medicaid,,,,,Y,88242.27,50746.72
New York City,Manhattan,7002001,001438,Bellevue Hospital Center,30 to 49,112,M,Other Race,Spanish/Hispanic,19,Emergency,Home w/ Home Health Services,2020,INF002,SEPTICEMIA,GNR007,"MEDIASTINAL PROCEDURES, NEC",710,INFECTIOUS & PARASITIC DISEASES INCLUDING HIV W O.R. PROCEDURE,18,INFECTIOUS AND PARASITIC DISEASES (SYSTEMIC OR UNSPECIFIED SITES),3,Major,Major,Surgical,Medicaid,,,,,Y,157008.13,90292.86
New York City,Manhattan,7002001,001438,Bellevue Hospital Center,30 to 49,112,M,Black/African American,Not Span/Hispanic,18,Emergency,Skilled Nursing Home,2020,INF002,SEPTICEMIA,MST023,TOE AND MID FOOT AMPUTATION,710,INFECTIOUS & PARASITIC DISEASES INCLUDING HIV W O.R. PROCEDURE,18,INFECTIOUS AND PARASITIC DISEASES (SYSTEMIC OR UNSPECIFIED SITES),3,Major,Major,Surgical,Medicaid,,,,,Y,138320.78,79546.07
New York City,Manhattan,7002001,001438,Bellevue Hospital Center,50 to 69,113,M,Other Race,Not Span/Hispanic,5,Emergency,Home or Self Care,2020,INF002,SEPTICEMIA,HEP006,CHOLECYSTECTOMY,710,INFECTIOUS & PARASITIC DISEASES INCLUDING HIV W O.R. PROCEDURE,18,INFECTIOUS AND PARASITIC DISEASES (SYSTEMIC OR UNSPECIFIED SITES),3,Major,Major,Surgical,Medicaid,,,,,Y,68313.53,39286.02
New York City,Manhattan,7002001,001438,Bellevue Hospital Center,0 to 17,112,F,Other Race,Spanish/Hispanic,7,Emergency,Home or Self Care,2020,INF002,SEPTICEMIA,GIS008,APPENDECTOMY,710,INFECTIOUS & PARASITIC DISEASES INCLUDING HIV W O.R. PROCEDURE,18,INFECTIOUS AND PARASITIC DISEASES (SYSTEMIC OR UNSPECIFIED SITES),3,Major,Major,Surgical,Medicaid,,,,,Y,62583.61,35990.83
New York City,Manhattan,7002001,001438,Bellevue Hospital Center,30 to 49,112,M,Black/African American,Not Span/Hispanic,37,Emergency,Home w/ Home Health Services,2020,INF002,SEPTICEMIA,ADM015,ADMINISTRATION OF ANTIBIOTICS,710,INFECTIOUS & PARASITIC DISEASES INCLUDING HIV W O.R. PROCEDURE,18,INFECTIOUS AND PARASITIC DISEASES (SYSTEMIC OR UNSPECIFIED SITES),4,Extreme,Extreme,Surgical,Medicaid,,,,,Y,338596.29,194721.31
New York City,Manhattan,7002001,001438,Bellevue Hospital Center,50 to 69,112,F,Black/African American,Not Span/Hispanic,11,Urgent,Home or Self Care,2020,INF002,SEPTICEMIA,RES005,CHEST TUBE PLACEMENT AND THERAPEUTIC THORACENTESIS,710,INFECTIOUS & PARASITIC DISEASES INCLUDING HIV W O.R. PROCEDURE,18,INFECTIOUS AND PARASITIC DISEASES (SYSTEMIC OR UNSPECIFIED SITES),4,Extreme,Extreme,Surgical,Private Health Insurance,Medicare,,,,N,113235,65119.64
New York City,Manhattan,7002001,001438,Bellevue Hospital Center,70 or Older,100,M,Other Race,Spanish/Hispanic,22,Emergency,Skilled Nursing Home,2020,INF002,SEPTICEMIA,GIS009,COLECTOMY,710,INFECTIOUS & PARASITIC DISEASES INCLUDING HIV W O.R. PROCEDURE,18,INFECTIOUS AND PARASITIC DISEASES (SYSTEMIC OR UNSPECIFIED SITES),4,Extreme,Extreme,Surgical,Medicare,,,,,Y,325131.69,186978.03
New York City,Manhattan,7002001,001438,Bellevue Hospital Center,50 to 69,100,M,Black/African American,Not Span/Hispanic,10,Emergency,Home or Self Care,2020,INF002,SEPTICEMIA,MST019,"MUSCLE, TENDON, BURSA, AND LIGAMENT EXCISION",710,INFECTIOUS & PARASITIC DISEASES INCLUDING HIV W O.R. PROCEDURE,18,INFECTIOUS AND PARASITIC DISEASES (SYSTEMIC OR UNSPECIFIED SITES),2,Moderate,Moderate,Surgical,Medicaid,,,,,Y,78522.69,45157.14
New York City,Manhattan,7002001,001438,Bellevue Hospital Center,50 to 69,100,F,Black/African American,Unknown,19,Emergency,Home w/ Home Health Services,2020,INF002,SEPTICEMIA,RES012,RELEASE OF LUNG AND PLEURA,710,INFECTIOUS & PARASITIC DISEASES INCLUDING HIV W O.R. PROCEDURE,18,INFECTIOUS AND PARASITIC DISEASES (SYSTEMIC OR UNSPECIFIED SITES),4,Extreme,Extreme,Surgical,Medicaid,,,,,Y,250992.16,144341.58
New York City,Manhattan,7002001,001438,Bellevue Hospital Center,50 to 69,100,M,Black/African American,Unknown,14,Emergency,Home w/ Home Health Services,2020,INF002,SEPTICEMIA,MST023,TOE AND MID FOOT AMPUTATION,710,INFECTIOUS & PARASITIC DISEASES INCLUDING HIV W O.R. PROCEDURE,18,INFECTIOUS AND PARASITIC DISEASES (SYSTEMIC OR UNSPECIFIED SITES),4,Extreme,Major,Surgical,Private Health Insurance,,,,,Y,153896.19,88503.24
New York City,Manhattan,7002001,001438,Bellevue Hospital Center,50 to 69,101,F,White,Not Span/Hispanic,14,Emergency,Home w/ Home Health Services,2020,INF002,SEPTICEMIA,GIS009,COLECTOMY,710,INFECTIOUS & PARASITIC DISEASES INCLUDING HIV W O.R. PROCEDURE,18,INFECTIOUS AND PARASITIC DISEASES (SYSTEMIC OR UNSPECIFIED SITES),2,Moderate,Moderate,Surgical,Medicare,Medicaid,,,,Y,145942.33,83929.1
New York City,Manhattan,7002001,001438,Bellevue Hospital Center,50 to 69,112,F,Black/African American,Not Span/Hispanic,20,Urgent,Inpatient Rehabilitation Facility,2020,INF002,SEPTICEMIA,CNS007,CNS EXCISION PROCEDURES,710,INFECTIOUS & PARASITIC DISEASES INCLUDING HIV W O.R. PROCEDURE,18,INFECTIOUS AND PARASITIC DISEASES (SYSTEMIC OR UNSPECIFIED SITES),3,Major,Major,Surgical,Medicare,Medicaid,,,,N,342673.7,197066.16
New York City,Manhattan,7002001,001438,Bellevue Hospital Center,50 to 69,113,F,Other Race,Not Span/Hispanic,3,Emergency,Home or Self Care,2020,INF002,SEPTICEMIA,HEP006,CHOLECYSTECTOMY,710,INFECTIOUS & PARASITIC DISEASES INCLUDING HIV W O.R. PROCEDURE,18,INFECTIOUS AND PARASITIC DISEASES (SYSTEMIC OR UNSPECIFIED SITES),2,Moderate,Major,Surgical,Medicaid,,,,,Y,54151.84,31141.86
New York City,Manhattan,7002001,001438,Bellevue Hospital Center,30 to 49,104,M,Other Race,Spanish/Hispanic,35,Emergency,Home w/ Home Health Services,2020,INF002,SEPTICEMIA,ADM015,ADMINISTRATION OF ANTIBIOTICS,710,INFECTIOUS & PARASITIC DISEASES INCLUDING HIV W O.R. PROCEDURE,18,INFECTIOUS AND PARASITIC DISEASES (SYSTEMIC OR UNSPECIFIED SITES),4,Extreme,Extreme,Surgical,Medicaid,,,,,Y,293029.5,168516.58
New York City,Manhattan,7002001,001438,Bellevue Hospital Center,0 to 17,113,F,Other Race,Spanish/Hispanic,10,Emergency,Home or Self Care,2020,INF002,SEPTICEMIA,GIS008,APPENDECTOMY,710,INFECTIOUS & PARASITIC DISEASES INCLUDING HIV W O.R. PROCEDURE,18,INFECTIOUS AND PARASITIC DISEASES (SYSTEMIC OR UNSPECIFIED SITES),2,Moderate,Moderate,Surgical,Medicaid,,,,,Y,93226.24,53612.92
New York City,Manhattan,7002001,001438,Bellevue Hospital Center,70 or Older,112,M,White,Unknown,18,Emergency,Expired,2020,INF002,SEPTICEMIA,ESA003,MECHANICAL VENTILATION,710,INFECTIOUS & PARASITIC DISEASES INCLUDING HIV W O.R. PROCEDURE,18,INFECTIOUS AND PARASITIC DISEASES (SYSTEMIC OR UNSPECIFIED SITES),4,Extreme,Extreme,Surgical,Medicare,Medicaid,,,,Y,232102.36,133478.35
New York City,Manhattan,7002001,001438,Bellevue Hospital Center,30 to 49,114,M,Black/African American,Spanish/Hispanic,11,Urgent,Inpatient Rehabilitation Facility,2020,INF002,SEPTICEMIA,ADM015,ADMINISTRATION OF ANTIBIOTICS,710,INFECTIOUS & PARASITIC DISEASES INCLUDING HIV W O.R. PROCEDURE,18,INFECTIOUS AND PARASITIC DISEASES (SYSTEMIC OR UNSPECIFIED SITES),4,Extreme,Extreme,Surgical,Medicaid,,,,,N,255430.37,146893.92
New York City,Manhattan,7002001,001438,Bellevue Hospital Center,0 to 17,112,M,White,Not Span/Hispanic,7,Emergency,Home or Self Care,2020,INF002,SEPTICEMIA,GIS008,APPENDECTOMY,710,INFECTIOUS & PARASITIC DISEASES INCLUDING HIV W O.R. PROCEDURE,18,INFECTIOUS AND PARASITIC DISEASES (SYSTEMIC OR UNSPECIFIED SITES),4,Extreme,Major,Surgical,Medicaid,,,,,Y,66104.66,38015.73
New York City,Manhattan,7002001,001438,Bellevue Hospital Center,50 to 69,112,F,Black/African American,Not Span/Hispanic,14,Elective,Home w/ Home Health Services,2020,INF002,SEPTICEMIA,FRS001,HYSTERECTOMY,710,INFECTIOUS & PARASITIC DISEASES INCLUDING HIV W O.R. PROCEDURE,18,INFECTIOUS AND PARASITIC DISEASES (SYSTEMIC OR UNSPECIFIED SITES),4,Extreme,Extreme,Surgical,Medicaid,,,,,N,166722.44,95879.41