Hospital Service Area,Hospital County,Operating Certificate Number,Permanent Facility Id,Facility Name,Age Group,Zip Code - 3 digits,Gender,Race,Ethnicity,Length of Stay,Type of Admission,Patient Disposition,Discharge Year,CCS Diagnosis Code,CCS Diagnosis Description,CCS Procedure Code,CCS Procedure Description,APR DRG Code,APR DRG Description,APR MDC Code,APR MDC Description,APR Severity of Illness Code,APR Severity of Illness Description,APR Risk of Mortality,APR Medical Surgical Description,Payment Typology 1,Payment Typology 2,Payment Typology 3,Birth Weight,Abortion Edit Indicator,Emergency Department Indicator,Total Charges,Total Costs
New York City,Manhattan,7002001,001438,Bellevue Hospital Center,70 or Older,100,M,Other Race,Not Span/Hispanic,2,Emergency,Home or Self Care,2017,237,Complication of device; implant or graft,099,OT OR GI THER PRCS,711,"Post-op, post-trauma, other device infections w O.R. procedure",18,"Infectious and Parasitic Diseases, Systemic or Unspecified Sites",2,Moderate,Minor,Surgical,Medicare,Medicare,Medicaid,,N,Y,15411.96,9936.83
New York City,Manhattan,7002001,001438,Bellevue Hospital Center,30 to 49,113,M,Other Race,Not Span/Hispanic,6,Emergency,Left Against Medical Advice,2017,238,Complications of surgical procedures or medical care,097,OTHER GI DX PRCS,711,"Post-op, post-trauma, other device infections w O.R. procedure",18,"Infectious and Parasitic Diseases, Systemic or Unspecified Sites",3,Major,Major,Surgical,Medicaid,Medicaid,,,N,Y,44594.28,28752.07
New York City,Manhattan,7002001,001438,Bellevue Hospital Center,70 or Older,100,M,Other Race,Not Span/Hispanic,63,Emergency,Inpatient Rehabilitation Facility,2017,238,Complications of surgical procedures or medical care,162,OT OR THER PRC ON JOINT,711,"Post-op, post-trauma, other device infections w O.R. procedure",18,"Infectious and Parasitic Diseases, Systemic or Unspecified Sites",4,Extreme,Major,Surgical,Medicaid,Medicaid,,,N,Y,318851.73,205579.02
New York City,Manhattan,7002001,001438,Bellevue Hospital Center,30 to 49,104,F,Other Race,Not Span/Hispanic,6,Emergency,Home or Self Care,2017,237,Complication of device; implant or graft,175,OT OR THER PRC SKN/BRST,711,"Post-op, post-trauma, other device infections w O.R. procedure",18,"Infectious and Parasitic Diseases, Systemic or Unspecified Sites",2,Moderate,Minor,Surgical,Medicaid,Medicaid,,,N,Y,32823.45,21162.85
New York City,Manhattan,7002001,001438,Bellevue Hospital Center,0 to 17,113,F,Other Race,Spanish/Hispanic,1,Emergency,Home or Self Care,2017,238,Complications of surgical procedures or medical care,168,"INCIS/DRAIN, SKIN/SUBCU",711,"Post-op, post-trauma, other device infections w O.R. procedure",18,"Infectious and Parasitic Diseases, Systemic or Unspecified Sites",1,Minor,Minor,Surgical,Medicaid,Medicaid,,,N,Y,6715.57,4329.85
New York City,Manhattan,7002001,001438,Bellevue Hospital Center,30 to 49,104,M,Black/African American,Not Span/Hispanic,1,Emergency,Home or Self Care,2017,237,Complication of device; implant or graft,175,OT OR THER PRC SKN/BRST,711,"Post-op, post-trauma, other device infections w O.R. procedure",18,"Infectious and Parasitic Diseases, Systemic or Unspecified Sites",1,Minor,Minor,Surgical,Miscellaneous/Other,,,,N,Y,7385.52,4761.80
New York City,Manhattan,7002001,001438,Bellevue Hospital Center,30 to 49,112,M,White,Not Span/Hispanic,2,Emergency,Left Against Medical Advice,2017,238,Complications of surgical procedures or medical care,168,"INCIS/DRAIN, SKIN/SUBCU",711,"Post-op, post-trauma, other device infections w O.R. procedure",18,"Infectious and Parasitic Diseases, Systemic or Unspecified Sites",2,Moderate,Minor,Surgical,Medicaid,,,,N,Y,13242.95,8538.37
New York City,Manhattan,7002001,001438,Bellevue Hospital Center,30 to 49,112,F,Other Race,Not Span/Hispanic,14,Emergency,Home or Self Care,2017,238,Complications of surgical procedures or medical care,099,OT OR GI THER PRCS,711,"Post-op, post-trauma, other device infections w O.R. procedure",18,"Infectious and Parasitic Diseases, Systemic or Unspecified Sites",4,Extreme,Major,Surgical,Medicaid,Medicaid,,,N,N,83682.51,53954.13
New York City,Manhattan,7002001,001438,Bellevue Hospital Center,30 to 49,100,M,Other Race,Not Span/Hispanic,5,Emergency,Home w/ Home Health Services,2017,238,Complications of surgical procedures or medical care,168,"INCIS/DRAIN, SKIN/SUBCU",711,"Post-op, post-trauma, other device infections w O.R. procedure",18,"Infectious and Parasitic Diseases, Systemic or Unspecified Sites",1,Minor,Minor,Surgical,Medicaid,Medicaid,,,N,Y,29822.34,19227.89
New York City,Manhattan,7002001,001438,Bellevue Hospital Center,30 to 49,114,F,Other Race,Not Span/Hispanic,17,Emergency,Home or Self Care,2017,238,Complications of surgical procedures or medical care,157,AMPUTATE LOWER EXTRMITY,711,"Post-op, post-trauma, other device infections w O.R. procedure",18,"Infectious and Parasitic Diseases, Systemic or Unspecified Sites",2,Moderate,Minor,Surgical,Medicaid,,,,N,Y,97521.04,62876.50
New York City,Manhattan,7002001,001438,Bellevue Hospital Center,70 or Older,104,M,Black/African American,Not Span/Hispanic,3,Emergency,Home or Self Care,2017,238,Complications of surgical procedures or medical care,111,OT NON-OR THER PRC URIN,711,"Post-op, post-trauma, other device infections w O.R. procedure",18,"Infectious and Parasitic Diseases, Systemic or Unspecified Sites",3,Major,Major,Surgical,Medicaid,,,,N,Y,23032.80,14850.35
New York City,Manhattan,7002001,001438,Bellevue Hospital Center,70 or Older,100,M,Black/African American,Not Span/Hispanic,7,Emergency,Skilled Nursing Home,2017,238,Complications of surgical procedures or medical care,157,AMPUTATE LOWER EXTRMITY,711,"Post-op, post-trauma, other device infections w O.R. procedure",18,"Infectious and Parasitic Diseases, Systemic or Unspecified Sites",3,Major,Major,Surgical,Medicaid,,,,N,N,37824.42,24387.22
New York City,Manhattan,7002001,001438,Bellevue Hospital Center,50 to 69,114,F,Other Race,Spanish/Hispanic,8,Emergency,Home or Self Care,2017,238,Complications of surgical procedures or medical care,156,"INJ/ASP MUSC,TENDONS,ST",711,"Post-op, post-trauma, other device infections w O.R. procedure",18,"Infectious and Parasitic Diseases, Systemic or Unspecified Sites",1,Minor,Minor,Surgical,Medicaid,,,,N,Y,48404.82,31208.91
New York City,Manhattan,7002001,001438,Bellevue Hospital Center,30 to 49,112,F,Black/African American,Not Span/Hispanic,45,Elective,Home w/ Home Health Services,2017,238,Complications of surgical procedures or medical care,161,OT OR THER PRCS ON BONE,711,"Post-op, post-trauma, other device infections w O.R. procedure",18,"Infectious and Parasitic Diseases, Systemic or Unspecified Sites",3,Major,Minor,Surgical,Medicaid,Medicaid,,,N,N,224364.28,144658.42
New York City,Manhattan,7002001,001438,Bellevue Hospital Center,50 to 69,100,M,Black/African American,Not Span/Hispanic,46,Emergency,Skilled Nursing Home,2017,238,Complications of surgical procedures or medical care,222,BLOOD TRANSFUSION,711,"Post-op, post-trauma, other device infections w O.R. procedure",18,"Infectious and Parasitic Diseases, Systemic or Unspecified Sites",3,Major,Minor,Surgical,Medicaid,Medicaid,,,N,Y,237326.13,153015.55
New York City,Manhattan,7002001,001438,Bellevue Hospital Center,50 to 69,112,F,Other Race,Spanish/Hispanic,8,Emergency,Home w/ Home Health Services,2017,238,Complications of surgical procedures or medical care,099,OT OR GI THER PRCS,711,"Post-op, post-trauma, other device infections w O.R. procedure",18,"Infectious and Parasitic Diseases, Systemic or Unspecified Sites",3,Major,Moderate,Surgical,Medicaid,Medicaid,,,N,Y,45262.75,29183.07
New York City,Manhattan,7002001,001438,Bellevue Hospital Center,30 to 49,113,M,White,Not Span/Hispanic,4,Emergency,Home or Self Care,2017,238,Complications of surgical procedures or medical care,094,OT OR UP GI THER PRCS,711,"Post-op, post-trauma, other device infections w O.R. procedure",18,"Infectious and Parasitic Diseases, Systemic or Unspecified Sites",2,Moderate,Moderate,Surgical,Medicaid,,,,N,N,25150.87,16215.97
New York City,Manhattan,7002001,001438,Bellevue Hospital Center,30 to 49,112,M,Other Race,Not Span/Hispanic,6,Emergency,Home w/ Home Health Services,2017,238,Complications of surgical procedures or medical care,168,"INCIS/DRAIN, SKIN/SUBCU",711,"Post-op, post-trauma, other device infections w O.R. procedure",18,"Infectious and Parasitic Diseases, Systemic or Unspecified Sites",2,Moderate,Minor,Surgical,Medicaid,,,,N,Y,33460.85,21573.82
New York City,Manhattan,7002001,001438,Bellevue Hospital Center,50 to 69,114,F,Other Race,Not Span/Hispanic,45,Emergency,Home or Self Care,2017,238,Complications of surgical procedures or medical care,142,PARTIAL EXCISION BONE,711,"Post-op, post-trauma, other device infections w O.R. procedure",18,"Infectious and Parasitic Diseases, Systemic or Unspecified Sites",2,Moderate,Minor,Surgical,Medicaid,Medicaid,,,N,N,225630.89,145475.07
New York City,Manhattan,7002001,001438,Bellevue Hospital Center,70 or Older,113,F,Other Race,Not Span/Hispanic,12,Emergency,Home w/ Home Health Services,2017,238,Complications of surgical procedures or medical care,156,"INJ/ASP MUSC,TENDONS,ST",711,"Post-op, post-trauma, other device infections w O.R. procedure",18,"Infectious and Parasitic Diseases, Systemic or Unspecified Sites",3,Major,Moderate,Surgical,Medicare,Medicaid,,,N,N,66510.18,42882.31
New York City,Manhattan,7002001,001438,Bellevue Hospital Center,70 or Older,100,F,Other Race,Spanish/Hispanic,4,Elective,Home or Self Care,2017,237,Complication of device; implant or graft,086,OTHER HERNIA REPAIR,711,"Post-op, post-trauma, other device infections w O.R. procedure",18,"Infectious and Parasitic Diseases, Systemic or Unspecified Sites",1,Minor,Moderate,Surgical,Medicare,Medicare,Medicaid,,N,N,22963.06,14805.39
New York City,Manhattan,7002001,001438,Bellevue Hospital Center,70 or Older,113,F,Other Race,Not Span/Hispanic,6,Emergency,Home or Self Care,2017,238,Complications of surgical procedures or medical care,097,OTHER GI DX PRCS,711,"Post-op, post-trauma, other device infections w O.R. procedure",18,"Infectious and Parasitic Diseases, Systemic or Unspecified Sites",1,Minor,Minor,Surgical,Medicare,Medicaid,,,N,Y,38210.99,24636.46
New York City,Manhattan,7002001,001438,Bellevue Hospital Center,50 to 69,113,F,Other Race,Not Span/Hispanic,2,Emergency,Home or Self Care,2017,237,Complication of device; implant or graft,175,OT OR THER PRC SKN/BRST,711,"Post-op, post-trauma, other device infections w O.R. procedure",18,"Infectious and Parasitic Diseases, Systemic or Unspecified Sites",2,Moderate,Minor,Surgical,Medicaid,,,,N,Y,13149.89,8478.37
New York City,Manhattan,7002001,001438,Bellevue Hospital Center,30 to 49,112,F,Black/African American,Not Span/Hispanic,16,Emergency,Home w/ Home Health Services,2017,237,Complication of device; implant or graft,161,OT OR THER PRCS ON BONE,711,"Post-op, post-trauma, other device infections w O.R. procedure",18,"Infectious and Parasitic Diseases, Systemic or Unspecified Sites",3,Major,Minor,Surgical,Medicaid,Medicaid,,,N,Y,111973.04,72194.39
New York City,Manhattan,7002001,001438,Bellevue Hospital Center,70 or Older,100,M,Other Race,Not Span/Hispanic,10,Emergency,Inpatient Rehabilitation Facility,2017,237,Complication of device; implant or graft,171,SUTURE SKIN/SUBCUT TISS,711,"Post-op, post-trauma, other device infections w O.R. procedure",18,"Infectious and Parasitic Diseases, Systemic or Unspecified Sites",3,Major,Major,Surgical,Medicare,Medicare,Medicaid,,N,Y,61679.49,39767.73
New York City,Manhattan,7002001,001438,Bellevue Hospital Center,50 to 69,100,M,Other Race,Not Span/Hispanic,60,Emergency,Home or Self Care,2017,237,Complication of device; implant or graft,162,OT OR THER PRC ON JOINT,711,"Post-op, post-trauma, other device infections w O.R. procedure",18,"Infectious and Parasitic Diseases, Systemic or Unspecified Sites",3,Major,Moderate,Surgical,Medicaid,Medicaid,,,N,Y,308870.77,199143.81
New York City,Manhattan,7002001,001438,Bellevue Hospital Center,30 to 49,112,M,Other Race,Spanish/Hispanic,2,Emergency,Home or Self Care,2017,238,Complications of surgical procedures or medical care,175,OT OR THER PRC SKN/BRST,711,"Post-op, post-trauma, other device infections w O.R. procedure",18,"Infectious and Parasitic Diseases, Systemic or Unspecified Sites",1,Minor,Minor,Surgical,Medicaid,,,,N,N,13433.58,8661.27
New York City,Manhattan,7002001,001438,Bellevue Hospital Center,30 to 49,112,M,White,Not Span/Hispanic,18,Emergency,Home or Self Care,2017,238,Complications of surgical procedures or medical care,160,OT THER PRCS ON MUSCLES,711,"Post-op, post-trauma, other device infections w O.R. procedure",18,"Infectious and Parasitic Diseases, Systemic or Unspecified Sites",2,Moderate,Minor,Surgical,Miscellaneous/Other,Private Health Insurance,,,N,Y,93765.25,60454.96
New York City,Manhattan,7002001,001438,Bellevue Hospital Center,50 to 69,113,M,Black/African American,Not Span/Hispanic,6,Emergency,Home or Self Care,2017,238,Complications of surgical procedures or medical care,099,OT OR GI THER PRCS,711,"Post-op, post-trauma, other device infections w O.R. procedure",18,"Infectious and Parasitic Diseases, Systemic or Unspecified Sites",2,Moderate,Minor,Surgical,Department of Corrections,,,,N,Y,33281.80,21458.37
New York City,Manhattan,7002001,001438,Bellevue Hospital Center,18 to 29,104,F,White,Not Span/Hispanic,2,Emergency,Home or Self Care,2017,238,Complications of surgical procedures or medical care,033,OTHER OR THER PRCS NOSE,711,"Post-op, post-trauma, other device infections w O.R. procedure",18,"Infectious and Parasitic Diseases, Systemic or Unspecified Sites",1,Minor,Minor,Surgical,Medicaid,Medicaid,,,N,Y,16989.76,10954.11
New York City,Manhattan,7002001,001438,Bellevue Hospital Center,50 to 69,100,M,Black/African American,Not Span/Hispanic,17,Emergency,Skilled Nursing Home,2017,238,Complications of surgical procedures or medical care,222,BLOOD TRANSFUSION,711,"Post-op, post-trauma, other device infections w O.R. procedure",18,"Infectious and Parasitic Diseases, Systemic or Unspecified Sites",4,Extreme,Major,Surgical,Medicaid,Medicaid,,,N,Y,90175.99,58140.79
New York City,Manhattan,7002001,001438,Bellevue Hospital Center,50 to 69,112,F,Other Race,Spanish/Hispanic,14,Emergency,Home w/ Home Health Services,2017,237,Complication of device; implant or graft,002,IRR XCRANIAL VENT SHUNT,711,"Post-op, post-trauma, other device infections w O.R. procedure",18,"Infectious and Parasitic Diseases, Systemic or Unspecified Sites",3,Major,Moderate,Surgical,Medicaid,Medicaid,,,N,Y,103287.80,66594.60
New York City,Manhattan,7002001,001438,Bellevue Hospital Center,50 to 69,100,M,Other Race,Not Span/Hispanic,22,Emergency,Home or Self Care,2017,238,Complications of surgical procedures or medical care,063,OT NON-OR THER CARDIO,711,"Post-op, post-trauma, other device infections w O.R. procedure",18,"Infectious and Parasitic Diseases, Systemic or Unspecified Sites",3,Major,Major,Surgical,Medicaid,,,,N,Y,119269.45,76898.74
New York City,Manhattan,7002001,001438,Bellevue Hospital Center,30 to 49,104,F,Other Race,Not Span/Hispanic,8,Emergency,Home w/ Home Health Services,2017,238,Complications of surgical procedures or medical care,175,OT OR THER PRC SKN/BRST,711,"Post-op, post-trauma, other device infections w O.R. procedure",18,"Infectious and Parasitic Diseases, Systemic or Unspecified Sites",2,Moderate,Minor,Surgical,Medicaid,Medicaid,,,N,Y,48001.93,30949.15
