Hospital Service Area,Hospital County,Operating Certificate Number,Permanent Facility Id,Facility Name,Age Group,Zip Code - 3 digits,Gender,Race,Ethnicity,Length of Stay,Type of Admission,Patient Disposition,Discharge Year,CCS Diagnosis Code,CCS Diagnosis Description,CCS Procedure Code,CCS Procedure Description,APR DRG Code,APR DRG Description,APR MDC Code,APR MDC Description,APR Severity of Illness Code,APR Severity of Illness Description,APR Risk of Mortality,APR Medical Surgical Description,Payment Typology 1,Payment Typology 2,Payment Typology 3,Birth Weight,Abortion Edit Indicator,Emergency Department Indicator,Total Charges,Total Costs
New York City,Kings,7002053,001304,NYU Langone Hospital-Brooklyn,50 to 69,112,M,White,Not Span/Hispanic,13,Emergency,Home w/ Home Health Services,2020,INJ037,"COMPLICATION OF OTHER SURGICAL OR MEDICAL CARE, INJURY, INITIAL ENCOUNTER",CNS013,SPINAL EPIDURAL CATHETER PLACEMENT,711,"POST-OP, POST-TRAUMA, OTHER DEVICE INFECTIONS W O.R. PROCEDURE",18,INFECTIOUS AND PARASITIC DISEASES (SYSTEMIC OR UNSPECIFIED SITES),3,Major,Major,Surgical,Medicare,,,,,Y,183715.89,64828.02
New York City,Kings,7002053,001304,NYU Langone Hospital-Brooklyn,70 or Older,112,M,White,Not Span/Hispanic,5,Emergency,Home w/ Home Health Services,2020,INJ037,"COMPLICATION OF OTHER SURGICAL OR MEDICAL CARE, INJURY, INITIAL ENCOUNTER",MST023,TOE AND MID FOOT AMPUTATION,711,"POST-OP, POST-TRAUMA, OTHER DEVICE INFECTIONS W O.R. PROCEDURE",18,INFECTIOUS AND PARASITIC DISEASES (SYSTEMIC OR UNSPECIFIED SITES),3,Major,Moderate,Surgical,Medicare,,,,,Y,111698.47,23159.96
New York City,Kings,7002053,001304,NYU Langone Hospital-Brooklyn,70 or Older,112,F,White,Not Span/Hispanic,3,Elective,Home or Self Care,2020,INJ037,"COMPLICATION OF OTHER SURGICAL OR MEDICAL CARE, INJURY, INITIAL ENCOUNTER",IMG004,FLUOROSCOPY OF NON-CIRCULATORY ORGANS,711,"POST-OP, POST-TRAUMA, OTHER DEVICE INFECTIONS W O.R. PROCEDURE",18,INFECTIOUS AND PARASITIC DISEASES (SYSTEMIC OR UNSPECIFIED SITES),2,Moderate,Moderate,Surgical,Blue Cross/Blue Shield,Medicaid,,,,N,148376.93,25283.54
New York City,Kings,7002053,001304,NYU Langone Hospital-Brooklyn,50 to 69,112,F,White,Not Span/Hispanic,1,Emergency,Home w/ Home Health Services,2020,INJ037,"COMPLICATION OF OTHER SURGICAL OR MEDICAL CARE, INJURY, INITIAL ENCOUNTER",MST020,SUBCUTANEOUS TISSUE AND FASCIA EXCISION,711,"POST-OP, POST-TRAUMA, OTHER DEVICE INFECTIONS W O.R. PROCEDURE",18,INFECTIOUS AND PARASITIC DISEASES (SYSTEMIC OR UNSPECIFIED SITES),1,Minor,Minor,Surgical,Blue Cross/Blue Shield,,,,,Y,54686.42,8931.09
New York City,Kings,7002053,001304,NYU Langone Hospital-Brooklyn,70 or Older,112,M,White,Not Span/Hispanic,5,Emergency,Home w/ Home Health Services,2020,INJ037,"COMPLICATION OF OTHER SURGICAL OR MEDICAL CARE, INJURY, INITIAL ENCOUNTER",MST005,INCISION AND DRAINAGE OF SUBCUTANEOUS TISSUE AND FASCIA,711,"POST-OP, POST-TRAUMA, OTHER DEVICE INFECTIONS W O.R. PROCEDURE",18,INFECTIOUS AND PARASITIC DISEASES (SYSTEMIC OR UNSPECIFIED SITES),2,Moderate,Moderate,Surgical,Medicare,Medicare,,,,Y,56510.88,17801.54
New York City,Kings,7002053,001304,NYU Langone Hospital-Brooklyn,50 to 69,112,M,White,Not Span/Hispanic,31,Emergency,Left Against Medical Advice,2020,INJ037,"COMPLICATION OF OTHER SURGICAL OR MEDICAL CARE, INJURY, INITIAL ENCOUNTER",GIS024,OTHER PERITONEAL CAVITY PROCEDURES,711,"POST-OP, POST-TRAUMA, OTHER DEVICE INFECTIONS W O.R. PROCEDURE",18,INFECTIOUS AND PARASITIC DISEASES (SYSTEMIC OR UNSPECIFIED SITES),4,Extreme,Extreme,Surgical,Private Health Insurance,,,,,Y,752142.12,164776.76
New York City,Kings,7002053,001304,NYU Langone Hospital-Brooklyn,50 to 69,112,F,White,Not Span/Hispanic,10,Elective,Home w/ Home Health Services,2020,INJ037,"COMPLICATION OF OTHER SURGICAL OR MEDICAL CARE, INJURY, INITIAL ENCOUNTER",MST005,INCISION AND DRAINAGE OF SUBCUTANEOUS TISSUE AND FASCIA,711,"POST-OP, POST-TRAUMA, OTHER DEVICE INFECTIONS W O.R. PROCEDURE",18,INFECTIOUS AND PARASITIC DISEASES (SYSTEMIC OR UNSPECIFIED SITES),2,Moderate,Major,Surgical,Medicare,Medicaid,,,,N,109592.69,36164.38
New York City,Kings,7002053,001304,NYU Langone Hospital-Brooklyn,30 to 49,112,M,Other Race,Not Span/Hispanic,15,Emergency,Home or Self Care,2020,INJ037,"COMPLICATION OF OTHER SURGICAL OR MEDICAL CARE, INJURY, INITIAL ENCOUNTER",GNR006,"CHEST WALL PROCEDURES, NEC",711,"POST-OP, POST-TRAUMA, OTHER DEVICE INFECTIONS W O.R. PROCEDURE",18,INFECTIOUS AND PARASITIC DISEASES (SYSTEMIC OR UNSPECIFIED SITES),4,Extreme,Major,Surgical,Medicaid,,,,,Y,406633.39,74849.59
New York City,Kings,7002053,001304,NYU Langone Hospital-Brooklyn,50 to 69,103,F,White,Not Span/Hispanic,120 +,Emergency,Home w/ Home Health Services,2020,INJ037,"COMPLICATION OF OTHER SURGICAL OR MEDICAL CARE, INJURY, INITIAL ENCOUNTER",GIS011,SMALL BOWEL RESECTION,711,"POST-OP, POST-TRAUMA, OTHER DEVICE INFECTIONS W O.R. PROCEDURE",18,INFECTIOUS AND PARASITIC DISEASES (SYSTEMIC OR UNSPECIFIED SITES),4,Extreme,Extreme,Surgical,Medicare,Medicaid,,,,Y,2664280.54,597265.88
New York City,Kings,7002053,001304,NYU Langone Hospital-Brooklyn,18 to 29,112,M,Other Race,Not Span/Hispanic,1,Emergency,Home or Self Care,2020,INJ037,"COMPLICATION OF OTHER SURGICAL OR MEDICAL CARE, INJURY, INITIAL ENCOUNTER",PNS003,PERIPHERAL NERVE DECOMPRESSION (EXCLUDING LUMBOSACRAL AND CERVICOTHORACIC),711,"POST-OP, POST-TRAUMA, OTHER DEVICE INFECTIONS W O.R. PROCEDURE",18,INFECTIOUS AND PARASITIC DISEASES (SYSTEMIC OR UNSPECIFIED SITES),2,Moderate,Minor,Surgical,Medicaid,,,,,Y,58908.45,10027.32
New York City,Kings,7002053,001304,NYU Langone Hospital-Brooklyn,70 or Older,112,F,Other Race,Not Span/Hispanic,16,Emergency,Home w/ Home Health Services,2020,INJ037,"COMPLICATION OF OTHER SURGICAL OR MEDICAL CARE, INJURY, INITIAL ENCOUNTER",MST020,SUBCUTANEOUS TISSUE AND FASCIA EXCISION,711,"POST-OP, POST-TRAUMA, OTHER DEVICE INFECTIONS W O.R. PROCEDURE",18,INFECTIOUS AND PARASITIC DISEASES (SYSTEMIC OR UNSPECIFIED SITES),4,Extreme,Extreme,Surgical,Medicare,Medicaid,,,,Y,321581.89,94177.3
New York City,Kings,7002053,001304,NYU Langone Hospital-Brooklyn,70 or Older,116,M,White,Not Span/Hispanic,14,Emergency,Skilled Nursing Home,2020,INJ037,"COMPLICATION OF OTHER SURGICAL OR MEDICAL CARE, INJURY, INITIAL ENCOUNTER",CAR008,ANGIOPLASTY AND RELATED VESSEL PROCEDURES (ENDOVASCULAR; EXCLUDING CAROTID),711,"POST-OP, POST-TRAUMA, OTHER DEVICE INFECTIONS W O.R. PROCEDURE",18,INFECTIOUS AND PARASITIC DISEASES (SYSTEMIC OR UNSPECIFIED SITES),4,Extreme,Extreme,Surgical,Medicare,Medicaid,,,,Y,351042.59,86984.75
New York City,Kings,7002053,001304,NYU Langone Hospital-Brooklyn,50 to 69,112,M,Other Race,Not Span/Hispanic,4,Emergency,Home w/ Home Health Services,2020,INJ037,"COMPLICATION OF OTHER SURGICAL OR MEDICAL CARE, INJURY, INITIAL ENCOUNTER",MST005,INCISION AND DRAINAGE OF SUBCUTANEOUS TISSUE AND FASCIA,711,"POST-OP, POST-TRAUMA, OTHER DEVICE INFECTIONS W O.R. PROCEDURE",18,INFECTIOUS AND PARASITIC DISEASES (SYSTEMIC OR UNSPECIFIED SITES),2,Moderate,Major,Surgical,Self-Pay,,,,,Y,103232.02,22871.12
New York City,Kings,7002053,001304,NYU Langone Hospital-Brooklyn,50 to 69,100,F,Other Race,Spanish/Hispanic,2,Emergency,Home or Self Care,2020,INJ037,"COMPLICATION OF OTHER SURGICAL OR MEDICAL CARE, INJURY, INITIAL ENCOUNTER",SKB004,BREAST RECONSTRUCTION,711,"POST-OP, POST-TRAUMA, OTHER DEVICE INFECTIONS W O.R. PROCEDURE",18,INFECTIOUS AND PARASITIC DISEASES (SYSTEMIC OR UNSPECIFIED SITES),2,Moderate,Minor,Surgical,Private Health Insurance,,,,,Y,54827.66,13310.22
New York City,Kings,7002053,001304,NYU Langone Hospital-Brooklyn,30 to 49,112,F,Black/African American,Not Span/Hispanic,13,Emergency,Home or Self Care,2020,INJ037,"COMPLICATION OF OTHER SURGICAL OR MEDICAL CARE, INJURY, INITIAL ENCOUNTER",GIS024,OTHER PERITONEAL CAVITY PROCEDURES,711,"POST-OP, POST-TRAUMA, OTHER DEVICE INFECTIONS W O.R. PROCEDURE",18,INFECTIOUS AND PARASITIC DISEASES (SYSTEMIC OR UNSPECIFIED SITES),2,Moderate,Minor,Surgical,Private Health Insurance,,,,,Y,215302.39,47810.28
New York City,Kings,7002053,001304,NYU Langone Hospital-Brooklyn,50 to 69,112,F,White,Not Span/Hispanic,3,Emergency,Home or Self Care,2020,INJ037,"COMPLICATION OF OTHER SURGICAL OR MEDICAL CARE, INJURY, INITIAL ENCOUNTER",MST019,"MUSCLE, TENDON, BURSA, AND LIGAMENT EXCISION",711,"POST-OP, POST-TRAUMA, OTHER DEVICE INFECTIONS W O.R. PROCEDURE",18,INFECTIOUS AND PARASITIC DISEASES (SYSTEMIC OR UNSPECIFIED SITES),3,Major,Moderate,Surgical,Private Health Insurance,,,,,Y,76926.01,19798.14
New York City,Kings,7002053,001304,NYU Langone Hospital-Brooklyn,30 to 49,112,M,White,Spanish/Hispanic,6,Emergency,Home or Self Care,2020,INJ037,"COMPLICATION OF OTHER SURGICAL OR MEDICAL CARE, INJURY, INITIAL ENCOUNTER",MST005,INCISION AND DRAINAGE OF SUBCUTANEOUS TISSUE AND FASCIA,711,"POST-OP, POST-TRAUMA, OTHER DEVICE INFECTIONS W O.R. PROCEDURE",18,INFECTIOUS AND PARASITIC DISEASES (SYSTEMIC OR UNSPECIFIED SITES),2,Moderate,Moderate,Surgical,Medicaid,,,,,Y,143145.72,35427.03
New York City,Kings,7002053,001304,NYU Langone Hospital-Brooklyn,50 to 69,112,M,Other Race,Not Span/Hispanic,10,Emergency,Home w/ Home Health Services,2020,INJ037,"COMPLICATION OF OTHER SURGICAL OR MEDICAL CARE, INJURY, INITIAL ENCOUNTER",HEP004,HEPATOBILIARY RESECTION AND ABLATION,711,"POST-OP, POST-TRAUMA, OTHER DEVICE INFECTIONS W O.R. PROCEDURE",18,INFECTIOUS AND PARASITIC DISEASES (SYSTEMIC OR UNSPECIFIED SITES),4,Extreme,Extreme,Surgical,Medicaid,,,,,Y,477595.82,103863.07
New York City,Kings,7002053,001304,NYU Langone Hospital-Brooklyn,70 or Older,112,F,White,Not Span/Hispanic,4,Emergency,Home w/ Home Health Services,2020,INJ037,"COMPLICATION OF OTHER SURGICAL OR MEDICAL CARE, INJURY, INITIAL ENCOUNTER",CAR008,ANGIOPLASTY AND RELATED VESSEL PROCEDURES (ENDOVASCULAR; EXCLUDING CAROTID),711,"POST-OP, POST-TRAUMA, OTHER DEVICE INFECTIONS W O.R. PROCEDURE",18,INFECTIOUS AND PARASITIC DISEASES (SYSTEMIC OR UNSPECIFIED SITES),2,Moderate,Minor,Surgical,Medicare,Medicaid,,,,Y,163903.42,33587.37
New York City,Kings,7002053,001304,NYU Langone Hospital-Brooklyn,50 to 69,112,F,White,Not Span/Hispanic,7,Emergency,Home or Self Care,2020,INJ037,"COMPLICATION OF OTHER SURGICAL OR MEDICAL CARE, INJURY, INITIAL ENCOUNTER",MST004,INCISION AND DRAINAGE OF MUSCULOSKELETAL TISSUE AND JOINTS,711,"POST-OP, POST-TRAUMA, OTHER DEVICE INFECTIONS W O.R. PROCEDURE",18,INFECTIOUS AND PARASITIC DISEASES (SYSTEMIC OR UNSPECIFIED SITES),3,Major,Major,Surgical,Blue Cross/Blue Shield,,,,,Y,181070.9,50094.11
New York City,Kings,7002053,001304,NYU Langone Hospital-Brooklyn,70 or Older,113,F,White,Not Span/Hispanic,6,Emergency,Home or Self Care,2020,INJ037,"COMPLICATION OF OTHER SURGICAL OR MEDICAL CARE, INJURY, INITIAL ENCOUNTER",GIS008,APPENDECTOMY,711,"POST-OP, POST-TRAUMA, OTHER DEVICE INFECTIONS W O.R. PROCEDURE",18,INFECTIOUS AND PARASITIC DISEASES (SYSTEMIC OR UNSPECIFIED SITES),3,Major,Major,Surgical,Medicare,Medicare,,,,Y,145833.76,38137.41
New York City,Kings,7002053,001304,NYU Langone Hospital-Brooklyn,50 to 69,112,F,White,Spanish/Hispanic,1,Elective,Home or Self Care,2020,INJ037,"COMPLICATION OF OTHER SURGICAL OR MEDICAL CARE, INJURY, INITIAL ENCOUNTER",URN004,REMOVAL OF CALCULI AND OTHER MATTER FROM URINARY TRACT,711,"POST-OP, POST-TRAUMA, OTHER DEVICE INFECTIONS W O.R. PROCEDURE",18,INFECTIOUS AND PARASITIC DISEASES (SYSTEMIC OR UNSPECIFIED SITES),2,Moderate,Major,Surgical,Medicaid,,,,,N,70430.58,12333.72
New York City,Kings,7002053,001304,NYU Langone Hospital-Brooklyn,50 to 69,112,F,Other Race,Spanish/Hispanic,7,Urgent,Home or Self Care,2020,INJ037,"COMPLICATION OF OTHER SURGICAL OR MEDICAL CARE, INJURY, INITIAL ENCOUNTER",URN003,URETER AND OTHER URINARY TRACT DILATION,711,"POST-OP, POST-TRAUMA, OTHER DEVICE INFECTIONS W O.R. PROCEDURE",18,INFECTIOUS AND PARASITIC DISEASES (SYSTEMIC OR UNSPECIFIED SITES),4,Extreme,Major,Surgical,Blue Cross/Blue Shield,,,,,N,255304.57,58806.64
New York City,Kings,7002053,001304,NYU Langone Hospital-Brooklyn,70 or Older,112,M,White,Not Span/Hispanic,6,Emergency,Home w/ Home Health Services,2020,INJ037,"COMPLICATION OF OTHER SURGICAL OR MEDICAL CARE, INJURY, INITIAL ENCOUNTER",ENT006,ENT DRAINAGE (EXCLUDING MYRINGOTOMY),711,"POST-OP, POST-TRAUMA, OTHER DEVICE INFECTIONS W O.R. PROCEDURE",18,INFECTIOUS AND PARASITIC DISEASES (SYSTEMIC OR UNSPECIFIED SITES),2,Moderate,Moderate,Surgical,Medicare,Medicaid,,,,Y,140441.27,37529.23
New York City,Kings,7002053,001304,NYU Langone Hospital-Brooklyn,50 to 69,112,F,Other Race,Spanish/Hispanic,3,Emergency,Home w/ Home Health Services,2020,INJ037,"COMPLICATION OF OTHER SURGICAL OR MEDICAL CARE, INJURY, INITIAL ENCOUNTER",MST005,INCISION AND DRAINAGE OF SUBCUTANEOUS TISSUE AND FASCIA,711,"POST-OP, POST-TRAUMA, OTHER DEVICE INFECTIONS W O.R. PROCEDURE",18,INFECTIOUS AND PARASITIC DISEASES (SYSTEMIC OR UNSPECIFIED SITES),2,Moderate,Minor,Surgical,Private Health Insurance,Private Health Insurance,,,,Y,79522.21,18638.63
New York City,Kings,7002053,001304,NYU Langone Hospital-Brooklyn,30 to 49,112,M,White,Not Span/Hispanic,2,Emergency,Home or Self Care,2020,INJ037,"COMPLICATION OF OTHER SURGICAL OR MEDICAL CARE, INJURY, INITIAL ENCOUNTER",ENT006,ENT DRAINAGE (EXCLUDING MYRINGOTOMY),711,"POST-OP, POST-TRAUMA, OTHER DEVICE INFECTIONS W O.R. PROCEDURE",18,INFECTIOUS AND PARASITIC DISEASES (SYSTEMIC OR UNSPECIFIED SITES),1,Minor,Minor,Surgical,Medicare,Medicaid,,,,Y,35570.37,10850.69
New York City,Kings,7002053,001304,NYU Langone Hospital-Brooklyn,30 to 49,112,M,White,Not Span/Hispanic,1,Emergency,Home w/ Home Health Services,2020,INJ037,"COMPLICATION OF OTHER SURGICAL OR MEDICAL CARE, INJURY, INITIAL ENCOUNTER",MST005,INCISION AND DRAINAGE OF SUBCUTANEOUS TISSUE AND FASCIA,711,"POST-OP, POST-TRAUMA, OTHER DEVICE INFECTIONS W O.R. PROCEDURE",18,INFECTIOUS AND PARASITIC DISEASES (SYSTEMIC OR UNSPECIFIED SITES),2,Moderate,Moderate,Surgical,Private Health Insurance,,,,,Y,28453.48,6754.04
New York City,Kings,7002053,001304,NYU Langone Hospital-Brooklyn,50 to 69,112,F,White,Not Span/Hispanic,5,Elective,Home w/ Home Health Services,2020,INJ037,"COMPLICATION OF OTHER SURGICAL OR MEDICAL CARE, INJURY, INITIAL ENCOUNTER",CNS012,CNS NEUROSTIMULATOR PROCEDURES,711,"POST-OP, POST-TRAUMA, OTHER DEVICE INFECTIONS W O.R. PROCEDURE",18,INFECTIOUS AND PARASITIC DISEASES (SYSTEMIC OR UNSPECIFIED SITES),2,Moderate,Minor,Surgical,Medicare,Medicaid,,,,N,122196.16,30972.26
New York City,Kings,7002053,001304,NYU Langone Hospital-Brooklyn,30 to 49,OOS,F,White,Not Span/Hispanic,1,Emergency,Home or Self Care,2020,INJ037,"COMPLICATION OF OTHER SURGICAL OR MEDICAL CARE, INJURY, INITIAL ENCOUNTER",MST005,INCISION AND DRAINAGE OF SUBCUTANEOUS TISSUE AND FASCIA,711,"POST-OP, POST-TRAUMA, OTHER DEVICE INFECTIONS W O.R. PROCEDURE",18,INFECTIOUS AND PARASITIC DISEASES (SYSTEMIC OR UNSPECIFIED SITES),1,Minor,Minor,Surgical,Private Health Insurance,,,,,Y,27288.39,6518.55
New York City,Kings,7002053,001304,NYU Langone Hospital-Brooklyn,30 to 49,112,F,Other Race,Unknown,6,Emergency,Home or Self Care,2020,INJ037,"COMPLICATION OF OTHER SURGICAL OR MEDICAL CARE, INJURY, INITIAL ENCOUNTER",MST005,INCISION AND DRAINAGE OF SUBCUTANEOUS TISSUE AND FASCIA,711,"POST-OP, POST-TRAUMA, OTHER DEVICE INFECTIONS W O.R. PROCEDURE",18,INFECTIOUS AND PARASITIC DISEASES (SYSTEMIC OR UNSPECIFIED SITES),3,Major,Moderate,Surgical,Medicaid,,,,,Y,136150.05,35459.8
New York City,Kings,7002053,001304,NYU Langone Hospital-Brooklyn,50 to 69,112,F,Other Race,Spanish/Hispanic,9,Emergency,Home w/ Home Health Services,2020,INJ037,"COMPLICATION OF OTHER SURGICAL OR MEDICAL CARE, INJURY, INITIAL ENCOUNTER",MST020,SUBCUTANEOUS TISSUE AND FASCIA EXCISION,711,"POST-OP, POST-TRAUMA, OTHER DEVICE INFECTIONS W O.R. PROCEDURE",18,INFECTIOUS AND PARASITIC DISEASES (SYSTEMIC OR UNSPECIFIED SITES),2,Moderate,Moderate,Surgical,Medicaid,,,,,Y,291814.5,57883.02
New York City,Kings,7002053,001304,NYU Langone Hospital-Brooklyn,50 to 69,112,M,White,Not Span/Hispanic,8,Emergency,Home w/ Home Health Services,2020,INJ037,"COMPLICATION OF OTHER SURGICAL OR MEDICAL CARE, INJURY, INITIAL ENCOUNTER",MST030,"MUSCULOSKELETAL PROCEDURES, NEC",711,"POST-OP, POST-TRAUMA, OTHER DEVICE INFECTIONS W O.R. PROCEDURE",18,INFECTIOUS AND PARASITIC DISEASES (SYSTEMIC OR UNSPECIFIED SITES),2,Moderate,Moderate,Surgical,Medicaid,,,,,Y,154275.28,43394.53
New York City,Kings,7002053,001304,NYU Langone Hospital-Brooklyn,50 to 69,112,M,White,Not Span/Hispanic,4,Emergency,Expired,2020,INJ037,"COMPLICATION OF OTHER SURGICAL OR MEDICAL CARE, INJURY, INITIAL ENCOUNTER",GIS006,PARACENTESIS,711,"POST-OP, POST-TRAUMA, OTHER DEVICE INFECTIONS W O.R. PROCEDURE",18,INFECTIOUS AND PARASITIC DISEASES (SYSTEMIC OR UNSPECIFIED SITES),4,Extreme,Extreme,Surgical,Private Health Insurance,,,,,Y,193742.79,40171.9
