Hospital Service Area,Hospital County,Operating Certificate Number,Permanent Facility Id,Facility Name,Age Group,Zip Code - 3 digits,Gender,Race,Ethnicity,Length of Stay,Type of Admission,Patient Disposition,Discharge Year,CCS Diagnosis Code,CCS Diagnosis Description,CCS Procedure Code,CCS Procedure Description,APR DRG Code,APR DRG Description,APR MDC Code,APR MDC Description,APR Severity of Illness Code,APR Severity of Illness Description,APR Risk of Mortality,APR Medical Surgical Description,Payment Typology 1,Payment Typology 2,Payment Typology 3,Birth Weight,Abortion Edit Indicator,Emergency Department Indicator,Total Charges,Total Costs
New York City,Kings,7002053,001304,NYU Langone Hospital-Brooklyn,70 or Older,112,F,Other Race,Spanish/Hispanic,8,Emergency,Home w/ Home Health Services,2019,INF002,SEPTICEMIA,ESA001,HEMODIALYSIS,720,SEPTICEMIA & DISSEMINATED INFECTIONS,18,INFECTIOUS AND PARASITIC DISEASES (SYSTEMIC OR UNSPECIFIED SITES),3,Major,Major,Medical,Medicare,Medicaid,,,,true,102742.87,31437.91
New York City,Kings,7002053,001304,NYU Langone Hospital-Brooklyn,50 to 69,112,M,Black/African American,Not Span/Hispanic,14,Emergency,Skilled Nursing Home,2019,INF002,SEPTICEMIA,ADM017,ADMINISTRATION OF NUTRITIONAL AND ELECTROLYTIC SUBSTANCES,720,SEPTICEMIA & DISSEMINATED INFECTIONS,18,INFECTIOUS AND PARASITIC DISEASES (SYSTEMIC OR UNSPECIFIED SITES),4,Extreme,Major,Medical,Medicare,Medicaid,,,,true,151160.1,57415.2
New York City,Kings,7002053,001304,NYU Langone Hospital-Brooklyn,70 or Older,112,F,Other Race,Not Span/Hispanic,11,Emergency,Skilled Nursing Home,2019,INF002,SEPTICEMIA,CAR024,VENOUS AND ARTERIAL CATHETER PLACEMENT,720,SEPTICEMIA & DISSEMINATED INFECTIONS,18,INFECTIOUS AND PARASITIC DISEASES (SYSTEMIC OR UNSPECIFIED SITES),4,Extreme,Extreme,Medical,Medicare,Medicaid,,,,true,210039.56,74516.73
New York City,Kings,7002053,001304,NYU Langone Hospital-Brooklyn,50 to 69,112,F,White,Not Span/Hispanic,3,Emergency,Home or Self Care,2019,INF002,SEPTICEMIA,,,720,SEPTICEMIA & DISSEMINATED INFECTIONS,18,INFECTIOUS AND PARASITIC DISEASES (SYSTEMIC OR UNSPECIFIED SITES),3,Major,Moderate,Medical,Private Health Insurance,,,,,true,45309.87,13370.3
New York City,Kings,7002053,001304,NYU Langone Hospital-Brooklyn,70 or Older,112,M,White,Not Span/Hispanic,8,Emergency,Skilled Nursing Home,2019,INF002,SEPTICEMIA,ESA003,MECHANICAL VENTILATION,720,SEPTICEMIA & DISSEMINATED INFECTIONS,18,INFECTIOUS AND PARASITIC DISEASES (SYSTEMIC OR UNSPECIFIED SITES),4,Extreme,Extreme,Medical,Medicare,Medicaid,,,,true,186540.42,69078.98
New York City,Kings,7002053,001304,NYU Langone Hospital-Brooklyn,70 or Older,112,F,White,Not Span/Hispanic,7,Emergency,Home w/ Home Health Services,2019,INF002,SEPTICEMIA,ESA004,NON-INVASIVE VENTILATION,720,SEPTICEMIA & DISSEMINATED INFECTIONS,18,INFECTIOUS AND PARASITIC DISEASES (SYSTEMIC OR UNSPECIFIED SITES),4,Extreme,Extreme,Medical,Medicare,Medicaid,,,,true,109297.28,36506.46
New York City,Kings,7002053,001304,NYU Langone Hospital-Brooklyn,30 to 49,112,F,Other Race,Spanish/Hispanic,7,Emergency,Home or Self Care,2019,INF002,SEPTICEMIA,,,720,SEPTICEMIA & DISSEMINATED INFECTIONS,18,INFECTIOUS AND PARASITIC DISEASES (SYSTEMIC OR UNSPECIFIED SITES),2,Moderate,Minor,Medical,Private Health Insurance,,,,,true,94943.48,26618.23
New York City,Kings,7002053,001304,NYU Langone Hospital-Brooklyn,70 or Older,100,F,Other Race,Not Span/Hispanic,1,Emergency,Short-term Hospital,2019,INF002,SEPTICEMIA,ADM015,ADMINISTRATION OF ANTIBIOTICS,720,SEPTICEMIA & DISSEMINATED INFECTIONS,18,INFECTIOUS AND PARASITIC DISEASES (SYSTEMIC OR UNSPECIFIED SITES),2,Moderate,Major,Medical,Medicare,,,,,true,44115.15,10860.77
New York City,Kings,7002053,001304,NYU Langone Hospital-Brooklyn,70 or Older,112,F,White,Not Span/Hispanic,3,Emergency,Hospice - Medical Facility,2019,INF002,SEPTICEMIA,ADM021,"ADMINISTRATION OF THERAPEUTIC SUBSTANCES, NEC",720,SEPTICEMIA & DISSEMINATED INFECTIONS,18,INFECTIOUS AND PARASITIC DISEASES (SYSTEMIC OR UNSPECIFIED SITES),4,Extreme,Extreme,Medical,Medicare,Medicare,,,,true,103363.04,34154.29
New York City,Kings,7002053,001304,NYU Langone Hospital-Brooklyn,50 to 69,112,M,Other Race,Spanish/Hispanic,4,Emergency,Home or Self Care,2019,INF002,SEPTICEMIA,,,720,SEPTICEMIA & DISSEMINATED INFECTIONS,18,INFECTIOUS AND PARASITIC DISEASES (SYSTEMIC OR UNSPECIFIED SITES),2,Moderate,Moderate,Medical,Medicaid,,,,,true,51308.28,15667.22
New York City,Kings,7002053,001304,NYU Langone Hospital-Brooklyn,70 or Older,112,M,White,Not Span/Hispanic,18,Emergency,Skilled Nursing Home,2019,INF002,SEPTICEMIA,MST020,SUBCUTANEOUS TISSUE AND FASCIA EXCISION,720,SEPTICEMIA & DISSEMINATED INFECTIONS,18,INFECTIOUS AND PARASITIC DISEASES (SYSTEMIC OR UNSPECIFIED SITES),4,Extreme,Major,Medical,Medicare,Blue Cross/Blue Shield,,,,true,207312.12,63675.81
New York City,Kings,7002053,001304,NYU Langone Hospital-Brooklyn,30 to 49,112,F,Black/African American,Not Span/Hispanic,10,Emergency,Hospice - Medical Facility,2019,INF002,SEPTICEMIA,ESA001,HEMODIALYSIS,720,SEPTICEMIA & DISSEMINATED INFECTIONS,18,INFECTIOUS AND PARASITIC DISEASES (SYSTEMIC OR UNSPECIFIED SITES),4,Extreme,Major,Medical,Medicare,Medicaid,,,,true,185069.97,59743.43
New York City,Kings,7002053,001304,NYU Langone Hospital-Brooklyn,30 to 49,112,F,White,Spanish/Hispanic,3,Emergency,Home or Self Care,2019,INF002,SEPTICEMIA,,,720,SEPTICEMIA & DISSEMINATED INFECTIONS,18,INFECTIOUS AND PARASITIC DISEASES (SYSTEMIC OR UNSPECIFIED SITES),1,Minor,Minor,Medical,Blue Cross/Blue Shield,,,,,true,34938.88,11800.19
New York City,Kings,7002053,001304,NYU Langone Hospital-Brooklyn,50 to 69,112,M,Black/African American,Unknown,6,Emergency,Home or Self Care,2019,INF002,SEPTICEMIA,,,720,SEPTICEMIA & DISSEMINATED INFECTIONS,18,INFECTIOUS AND PARASITIC DISEASES (SYSTEMIC OR UNSPECIFIED SITES),2,Moderate,Moderate,Medical,Medicaid,,,,,true,107066.6,24467.12
New York City,Kings,7002053,001304,NYU Langone Hospital-Brooklyn,70 or Older,112,M,Other Race,Not Span/Hispanic,7,Emergency,Home w/ Home Health Services,2019,INF002,SEPTICEMIA,,,720,SEPTICEMIA & DISSEMINATED INFECTIONS,18,INFECTIOUS AND PARASITIC DISEASES (SYSTEMIC OR UNSPECIFIED SITES),3,Major,Major,Medical,Medicare,,,,,true,64727.18,24707.31
New York City,Kings,7002053,001304,NYU Langone Hospital-Brooklyn,70 or Older,112,M,Other Race,Not Span/Hispanic,12,Emergency,Expired,2019,INF002,SEPTICEMIA,ADM001,TRANSFUSION OF BLOOD AND BLOOD PRODUCTS,720,SEPTICEMIA & DISSEMINATED INFECTIONS,18,INFECTIOUS AND PARASITIC DISEASES (SYSTEMIC OR UNSPECIFIED SITES),4,Extreme,Extreme,Medical,Medicare,Medicaid,,,,true,160602.15,43059.62
New York City,Kings,7002053,001304,NYU Langone Hospital-Brooklyn,70 or Older,112,F,White,Not Span/Hispanic,4,Emergency,Home w/ Home Health Services,2019,INF002,SEPTICEMIA,,,720,SEPTICEMIA & DISSEMINATED INFECTIONS,18,INFECTIOUS AND PARASITIC DISEASES (SYSTEMIC OR UNSPECIFIED SITES),3,Major,Major,Medical,Medicare,,,,,true,44301.31,15388.42
New York City,Kings,7002053,001304,NYU Langone Hospital-Brooklyn,70 or Older,112,F,Other Race,Not Span/Hispanic,4,Emergency,Home w/ Home Health Services,2019,INF002,SEPTICEMIA,,,720,SEPTICEMIA & DISSEMINATED INFECTIONS,18,INFECTIOUS AND PARASITIC DISEASES (SYSTEMIC OR UNSPECIFIED SITES),3,Major,Major,Medical,Medicare,Medicaid,,,,true,45147.83,14992.58
New York City,Kings,7002053,001304,NYU Langone Hospital-Brooklyn,70 or Older,112,F,Other Race,Not Span/Hispanic,11,Emergency,Home w/ Home Health Services,2019,INF002,SEPTICEMIA,GIS017,GASTROSTOMY,720,SEPTICEMIA & DISSEMINATED INFECTIONS,18,INFECTIOUS AND PARASITIC DISEASES (SYSTEMIC OR UNSPECIFIED SITES),4,Extreme,Extreme,Medical,Medicare,Medicaid,,,,true,118212.19,40505.66
New York City,Kings,7002053,001304,NYU Langone Hospital-Brooklyn,70 or Older,112,M,White,Not Span/Hispanic,4,Emergency,Home w/ Home Health Services,2019,INF002,SEPTICEMIA,ADM015,ADMINISTRATION OF ANTIBIOTICS,720,SEPTICEMIA & DISSEMINATED INFECTIONS,18,INFECTIOUS AND PARASITIC DISEASES (SYSTEMIC OR UNSPECIFIED SITES),3,Major,Moderate,Medical,Medicare,Blue Cross/Blue Shield,,,,true,37240.23,14283.92
New York City,Kings,7002053,001304,NYU Langone Hospital-Brooklyn,50 to 69,112,M,Black/African American,Not Span/Hispanic,3,Emergency,Home or Self Care,2019,INF002,SEPTICEMIA,,,720,SEPTICEMIA & DISSEMINATED INFECTIONS,18,INFECTIOUS AND PARASITIC DISEASES (SYSTEMIC OR UNSPECIFIED SITES),1,Minor,Minor,Medical,Blue Cross/Blue Shield,,,,,true,44290.2,13073.09
New York City,Kings,7002053,001304,NYU Langone Hospital-Brooklyn,50 to 69,112,F,White,Unknown,5,Emergency,Home or Self Care,2019,INF002,SEPTICEMIA,,,720,SEPTICEMIA & DISSEMINATED INFECTIONS,18,INFECTIOUS AND PARASITIC DISEASES (SYSTEMIC OR UNSPECIFIED SITES),3,Major,Major,Medical,Medicaid,,,,,true,61439.97,19640.56
New York City,Kings,7002053,001304,NYU Langone Hospital-Brooklyn,50 to 69,112,M,Other Race,Spanish/Hispanic,4,Emergency,Home or Self Care,2019,INF002,SEPTICEMIA,URN003,URETER AND OTHER URINARY TRACT DILATION,720,SEPTICEMIA & DISSEMINATED INFECTIONS,18,INFECTIOUS AND PARASITIC DISEASES (SYSTEMIC OR UNSPECIFIED SITES),3,Major,Moderate,Medical,Medicaid,,,,,true,77437.89,19572.47
New York City,Kings,7002053,001304,NYU Langone Hospital-Brooklyn,50 to 69,112,M,White,Not Span/Hispanic,2,Emergency,Home or Self Care,2019,INF002,SEPTICEMIA,OTR004,ISOLATION PROCEDURES,720,SEPTICEMIA & DISSEMINATED INFECTIONS,18,INFECTIOUS AND PARASITIC DISEASES (SYSTEMIC OR UNSPECIFIED SITES),3,Major,Major,Medical,Blue Cross/Blue Shield,,,,,true,32738.64,8842.94
New York City,Kings,7002053,001304,NYU Langone Hospital-Brooklyn,30 to 49,112,M,Other Race,Not Span/Hispanic,3,Elective,Psychiatric Hospital or Unit of Hosp,2019,INF002,SEPTICEMIA,,,720,SEPTICEMIA & DISSEMINATED INFECTIONS,18,INFECTIOUS AND PARASITIC DISEASES (SYSTEMIC OR UNSPECIFIED SITES),3,Major,Moderate,Medical,Medicaid,,,,,false,39807.34,12625.81
New York City,Kings,7002053,001304,NYU Langone Hospital-Brooklyn,70 or Older,112,M,Other Race,Not Span/Hispanic,5,Emergency,Home w/ Home Health Services,2019,INF002,SEPTICEMIA,HEP010,HEPATOBILIARY AND PANCREATIC DRAINAGE,720,SEPTICEMIA & DISSEMINATED INFECTIONS,18,INFECTIOUS AND PARASITIC DISEASES (SYSTEMIC OR UNSPECIFIED SITES),4,Extreme,Extreme,Medical,Medicare,,,,,true,128024.53,38277.62
New York City,Kings,7002053,001304,NYU Langone Hospital-Brooklyn,70 or Older,112,F,Other Race,Not Span/Hispanic,3,Emergency,Hospice - Medical Facility,2019,INF002,SEPTICEMIA,ADM010,VACCINATIONS,720,SEPTICEMIA & DISSEMINATED INFECTIONS,18,INFECTIOUS AND PARASITIC DISEASES (SYSTEMIC OR UNSPECIFIED SITES),4,Extreme,Extreme,Medical,Medicare,Private Health Insurance,Medicaid,,,true,48026.03,12888.24
New York City,Kings,7002053,001304,NYU Langone Hospital-Brooklyn,70 or Older,112,F,White,Not Span/Hispanic,1,Emergency,Hospice - Medical Facility,2019,INF002,SEPTICEMIA,ESA004,NON-INVASIVE VENTILATION,720,SEPTICEMIA & DISSEMINATED INFECTIONS,18,INFECTIOUS AND PARASITIC DISEASES (SYSTEMIC OR UNSPECIFIED SITES),4,Extreme,Extreme,Medical,Medicare,Medicaid,,,,true,32777.87,10363.99
New York City,Kings,7002053,001304,NYU Langone Hospital-Brooklyn,30 to 49,112,F,Other Race,Spanish/Hispanic,2,Emergency,Home or Self Care,2019,INJ037,"COMPLICATION OF OTHER SURGICAL OR MEDICAL CARE, INJURY, INITIAL ENCOUNTER",,,720,SEPTICEMIA & DISSEMINATED INFECTIONS,18,INFECTIOUS AND PARASITIC DISEASES (SYSTEMIC OR UNSPECIFIED SITES),3,Major,Major,Medical,Medicaid,,,,,true,44480.61,11339.58
New York City,Kings,7002053,001304,NYU Langone Hospital-Brooklyn,70 or Older,112,F,White,Not Span/Hispanic,7,Emergency,Skilled Nursing Home,2019,INF002,SEPTICEMIA,IMG007,COMPUTERIZED TOMOGRAPHY (CT) WITHOUT CONTRAST,720,SEPTICEMIA & DISSEMINATED INFECTIONS,18,INFECTIOUS AND PARASITIC DISEASES (SYSTEMIC OR UNSPECIFIED SITES),3,Major,Major,Medical,Private Health Insurance,,,,,true,145263.93,30472.56
New York City,Kings,7002053,001304,NYU Langone Hospital-Brooklyn,70 or Older,112,M,White,Not Span/Hispanic,2,Emergency,Home w/ Home Health Services,2019,INF002,SEPTICEMIA,,,720,SEPTICEMIA & DISSEMINATED INFECTIONS,18,INFECTIOUS AND PARASITIC DISEASES (SYSTEMIC OR UNSPECIFIED SITES),3,Major,Major,Medical,Medicare,Medicare,,,,true,61893.56,20246.14
New York City,Kings,7002053,001304,NYU Langone Hospital-Brooklyn,70 or Older,112,M,White,Not Span/Hispanic,12,Emergency,Skilled Nursing Home,2019,INF002,SEPTICEMIA,URN006,BLADDER CATHETERIZATION AND DRAINAGE,720,SEPTICEMIA & DISSEMINATED INFECTIONS,18,INFECTIOUS AND PARASITIC DISEASES (SYSTEMIC OR UNSPECIFIED SITES),3,Major,Extreme,Medical,Medicare,Blue Cross/Blue Shield,,,,true,153557.63,43856.01
New York City,Kings,7002053,001304,NYU Langone Hospital-Brooklyn,50 to 69,103,F,Other Race,Unknown,1,Emergency,Left Against Medical Advice,2019,INF002,SEPTICEMIA,,,720,SEPTICEMIA & DISSEMINATED INFECTIONS,18,INFECTIOUS AND PARASITIC DISEASES (SYSTEMIC OR UNSPECIFIED SITES),2,Moderate,Moderate,Medical,Medicare,Medicaid,,,,true,48506.61,11990.46
New York City,Kings,7002053,001304,NYU Langone Hospital-Brooklyn,50 to 69,112,F,Other Race,Not Span/Hispanic,4,Emergency,Home or Self Care,2019,INF002,SEPTICEMIA,URN003,URETER AND OTHER URINARY TRACT DILATION,720,SEPTICEMIA & DISSEMINATED INFECTIONS,18,INFECTIOUS AND PARASITIC DISEASES (SYSTEMIC OR UNSPECIFIED SITES),2,Moderate,Minor,Medical,Medicaid,,,,,true,103380.49,23964.6
New York City,Kings,7002053,001304,NYU Langone Hospital-Brooklyn,18 to 29,103,F,White,Not Span/Hispanic,3,Emergency,Home or Self Care,2019,INJ037,"COMPLICATION OF OTHER SURGICAL OR MEDICAL CARE, INJURY, INITIAL ENCOUNTER",,,720,SEPTICEMIA & DISSEMINATED INFECTIONS,18,INFECTIOUS AND PARASITIC DISEASES (SYSTEMIC OR UNSPECIFIED SITES),2,Moderate,Moderate,Medical,Medicaid,,,,,true,44077.81,13112.65
New York City,Kings,7002053,001304,NYU Langone Hospital-Brooklyn,70 or Older,112,F,White,Not Span/Hispanic,4,Emergency,Home or Self Care,2019,INF002,SEPTICEMIA,ADM021,"ADMINISTRATION OF THERAPEUTIC SUBSTANCES, NEC",720,SEPTICEMIA & DISSEMINATED INFECTIONS,18,INFECTIOUS AND PARASITIC DISEASES (SYSTEMIC OR UNSPECIFIED SITES),3,Major,Major,Medical,Medicare,Private Health Insurance,,,,true,57066.1,16499.53
New York City,Kings,7002053,001304,NYU Langone Hospital-Brooklyn,70 or Older,112,M,White,Unknown,6,Emergency,Skilled Nursing Home,2019,INF002,SEPTICEMIA,,,720,SEPTICEMIA & DISSEMINATED INFECTIONS,18,INFECTIOUS AND PARASITIC DISEASES (SYSTEMIC OR UNSPECIFIED SITES),3,Major,Major,Medical,Medicare,Blue Cross/Blue Shield,,,,true,69053.72,22699.88
New York City,Kings,7002053,001304,NYU Langone Hospital-Brooklyn,70 or Older,112,M,White,Not Span/Hispanic,3,Emergency,Home or Self Care,2019,INF002,SEPTICEMIA,ADM021,"ADMINISTRATION OF THERAPEUTIC SUBSTANCES, NEC",720,SEPTICEMIA & DISSEMINATED INFECTIONS,18,INFECTIOUS AND PARASITIC DISEASES (SYSTEMIC OR UNSPECIFIED SITES),4,Extreme,Extreme,Medical,Medicare,,,,,true,47378.13,13758.51
New York City,Kings,7002053,001304,NYU Langone Hospital-Brooklyn,70 or Older,112,M,Other Race,Not Span/Hispanic,2,Emergency,Home or Self Care,2019,INF002,SEPTICEMIA,,,720,SEPTICEMIA & DISSEMINATED INFECTIONS,18,INFECTIOUS AND PARASITIC DISEASES (SYSTEMIC OR UNSPECIFIED SITES),2,Moderate,Major,Medical,Medicaid,,,,,true,34151.68,9063.64
New York City,Kings,7002053,001304,NYU Langone Hospital-Brooklyn,70 or Older,112,F,White,Not Span/Hispanic,3,Emergency,Home or Self Care,2019,INF002,SEPTICEMIA,ADM021,"ADMINISTRATION OF THERAPEUTIC SUBSTANCES, NEC",720,SEPTICEMIA & DISSEMINATED INFECTIONS,18,INFECTIOUS AND PARASITIC DISEASES (SYSTEMIC OR UNSPECIFIED SITES),3,Major,Extreme,Medical,Medicare,Blue Cross/Blue Shield,,,,true,42610.87,12545.41
New York City,Kings,7002053,001304,NYU Langone Hospital-Brooklyn,70 or Older,112,M,White,Not Span/Hispanic,11,Emergency,Skilled Nursing Home,2019,INF002,SEPTICEMIA,,,720,SEPTICEMIA & DISSEMINATED INFECTIONS,18,INFECTIOUS AND PARASITIC DISEASES (SYSTEMIC OR UNSPECIFIED SITES),4,Extreme,Extreme,Medical,Medicare,Medicaid,,,,true,130057.45,39509.61
New York City,Kings,7002053,001304,NYU Langone Hospital-Brooklyn,30 to 49,112,F,White,Not Span/Hispanic,2,Emergency,Home or Self Care,2019,INF002,SEPTICEMIA,IMG006,COMPUTERIZED TOMOGRAPHY (CT) WITH CONTRAST,720,SEPTICEMIA & DISSEMINATED INFECTIONS,18,INFECTIOUS AND PARASITIC DISEASES (SYSTEMIC OR UNSPECIFIED SITES),2,Moderate,Minor,Medical,Medicaid,,,,,true,50762.56,11596.53
New York City,Kings,7002053,001304,NYU Langone Hospital-Brooklyn,70 or Older,112,F,Other Race,Spanish/Hispanic,11,Emergency,Hospice - Home,2019,INF002,SEPTICEMIA,CAR024,VENOUS AND ARTERIAL CATHETER PLACEMENT,720,SEPTICEMIA & DISSEMINATED INFECTIONS,18,INFECTIOUS AND PARASITIC DISEASES (SYSTEMIC OR UNSPECIFIED SITES),4,Extreme,Extreme,Medical,Medicare,Medicaid,,,,true,216601.26,63252.59
New York City,Kings,7002053,001304,NYU Langone Hospital-Brooklyn,30 to 49,112,M,Other Race,Not Span/Hispanic,15,Emergency,Home or Self Care,2019,INF002,SEPTICEMIA,GIS004,GI SYSTEM ENDOSCOPY WITHOUT BIOPSY (DIAGNOSTIC),720,SEPTICEMIA & DISSEMINATED INFECTIONS,18,INFECTIOUS AND PARASITIC DISEASES (SYSTEMIC OR UNSPECIFIED SITES),4,Extreme,Major,Medical,Medicaid,,,,,true,231822.17,66939.4
New York City,Kings,7002053,001304,NYU Langone Hospital-Brooklyn,70 or Older,112,F,White,Not Span/Hispanic,8,Emergency,Skilled Nursing Home,2019,INF002,SEPTICEMIA,,,720,SEPTICEMIA & DISSEMINATED INFECTIONS,18,INFECTIOUS AND PARASITIC DISEASES (SYSTEMIC OR UNSPECIFIED SITES),4,Extreme,Extreme,Medical,Medicare,Medicaid,,,,true,142983.42,54484.98
New York City,Kings,7002053,001304,NYU Langone Hospital-Brooklyn,50 to 69,112,M,White,Not Span/Hispanic,2,Emergency,Home or Self Care,2019,INF002,SEPTICEMIA,ADM015,ADMINISTRATION OF ANTIBIOTICS,720,SEPTICEMIA & DISSEMINATED INFECTIONS,18,INFECTIOUS AND PARASITIC DISEASES (SYSTEMIC OR UNSPECIFIED SITES),2,Moderate,Minor,Medical,Medicaid,,,,,true,29496.07,8543.32
New York City,Kings,7002053,001304,NYU Langone Hospital-Brooklyn,50 to 69,112,M,White,Not Span/Hispanic,3,Emergency,Home w/ Home Health Services,2019,INF002,SEPTICEMIA,,,720,SEPTICEMIA & DISSEMINATED INFECTIONS,18,INFECTIOUS AND PARASITIC DISEASES (SYSTEMIC OR UNSPECIFIED SITES),3,Major,Major,Medical,Medicare,Medicaid,,,,true,36649.97,11739.82
New York City,Kings,7002053,001304,NYU Langone Hospital-Brooklyn,70 or Older,112,F,Other Race,Not Span/Hispanic,14,Emergency,Home w/ Home Health Services,2019,INF002,SEPTICEMIA,ADM015,ADMINISTRATION OF ANTIBIOTICS,720,SEPTICEMIA & DISSEMINATED INFECTIONS,18,INFECTIOUS AND PARASITIC DISEASES (SYSTEMIC OR UNSPECIFIED SITES),3,Major,Major,Medical,Medicare,Medicaid,,,,true,227037.73,70733.18
New York City,Kings,7002053,001304,NYU Langone Hospital-Brooklyn,50 to 69,112,F,Other Race,Spanish/Hispanic,4,Emergency,Home or Self Care,2019,INF002,SEPTICEMIA,,,720,SEPTICEMIA & DISSEMINATED INFECTIONS,18,INFECTIOUS AND PARASITIC DISEASES (SYSTEMIC OR UNSPECIFIED SITES),3,Major,Moderate,Medical,Medicaid,,,,,true,51835.16,15962.98
New York City,Kings,7002053,001304,NYU Langone Hospital-Brooklyn,70 or Older,112,F,White,Not Span/Hispanic,3,Elective,Home w/ Home Health Services,2019,INF002,SEPTICEMIA,,,720,SEPTICEMIA & DISSEMINATED INFECTIONS,18,INFECTIOUS AND PARASITIC DISEASES (SYSTEMIC OR UNSPECIFIED SITES),4,Extreme,Extreme,Medical,Medicare,Private Health Insurance,Medicaid,,,false,25456.69,9703.9
New York City,Kings,7002053,001304,NYU Langone Hospital-Brooklyn,70 or Older,104,M,White,Spanish/Hispanic,7,Emergency,Home or Self Care,2019,INF002,SEPTICEMIA,,,720,SEPTICEMIA & DISSEMINATED INFECTIONS,18,INFECTIOUS AND PARASITIC DISEASES (SYSTEMIC OR UNSPECIFIED SITES),2,Moderate,Moderate,Medical,Medicare,Medicaid,,,,true,78223.41,26777.8
New York City,Kings,7002053,001304,NYU Langone Hospital-Brooklyn,70 or Older,112,F,Other Race,Spanish/Hispanic,6,Emergency,Home w/ Home Health Services,2019,INF002,SEPTICEMIA,,,720,SEPTICEMIA & DISSEMINATED INFECTIONS,18,INFECTIOUS AND PARASITIC DISEASES (SYSTEMIC OR UNSPECIFIED SITES),3,Major,Major,Medical,Medicare,,,,,true,115451.88,25629.08
New York City,Kings,7002053,001304,NYU Langone Hospital-Brooklyn,70 or Older,112,F,White,Not Span/Hispanic,4,Emergency,Home or Self Care,2019,INF002,SEPTICEMIA,,,720,SEPTICEMIA & DISSEMINATED INFECTIONS,18,INFECTIOUS AND PARASITIC DISEASES (SYSTEMIC OR UNSPECIFIED SITES),3,Major,Major,Medical,Medicare,Medicare,,,,true,74551.25,18544.03
New York City,Kings,7002053,001304,NYU Langone Hospital-Brooklyn,50 to 69,112,M,Other Race,Not Span/Hispanic,10,Emergency,Expired,2019,INF002,SEPTICEMIA,CAR024,VENOUS AND ARTERIAL CATHETER PLACEMENT,720,SEPTICEMIA & DISSEMINATED INFECTIONS,18,INFECTIOUS AND PARASITIC DISEASES (SYSTEMIC OR UNSPECIFIED SITES),4,Extreme,Extreme,Medical,Medicare,Medicaid,,,,true,258909.09,86697.44
New York City,Kings,7002053,001304,NYU Langone Hospital-Brooklyn,70 or Older,112,F,Other Race,Unknown,4,Emergency,Home or Self Care,2019,INF002,SEPTICEMIA,,,720,SEPTICEMIA & DISSEMINATED INFECTIONS,18,INFECTIOUS AND PARASITIC DISEASES (SYSTEMIC OR UNSPECIFIED SITES),3,Major,Major,Medical,Medicaid,,,,,true,50751.28,16436.44
New York City,Kings,7002053,001304,NYU Langone Hospital-Brooklyn,70 or Older,112,F,Other Race,Not Span/Hispanic,3,Emergency,Home w/ Home Health Services,2019,INF002,SEPTICEMIA,OTR004,ISOLATION PROCEDURES,720,SEPTICEMIA & DISSEMINATED INFECTIONS,18,INFECTIOUS AND PARASITIC DISEASES (SYSTEMIC OR UNSPECIFIED SITES),4,Extreme,Extreme,Medical,Medicare,Medicaid,,,,true,47198.69,15076.81
New York City,Kings,7002053,001304,NYU Langone Hospital-Brooklyn,70 or Older,112,M,Other Race,Not Span/Hispanic,7,Emergency,Skilled Nursing Home,2019,INF002,SEPTICEMIA,RES007,AIRWAY INTUBATION,720,SEPTICEMIA & DISSEMINATED INFECTIONS,18,INFECTIOUS AND PARASITIC DISEASES (SYSTEMIC OR UNSPECIFIED SITES),4,Extreme,Extreme,Medical,Medicare,Medicaid,,,,true,123767.08,44845.92
New York City,Kings,7002053,001304,NYU Langone Hospital-Brooklyn,70 or Older,112,M,White,Not Span/Hispanic,6,Emergency,Skilled Nursing Home,2019,INF002,SEPTICEMIA,ESA001,HEMODIALYSIS,720,SEPTICEMIA & DISSEMINATED INFECTIONS,18,INFECTIOUS AND PARASITIC DISEASES (SYSTEMIC OR UNSPECIFIED SITES),4,Extreme,Extreme,Medical,Medicare,Medicaid,,,,true,82102.64,26319.08
New York City,Kings,7002053,001304,NYU Langone Hospital-Brooklyn,70 or Older,112,M,Other Race,Not Span/Hispanic,9,Emergency,Home or Self Care,2019,INF002,SEPTICEMIA,ADM015,ADMINISTRATION OF ANTIBIOTICS,720,SEPTICEMIA & DISSEMINATED INFECTIONS,18,INFECTIOUS AND PARASITIC DISEASES (SYSTEMIC OR UNSPECIFIED SITES),4,Extreme,Extreme,Medical,Medicare,,,,,true,159421.38,63718.88
New York City,Kings,7002053,001304,NYU Langone Hospital-Brooklyn,18 to 29,112,F,Other Race,Spanish/Hispanic,1,Emergency,Home or Self Care,2019,INF002,SEPTICEMIA,,,720,SEPTICEMIA & DISSEMINATED INFECTIONS,18,INFECTIOUS AND PARASITIC DISEASES (SYSTEMIC OR UNSPECIFIED SITES),1,Minor,Minor,Medical,Medicaid,,,,,true,23366.75,7468.53
New York City,Kings,7002053,001304,NYU Langone Hospital-Brooklyn,70 or Older,112,M,Other Race,Not Span/Hispanic,5,Emergency,Skilled Nursing Home,2019,INF002,SEPTICEMIA,,,720,SEPTICEMIA & DISSEMINATED INFECTIONS,18,INFECTIOUS AND PARASITIC DISEASES (SYSTEMIC OR UNSPECIFIED SITES),3,Major,Major,Medical,Medicare,,,,,true,69655.68,20057.76
New York City,Kings,7002053,001304,NYU Langone Hospital-Brooklyn,70 or Older,112,F,White,Unknown,6,Emergency,Home w/ Home Health Services,2019,INF002,SEPTICEMIA,,,720,SEPTICEMIA & DISSEMINATED INFECTIONS,18,INFECTIOUS AND PARASITIC DISEASES (SYSTEMIC OR UNSPECIFIED SITES),4,Extreme,Major,Medical,Medicaid,,,,,true,92069.61,26647.07
New York City,Kings,7002053,001304,NYU Langone Hospital-Brooklyn,30 to 49,112,M,White,Not Span/Hispanic,2,Emergency,Home or Self Care,2019,INF002,SEPTICEMIA,URN006,BLADDER CATHETERIZATION AND DRAINAGE,720,SEPTICEMIA & DISSEMINATED INFECTIONS,18,INFECTIOUS AND PARASITIC DISEASES (SYSTEMIC OR UNSPECIFIED SITES),2,Moderate,Minor,Medical,Private Health Insurance,,,,,true,19574.4,7433.39