Hospital Service Area,Hospital County,Operating Certificate Number,Permanent Facility Id,Facility Name,Age Group,Zip Code - 3 digits,Gender,Race,Ethnicity,Length of Stay,Type of Admission,Patient Disposition,Discharge Year,CCS Diagnosis Code,CCS Diagnosis Description,CCS Procedure Code,CCS Procedure Description,APR DRG Code,APR DRG Description,APR MDC Code,APR MDC Description,APR Severity of Illness Code,APR Severity of Illness Description,APR Risk of Mortality,APR Medical Surgical Description,Payment Typology 1,Payment Typology 2,Payment Typology 3,Birth Weight,Abortion Edit Indicator,Emergency Department Indicator,Total Charges,Total Costs
New York City,Manhattan,7002053,001463,NYU Langone Hospitals,70 or Older,100,F,White,Not Span/Hispanic,2,Emergency,Home w/ Home Health Services,2019,INF002,SEPTICEMIA,,,720,SEPTICEMIA & DISSEMINATED INFECTIONS,18,INFECTIOUS AND PARASITIC DISEASES (SYSTEMIC OR UNSPECIFIED SITES),2,Moderate,Major,Medical,Medicaid,Blue Cross/Blue Shield,,,,true,60716.61,18029.76
New York City,Manhattan,7002053,001463,NYU Langone Hospitals,30 to 49,100,M,White,Not Span/Hispanic,6,Emergency,Home w/ Home Health Services,2019,INF002,SEPTICEMIA,,,720,SEPTICEMIA & DISSEMINATED INFECTIONS,18,INFECTIOUS AND PARASITIC DISEASES (SYSTEMIC OR UNSPECIFIED SITES),2,Moderate,Minor,Medical,Blue Cross/Blue Shield,,,,,true,91186.84,24882.68
New York City,Manhattan,7002053,001463,NYU Langone Hospitals,70 or Older,100,F,White,Not Span/Hispanic,7,Emergency,Home w/ Home Health Services,2019,INF002,SEPTICEMIA,RES007,AIRWAY INTUBATION,720,SEPTICEMIA & DISSEMINATED INFECTIONS,18,INFECTIOUS AND PARASITIC DISEASES (SYSTEMIC OR UNSPECIFIED SITES),4,Extreme,Extreme,Medical,Medicare,Blue Cross/Blue Shield,,,,true,150378.54,50647.49
New York City,Manhattan,7002053,001463,NYU Langone Hospitals,70 or Older,100,F,White,Not Span/Hispanic,5,Emergency,Home w/ Home Health Services,2019,INF002,SEPTICEMIA,,,720,SEPTICEMIA & DISSEMINATED INFECTIONS,18,INFECTIOUS AND PARASITIC DISEASES (SYSTEMIC OR UNSPECIFIED SITES),3,Major,Major,Medical,Medicare,Private Health Insurance,,,,true,61084.78,19581.56
New York City,Manhattan,7002053,001463,NYU Langone Hospitals,50 to 69,113,M,Black/African American,Not Span/Hispanic,9,Emergency,Home or Self Care,2019,INF002,SEPTICEMIA,IMG008,ULTRASONOGRAPHY,720,SEPTICEMIA & DISSEMINATED INFECTIONS,18,INFECTIOUS AND PARASITIC DISEASES (SYSTEMIC OR UNSPECIFIED SITES),3,Major,Minor,Medical,Private Health Insurance,,,,,true,139399.58,39685.46
New York City,Manhattan,7002053,001463,NYU Langone Hospitals,70 or Older,112,F,White,Not Span/Hispanic,5,Emergency,Home w/ Home Health Services,2019,INF002,SEPTICEMIA,,,720,SEPTICEMIA & DISSEMINATED INFECTIONS,18,INFECTIOUS AND PARASITIC DISEASES (SYSTEMIC OR UNSPECIFIED SITES),3,Major,Major,Medical,Medicare,Medicaid,,,,true,82402.41,23173.26
New York City,Manhattan,7002053,001463,NYU Langone Hospitals,70 or Older,100,M,White,Not Span/Hispanic,21,Emergency,Home w/ Home Health Services,2019,INF002,SEPTICEMIA,ESA003,MECHANICAL VENTILATION,720,SEPTICEMIA & DISSEMINATED INFECTIONS,18,INFECTIOUS AND PARASITIC DISEASES (SYSTEMIC OR UNSPECIFIED SITES),4,Extreme,Extreme,Medical,Medicare,Blue Cross/Blue Shield,,,,true,333722.25,116194.45
New York City,Manhattan,7002053,001463,NYU Langone Hospitals,70 or Older,100,F,White,Not Span/Hispanic,10,Emergency,Home w/ Home Health Services,2019,INF002,SEPTICEMIA,RES007,AIRWAY INTUBATION,720,SEPTICEMIA & DISSEMINATED INFECTIONS,18,INFECTIOUS AND PARASITIC DISEASES (SYSTEMIC OR UNSPECIFIED SITES),4,Extreme,Extreme,Medical,Medicare,Medicare,,,,true,135717.59,49191.79
New York City,Manhattan,7002053,001463,NYU Langone Hospitals,70 or Older,112,M,White,Not Span/Hispanic,11,Emergency,Skilled Nursing Home,2019,INF002,SEPTICEMIA,ADM021,"ADMINISTRATION OF THERAPEUTIC SUBSTANCES, NEC",720,SEPTICEMIA & DISSEMINATED INFECTIONS,18,INFECTIOUS AND PARASITIC DISEASES (SYSTEMIC OR UNSPECIFIED SITES),4,Extreme,Extreme,Medical,Blue Cross/Blue Shield,Private Health Insurance,,,,true,110503.45,41851.75
New York City,Manhattan,7002053,001463,NYU Langone Hospitals,50 to 69,100,F,White,Not Span/Hispanic,5,Emergency,Home or Self Care,2019,INF002,SEPTICEMIA,,,720,SEPTICEMIA & DISSEMINATED INFECTIONS,18,INFECTIOUS AND PARASITIC DISEASES (SYSTEMIC OR UNSPECIFIED SITES),4,Extreme,Major,Medical,Private Health Insurance,,,,,true,97466.43,31930.24
New York City,Manhattan,7002053,001463,NYU Langone Hospitals,50 to 69,116,M,White,Spanish/Hispanic,5,Emergency,Expired,2019,INF002,SEPTICEMIA,CAR024,VENOUS AND ARTERIAL CATHETER PLACEMENT,720,SEPTICEMIA & DISSEMINATED INFECTIONS,18,INFECTIOUS AND PARASITIC DISEASES (SYSTEMIC OR UNSPECIFIED SITES),4,Extreme,Extreme,Medical,Medicare,,,,,false,240379.02,54121.71
New York City,Manhattan,7002053,001463,NYU Langone Hospitals,70 or Older,112,F,White,Not Span/Hispanic,33,Emergency,Home w/ Home Health Services,2019,INF002,SEPTICEMIA,RES003,THORACENTESIS (DIAGNOSTIC),720,SEPTICEMIA & DISSEMINATED INFECTIONS,18,INFECTIOUS AND PARASITIC DISEASES (SYSTEMIC OR UNSPECIFIED SITES),4,Extreme,Extreme,Medical,Blue Cross/Blue Shield,,,,,true,439824.79,154886.04
New York City,Manhattan,7002053,001463,NYU Langone Hospitals,50 to 69,100,F,Other Race,Not Span/Hispanic,10,Emergency,Home w/ Home Health Services,2019,INF002,SEPTICEMIA,ADM001,TRANSFUSION OF BLOOD AND BLOOD PRODUCTS,720,SEPTICEMIA & DISSEMINATED INFECTIONS,18,INFECTIOUS AND PARASITIC DISEASES (SYSTEMIC OR UNSPECIFIED SITES),4,Extreme,Major,Medical,Medicare,Medicaid,,,,true,163337.64,42487.63
New York City,Manhattan,7002053,001463,NYU Langone Hospitals,70 or Older,100,F,Other Race,Not Span/Hispanic,2,Emergency,Home or Self Care,2019,INF002,SEPTICEMIA,,,720,SEPTICEMIA & DISSEMINATED INFECTIONS,18,INFECTIOUS AND PARASITIC DISEASES (SYSTEMIC OR UNSPECIFIED SITES),3,Major,Major,Medical,Medicaid,,,,,true,37908.07,8626.98
New York City,Manhattan,7002053,001463,NYU Langone Hospitals,70 or Older,112,M,White,Not Span/Hispanic,8,Emergency,Home or Self Care,2019,INF002,SEPTICEMIA,HEP010,HEPATOBILIARY AND PANCREATIC DRAINAGE,720,SEPTICEMIA & DISSEMINATED INFECTIONS,18,INFECTIOUS AND PARASITIC DISEASES (SYSTEMIC OR UNSPECIFIED SITES),4,Extreme,Major,Medical,Medicare,Medicare,,,,true,141751.44,34066.33
New York City,Manhattan,7002053,001463,NYU Langone Hospitals,70 or Older,100,F,Other Race,Not Span/Hispanic,15,Emergency,Skilled Nursing Home,2019,INF002,SEPTICEMIA,HEP008,COMMON BILE DUCT SPHINCTEROTOMY AND STENTING,720,SEPTICEMIA & DISSEMINATED INFECTIONS,18,INFECTIOUS AND PARASITIC DISEASES (SYSTEMIC OR UNSPECIFIED SITES),4,Extreme,Extreme,Medical,Medicare,Medicaid,,,,true,254859.8,73791.47
New York City,Manhattan,7002053,001463,NYU Langone Hospitals,70 or Older,100,M,White,Not Span/Hispanic,1,Emergency,Expired,2019,INF002,SEPTICEMIA,CAR024,VENOUS AND ARTERIAL CATHETER PLACEMENT,720,SEPTICEMIA & DISSEMINATED INFECTIONS,18,INFECTIOUS AND PARASITIC DISEASES (SYSTEMIC OR UNSPECIFIED SITES),3,Major,Extreme,Medical,Medicare,Blue Cross/Blue Shield,,,,true,28973.1,9071.17
New York City,Manhattan,7002053,001463,NYU Langone Hospitals,70 or Older,100,F,White,Not Span/Hispanic,10,Emergency,Skilled Nursing Home,2019,INF002,SEPTICEMIA,,,720,SEPTICEMIA & DISSEMINATED INFECTIONS,18,INFECTIOUS AND PARASITIC DISEASES (SYSTEMIC OR UNSPECIFIED SITES),4,Extreme,Extreme,Medical,Medicare,Medicare,,,,true,101080.93,39715.27
New York City,Manhattan,7002053,001463,NYU Langone Hospitals,70 or Older,110,M,White,Not Span/Hispanic,2,Emergency,Home or Self Care,2019,INF002,SEPTICEMIA,ADM001,TRANSFUSION OF BLOOD AND BLOOD PRODUCTS,720,SEPTICEMIA & DISSEMINATED INFECTIONS,18,INFECTIOUS AND PARASITIC DISEASES (SYSTEMIC OR UNSPECIFIED SITES),2,Moderate,Moderate,Medical,Private Health Insurance,Medicare,,,,true,36015.15,9832.44
New York City,Manhattan,7002053,001463,NYU Langone Hospitals,70 or Older,100,F,White,Not Span/Hispanic,10,Emergency,Home w/ Home Health Services,2019,INF002,SEPTICEMIA,ESA001,HEMODIALYSIS,720,SEPTICEMIA & DISSEMINATED INFECTIONS,18,INFECTIOUS AND PARASITIC DISEASES (SYSTEMIC OR UNSPECIFIED SITES),3,Major,Major,Medical,Medicare,Private Health Insurance,,,,true,151449.93,53677.93
New York City,Manhattan,7002053,001463,NYU Langone Hospitals,70 or Older,100,F,White,Not Span/Hispanic,3,Emergency,Skilled Nursing Home,2019,INF002,SEPTICEMIA,IMG008,ULTRASONOGRAPHY,720,SEPTICEMIA & DISSEMINATED INFECTIONS,18,INFECTIOUS AND PARASITIC DISEASES (SYSTEMIC OR UNSPECIFIED SITES),4,Extreme,Extreme,Medical,Medicare,,,,,true,57072.13,14949.07
New York City,Manhattan,7002053,001463,NYU Langone Hospitals,50 to 69,100,M,White,Not Span/Hispanic,4,Emergency,Home w/ Home Health Services,2019,INF002,SEPTICEMIA,HEP010,HEPATOBILIARY AND PANCREATIC DRAINAGE,720,SEPTICEMIA & DISSEMINATED INFECTIONS,18,INFECTIOUS AND PARASITIC DISEASES (SYSTEMIC OR UNSPECIFIED SITES),3,Major,Extreme,Medical,Medicare,Medicare,,,,true,76042.17,18828
New York City,Manhattan,7002053,001463,NYU Langone Hospitals,50 to 69,114,M,White,Unknown,9,Emergency,Home or Self Care,2019,INF002,SEPTICEMIA,ESA004,NON-INVASIVE VENTILATION,720,SEPTICEMIA & DISSEMINATED INFECTIONS,18,INFECTIOUS AND PARASITIC DISEASES (SYSTEMIC OR UNSPECIFIED SITES),4,Extreme,Extreme,Medical,Medicare,Private Health Insurance,,,,true,226473.11,74550.3
New York City,Manhattan,7002053,001463,NYU Langone Hospitals,70 or Older,100,F,White,Not Span/Hispanic,10,Emergency,Inpatient Rehabilitation Facility,2019,INF002,SEPTICEMIA,IMG008,ULTRASONOGRAPHY,720,SEPTICEMIA & DISSEMINATED INFECTIONS,18,INFECTIOUS AND PARASITIC DISEASES (SYSTEMIC OR UNSPECIFIED SITES),4,Extreme,Extreme,Medical,Medicare,Medicare,,,,false,133329.33,43727.43
New York City,Manhattan,7002053,001463,NYU Langone Hospitals,50 to 69,113,M,White,Not Span/Hispanic,14,Emergency,Home w/ Home Health Services,2019,INF002,SEPTICEMIA,MST001,ARTHROCENTESIS,720,SEPTICEMIA & DISSEMINATED INFECTIONS,18,INFECTIOUS AND PARASITIC DISEASES (SYSTEMIC OR UNSPECIFIED SITES),3,Major,Major,Medical,Medicare,Medicare,,,,true,207288.73,55054.63
New York City,Manhattan,7002053,001463,NYU Langone Hospitals,70 or Older,100,F,White,Not Span/Hispanic,3,Emergency,Home or Self Care,2019,INF002,SEPTICEMIA,URN003,URETER AND OTHER URINARY TRACT DILATION,720,SEPTICEMIA & DISSEMINATED INFECTIONS,18,INFECTIOUS AND PARASITIC DISEASES (SYSTEMIC OR UNSPECIFIED SITES),4,Extreme,Extreme,Medical,Medicaid,,,,,true,75618.29,17269.01
New York City,Manhattan,7002053,001463,NYU Langone Hospitals,70 or Older,OOS,F,White,Not Span/Hispanic,6,Emergency,Home or Self Care,2019,INF002,SEPTICEMIA,URN001,CYSTOSCOPY AND URETEROSCOPY (INCLUDING BIOPSY),720,SEPTICEMIA & DISSEMINATED INFECTIONS,18,INFECTIOUS AND PARASITIC DISEASES (SYSTEMIC OR UNSPECIFIED SITES),3,Major,Extreme,Medical,Medicare,Blue Cross/Blue Shield,,,,true,178094.9,52107.53
New York City,Manhattan,7002053,001463,NYU Langone Hospitals,0 to 17,100,M,White,Unknown,2,Emergency,Home or Self Care,2019,INF002,SEPTICEMIA,CNS002,LUMBAR PUNCTURE,720,SEPTICEMIA & DISSEMINATED INFECTIONS,18,INFECTIOUS AND PARASITIC DISEASES (SYSTEMIC OR UNSPECIFIED SITES),2,Moderate,Minor,Medical,Private Health Insurance,,,04300,,true,27817.88,7435.99
New York City,Manhattan,7002053,001463,NYU Langone Hospitals,50 to 69,100,F,Black/African American,Not Span/Hispanic,5,Emergency,Home or Self Care,2019,INF002,SEPTICEMIA,,,720,SEPTICEMIA & DISSEMINATED INFECTIONS,18,INFECTIOUS AND PARASITIC DISEASES (SYSTEMIC OR UNSPECIFIED SITES),3,Major,Major,Medical,Blue Cross/Blue Shield,,,,,true,71475.74,21458.93
New York City,Manhattan,7002053,001463,NYU Langone Hospitals,70 or Older,112,M,White,Not Span/Hispanic,20,Emergency,Home w/ Home Health Services,2019,INF002,SEPTICEMIA,ADM001,TRANSFUSION OF BLOOD AND BLOOD PRODUCTS,720,SEPTICEMIA & DISSEMINATED INFECTIONS,18,INFECTIOUS AND PARASITIC DISEASES (SYSTEMIC OR UNSPECIFIED SITES),4,Extreme,Extreme,Medical,Medicare,Blue Cross/Blue Shield,,,,true,219969.86,70870.81
New York City,Manhattan,7002053,001463,NYU Langone Hospitals,18 to 29,117,F,White,Not Span/Hispanic,3,Emergency,Home w/ Home Health Services,2019,INF002,SEPTICEMIA,ADM021,"ADMINISTRATION OF THERAPEUTIC SUBSTANCES, NEC",720,SEPTICEMIA & DISSEMINATED INFECTIONS,18,INFECTIOUS AND PARASITIC DISEASES (SYSTEMIC OR UNSPECIFIED SITES),2,Moderate,Minor,Medical,Private Health Insurance,,,,,true,42140.63,12500.01
New York City,Manhattan,7002053,001463,NYU Langone Hospitals,70 or Older,112,F,White,Not Span/Hispanic,5,Emergency,Home w/ Home Health Services,2019,INF002,SEPTICEMIA,,,720,SEPTICEMIA & DISSEMINATED INFECTIONS,18,INFECTIOUS AND PARASITIC DISEASES (SYSTEMIC OR UNSPECIFIED SITES),3,Major,Major,Medical,Medicare,Medicaid,,,,true,72756.68,21041.18
New York City,Manhattan,7002053,001463,NYU Langone Hospitals,70 or Older,113,F,White,Not Span/Hispanic,1,Emergency,Hospice - Medical Facility,2019,INF002,SEPTICEMIA,ADM001,TRANSFUSION OF BLOOD AND BLOOD PRODUCTS,720,SEPTICEMIA & DISSEMINATED INFECTIONS,18,INFECTIOUS AND PARASITIC DISEASES (SYSTEMIC OR UNSPECIFIED SITES),4,Extreme,Extreme,Medical,Medicare,Medicaid,,,,false,77125.54,19036.87
New York City,Manhattan,7002053,001463,NYU Langone Hospitals,30 to 49,OOS,M,White,Not Span/Hispanic,8,Emergency,Home w/ Home Health Services,2019,INF002,SEPTICEMIA,RES001,BRONCHOSCOPY (DIAGNOSTIC),720,SEPTICEMIA & DISSEMINATED INFECTIONS,18,INFECTIOUS AND PARASITIC DISEASES (SYSTEMIC OR UNSPECIFIED SITES),4,Extreme,Extreme,Medical,Medicare,,,,,false,290822.27,56844.71
New York City,Manhattan,7002053,001463,NYU Langone Hospitals,70 or Older,114,M,White,Not Span/Hispanic,4,Emergency,Home w/ Home Health Services,2019,INF002,SEPTICEMIA,,,720,SEPTICEMIA & DISSEMINATED INFECTIONS,18,INFECTIOUS AND PARASITIC DISEASES (SYSTEMIC OR UNSPECIFIED SITES),3,Major,Major,Medical,Medicare,Medicare,,,,true,51283.5,15860.73
New York City,Manhattan,7002053,001463,NYU Langone Hospitals,0 to 17,113,M,Other Race,Spanish/Hispanic,4,Emergency,Home w/ Home Health Services,2019,INF002,SEPTICEMIA,OTR004,ISOLATION PROCEDURES,720,SEPTICEMIA & DISSEMINATED INFECTIONS,18,INFECTIOUS AND PARASITIC DISEASES (SYSTEMIC OR UNSPECIFIED SITES),4,Extreme,Major,Medical,Medicaid,,,,,true,91457.69,34353.29
New York City,Manhattan,7002053,001463,NYU Langone Hospitals,70 or Older,100,F,White,Not Span/Hispanic,21,Emergency,Medicare Cert Long Term Care Hospital,2019,INF002,SEPTICEMIA,RES001,BRONCHOSCOPY (DIAGNOSTIC),720,SEPTICEMIA & DISSEMINATED INFECTIONS,18,INFECTIOUS AND PARASITIC DISEASES (SYSTEMIC OR UNSPECIFIED SITES),4,Extreme,Extreme,Medical,Medicare,Medicare,Medicaid,,,true,711439.81,196686.65
New York City,Manhattan,7002053,001463,NYU Langone Hospitals,50 to 69,113,M,White,Not Span/Hispanic,3,Emergency,Home or Self Care,2019,INF002,SEPTICEMIA,ADM021,"ADMINISTRATION OF THERAPEUTIC SUBSTANCES, NEC",720,SEPTICEMIA & DISSEMINATED INFECTIONS,18,INFECTIOUS AND PARASITIC DISEASES (SYSTEMIC OR UNSPECIFIED SITES),3,Major,Moderate,Medical,Private Health Insurance,,,,,true,58392.09,14427.79
New York City,Manhattan,7002053,001463,NYU Langone Hospitals,50 to 69,111,M,White,Not Span/Hispanic,4,Emergency,Home or Self Care,2019,INF002,SEPTICEMIA,,,720,SEPTICEMIA & DISSEMINATED INFECTIONS,18,INFECTIOUS AND PARASITIC DISEASES (SYSTEMIC OR UNSPECIFIED SITES),2,Moderate,Minor,Medical,Medicaid,,,,,true,54907.75,15579.47
New York City,Manhattan,7002053,001463,NYU Langone Hospitals,70 or Older,100,F,Other Race,Not Span/Hispanic,2,Emergency,Home w/ Home Health Services,2019,INF002,SEPTICEMIA,,,720,SEPTICEMIA & DISSEMINATED INFECTIONS,18,INFECTIOUS AND PARASITIC DISEASES (SYSTEMIC OR UNSPECIFIED SITES),2,Moderate,Major,Medical,Medicare,,,,,true,44506.27,14569.55
New York City,Manhattan,7002053,001463,NYU Langone Hospitals,0 to 17,143,F,Multi-racial,Not Span/Hispanic,7,Emergency,Home w/ Home Health Services,2019,INF002,SEPTICEMIA,IMG008,ULTRASONOGRAPHY,720,SEPTICEMIA & DISSEMINATED INFECTIONS,18,INFECTIOUS AND PARASITIC DISEASES (SYSTEMIC OR UNSPECIFIED SITES),4,Extreme,Extreme,Medical,Medicaid,,,,,true,100122.65,27849.18
New York City,Manhattan,7002053,001463,NYU Langone Hospitals,30 to 49,100,M,Other Race,Not Span/Hispanic,6,Emergency,Home or Self Care,2019,INF002,SEPTICEMIA,,,720,SEPTICEMIA & DISSEMINATED INFECTIONS,18,INFECTIOUS AND PARASITIC DISEASES (SYSTEMIC OR UNSPECIFIED SITES),3,Major,Moderate,Medical,Medicare,Medicaid,,,,true,134835.86,27728.38
New York City,Manhattan,7002053,001463,NYU Langone Hospitals,50 to 69,113,F,White,Not Span/Hispanic,3,Emergency,Home or Self Care,2019,INF002,SEPTICEMIA,,,720,SEPTICEMIA & DISSEMINATED INFECTIONS,18,INFECTIOUS AND PARASITIC DISEASES (SYSTEMIC OR UNSPECIFIED SITES),2,Moderate,Moderate,Medical,Self-Pay,,,,,true,43934.75,12956.28
New York City,Manhattan,7002053,001463,NYU Langone Hospitals,70 or Older,103,M,White,Not Span/Hispanic,6,Emergency,Home w/ Home Health Services,2019,INF002,SEPTICEMIA,URN006,BLADDER CATHETERIZATION AND DRAINAGE,720,SEPTICEMIA & DISSEMINATED INFECTIONS,18,INFECTIOUS AND PARASITIC DISEASES (SYSTEMIC OR UNSPECIFIED SITES),4,Extreme,Major,Medical,Medicare,,,,,true,74912.4,25015.85
New York City,Manhattan,7002053,001463,NYU Langone Hospitals,30 to 49,116,F,Black/African American,Not Span/Hispanic,6,Emergency,Home w/ Home Health Services,2019,INF002,SEPTICEMIA,URN003,URETER AND OTHER URINARY TRACT DILATION,720,SEPTICEMIA & DISSEMINATED INFECTIONS,18,INFECTIOUS AND PARASITIC DISEASES (SYSTEMIC OR UNSPECIFIED SITES),3,Major,Major,Medical,Medicare,Medicaid,,,,true,111601.99,29585.77
New York City,Manhattan,7002053,001463,NYU Langone Hospitals,70 or Older,100,F,Other Race,Not Span/Hispanic,1,Emergency,Expired,2019,INF002,SEPTICEMIA,,,720,SEPTICEMIA & DISSEMINATED INFECTIONS,18,INFECTIOUS AND PARASITIC DISEASES (SYSTEMIC OR UNSPECIFIED SITES),3,Major,Extreme,Medical,Medicare,Medicaid,,,,true,26567.26,8808.04
New York City,Manhattan,7002053,001463,NYU Langone Hospitals,50 to 69,112,M,White,Not Span/Hispanic,8,Emergency,Home or Self Care,2019,INF002,SEPTICEMIA,ADM010,VACCINATIONS,720,SEPTICEMIA & DISSEMINATED INFECTIONS,18,INFECTIOUS AND PARASITIC DISEASES (SYSTEMIC OR UNSPECIFIED SITES),3,Major,Major,Medical,Medicare,Private Health Insurance,,,,true,98821.75,32598.32
New York City,Manhattan,7002053,001463,NYU Langone Hospitals,50 to 69,112,F,White,Not Span/Hispanic,5,Emergency,Home or Self Care,2019,INF002,SEPTICEMIA,,,720,SEPTICEMIA & DISSEMINATED INFECTIONS,18,INFECTIOUS AND PARASITIC DISEASES (SYSTEMIC OR UNSPECIFIED SITES),3,Major,Major,Medical,Private Health Insurance,,,,,true,70677.68,21100.14
New York City,Manhattan,7002053,001463,NYU Langone Hospitals,70 or Older,113,F,White,Not Span/Hispanic,1,Emergency,Home w/ Home Health Services,2019,INF002,SEPTICEMIA,,,720,SEPTICEMIA & DISSEMINATED INFECTIONS,18,INFECTIOUS AND PARASITIC DISEASES (SYSTEMIC OR UNSPECIFIED SITES),3,Major,Moderate,Medical,Medicare,Medicaid,,,,true,33926.57,10903.46
New York City,Manhattan,7002053,001463,NYU Langone Hospitals,30 to 49,100,M,White,Not Span/Hispanic,4,Emergency,Home w/ Home Health Services,2019,INF002,SEPTICEMIA,ADM001,TRANSFUSION OF BLOOD AND BLOOD PRODUCTS,720,SEPTICEMIA & DISSEMINATED INFECTIONS,18,INFECTIOUS AND PARASITIC DISEASES (SYSTEMIC OR UNSPECIFIED SITES),3,Major,Major,Medical,Blue Cross/Blue Shield,,,,,true,52076.08,16077.06
New York City,Manhattan,7002053,001463,NYU Langone Hospitals,70 or Older,112,M,White,Not Span/Hispanic,8,Emergency,Skilled Nursing Home,2019,INF002,SEPTICEMIA,RES003,THORACENTESIS (DIAGNOSTIC),720,SEPTICEMIA & DISSEMINATED INFECTIONS,18,INFECTIOUS AND PARASITIC DISEASES (SYSTEMIC OR UNSPECIFIED SITES),3,Major,Major,Medical,Medicare,Medicaid,,,,true,106624.79,33030.67
New York City,Manhattan,7002053,001463,NYU Langone Hospitals,70 or Older,112,M,White,Not Span/Hispanic,5,Emergency,Skilled Nursing Home,2019,INF002,SEPTICEMIA,CAR024,VENOUS AND ARTERIAL CATHETER PLACEMENT,720,SEPTICEMIA & DISSEMINATED INFECTIONS,18,INFECTIOUS AND PARASITIC DISEASES (SYSTEMIC OR UNSPECIFIED SITES),2,Moderate,Major,Medical,Medicare,Private Health Insurance,,,,true,72990.14,21608.63
New York City,Manhattan,7002053,001463,NYU Langone Hospitals,70 or Older,100,M,White,Not Span/Hispanic,1,Emergency,Home or Self Care,2019,INF002,SEPTICEMIA,,,720,SEPTICEMIA & DISSEMINATED INFECTIONS,18,INFECTIOUS AND PARASITIC DISEASES (SYSTEMIC OR UNSPECIFIED SITES),2,Moderate,Moderate,Medical,Medicare,Medicare,,,,true,41663.36,12325.48
New York City,Manhattan,7002053,001463,NYU Langone Hospitals,50 to 69,112,M,White,Not Span/Hispanic,11,Emergency,Skilled Nursing Home,2019,INF002,SEPTICEMIA,IMG008,ULTRASONOGRAPHY,720,SEPTICEMIA & DISSEMINATED INFECTIONS,18,INFECTIOUS AND PARASITIC DISEASES (SYSTEMIC OR UNSPECIFIED SITES),4,Extreme,Extreme,Medical,Private Health Insurance,,,,,true,159484.26,47954.95
New York City,Manhattan,7002053,001463,NYU Langone Hospitals,70 or Older,100,M,White,Not Span/Hispanic,5,Emergency,Skilled Nursing Home,2019,INF002,SEPTICEMIA,,,720,SEPTICEMIA & DISSEMINATED INFECTIONS,18,INFECTIOUS AND PARASITIC DISEASES (SYSTEMIC OR UNSPECIFIED SITES),3,Major,Major,Medical,Medicare,Blue Cross/Blue Shield,,,,true,57037.56,21833.15
New York City,Manhattan,7002053,001463,NYU Langone Hospitals,70 or Older,103,M,White,Not Span/Hispanic,43,Elective,Hospice - Medical Facility,2019,INF002,SEPTICEMIA,OTR004,ISOLATION PROCEDURES,720,SEPTICEMIA & DISSEMINATED INFECTIONS,18,INFECTIOUS AND PARASITIC DISEASES (SYSTEMIC OR UNSPECIFIED SITES),4,Extreme,Extreme,Medical,Private Health Insurance,Medicare,,,,false,1550608.43,279799.34
New York City,Manhattan,7002053,001463,NYU Langone Hospitals,70 or Older,112,F,Other Race,Spanish/Hispanic,5,Emergency,Skilled Nursing Home,2019,INF002,SEPTICEMIA,,,720,SEPTICEMIA & DISSEMINATED INFECTIONS,18,INFECTIOUS AND PARASITIC DISEASES (SYSTEMIC OR UNSPECIFIED SITES),3,Major,Major,Medical,Medicare,Medicaid,,,,true,60566.92,24323.92
New York City,Manhattan,7002053,001463,NYU Langone Hospitals,50 to 69,100,F,White,Not Span/Hispanic,10,Emergency,Skilled Nursing Home,2019,INF002,SEPTICEMIA,CAR024,VENOUS AND ARTERIAL CATHETER PLACEMENT,720,SEPTICEMIA & DISSEMINATED INFECTIONS,18,INFECTIOUS AND PARASITIC DISEASES (SYSTEMIC OR UNSPECIFIED SITES),4,Extreme,Extreme,Medical,Medicare,Medicaid,,,,true,180721.8,50092.57
New York City,Manhattan,7002053,001463,NYU Langone Hospitals,50 to 69,104,F,Other Race,Not Span/Hispanic,12,Emergency,Hospice - Medical Facility,2019,INF002,SEPTICEMIA,RES003,THORACENTESIS (DIAGNOSTIC),720,SEPTICEMIA & DISSEMINATED INFECTIONS,18,INFECTIOUS AND PARASITIC DISEASES (SYSTEMIC OR UNSPECIFIED SITES),4,Extreme,Extreme,Medical,Private Health Insurance,,,,,true,123079.66,41972.03
New York City,Manhattan,7002053,001463,NYU Langone Hospitals,70 or Older,100,M,White,Not Span/Hispanic,4,Emergency,Home w/ Home Health Services,2019,INF002,SEPTICEMIA,,,720,SEPTICEMIA & DISSEMINATED INFECTIONS,18,INFECTIOUS AND PARASITIC DISEASES (SYSTEMIC OR UNSPECIFIED SITES),4,Extreme,Extreme,Medical,Medicare,Medicaid,,,,true,69591.28,19819.2
New York City,Manhattan,7002053,001463,NYU Langone Hospitals,50 to 69,111,F,Black/African American,Not Span/Hispanic,7,Emergency,Home w/ Home Health Services,2019,INF002,SEPTICEMIA,,,720,SEPTICEMIA & DISSEMINATED INFECTIONS,18,INFECTIOUS AND PARASITIC DISEASES (SYSTEMIC OR UNSPECIFIED SITES),4,Extreme,Extreme,Medical,Blue Cross/Blue Shield,Medicaid,,,,true,129897.53,35161.65
New York City,Manhattan,7002053,001463,NYU Langone Hospitals,70 or Older,112,F,White,Not Span/Hispanic,6,Emergency,Home w/ Home Health Services,2019,INF002,SEPTICEMIA,GIS006,PARACENTESIS,720,SEPTICEMIA & DISSEMINATED INFECTIONS,18,INFECTIOUS AND PARASITIC DISEASES (SYSTEMIC OR UNSPECIFIED SITES),2,Moderate,Minor,Medical,Blue Cross/Blue Shield,Medicare,,,,true,81042.46,24737.09