Hospital Service Area,Hospital County,Operating Certificate Number,Permanent Facility Id,Facility Name,Age Group,Zip Code - 3 digits,Gender,Race,Ethnicity,Length of Stay,Type of Admission,Patient Disposition,Discharge Year,CCS Diagnosis Code,CCS Diagnosis Description,CCS Procedure Code,CCS Procedure Description,APR DRG Code,APR DRG Description,APR MDC Code,APR MDC Description,APR Severity of Illness Code,APR Severity of Illness Description,APR Risk of Mortality,APR Medical Surgical Description,Payment Typology 1,Payment Typology 2,Payment Typology 3,Birth Weight,Abortion Edit Indicator,Emergency Department Indicator,Total Charges,Total Costs
New York City,Kings,7002053,001304,NYU Langone Hospital-Brooklyn,70 or Older,112,F,White,Not Span/Hispanic,10,Emergency,Home w/ Home Health Services,2020,INF002,SEPTICEMIA,ADM015,ADMINISTRATION OF ANTIBIOTICS,720,SEPTICEMIA & DISSEMINATED INFECTIONS,18,INFECTIOUS AND PARASITIC DISEASES (SYSTEMIC OR UNSPECIFIED SITES),3,Major,Major,Medical,Medicare,Medicare,,,,Y,97746.74,34558.52
New York City,Kings,7002053,001304,NYU Langone Hospital-Brooklyn,50 to 69,112,M,Other Race,Not Span/Hispanic,5,Emergency,Home or Self Care,2020,INF002,SEPTICEMIA,,,720,SEPTICEMIA & DISSEMINATED INFECTIONS,18,INFECTIOUS AND PARASITIC DISEASES (SYSTEMIC OR UNSPECIFIED SITES),2,Moderate,Moderate,Medical,Medicaid,,,,,Y,92471.79,19074.75
New York City,Kings,7002053,001304,NYU Langone Hospital-Brooklyn,50 to 69,112,M,White,Not Span/Hispanic,5,Emergency,Home or Self Care,2020,INF002,SEPTICEMIA,ADM015,ADMINISTRATION OF ANTIBIOTICS,720,SEPTICEMIA & DISSEMINATED INFECTIONS,18,INFECTIOUS AND PARASITIC DISEASES (SYSTEMIC OR UNSPECIFIED SITES),2,Moderate,Moderate,Medical,Medicare,Private Health Insurance,,,,Y,62798.89,18513.46
New York City,Kings,7002053,001304,NYU Langone Hospital-Brooklyn,70 or Older,112,F,White,Not Span/Hispanic,2,Emergency,Hospice - Medical Facility,2020,INF002,SEPTICEMIA,ESA004,NON-INVASIVE VENTILATION,720,SEPTICEMIA & DISSEMINATED INFECTIONS,18,INFECTIOUS AND PARASITIC DISEASES (SYSTEMIC OR UNSPECIFIED SITES),4,Extreme,Extreme,Medical,Medicare,Medicare,Private Health Insurance,,,Y,59891.96,17720.03
New York City,Kings,7002053,001304,NYU Langone Hospital-Brooklyn,50 to 69,112,F,White,Spanish/Hispanic,6,Emergency,Home w/ Home Health Services,2020,INF002,SEPTICEMIA,,,720,SEPTICEMIA & DISSEMINATED INFECTIONS,18,INFECTIOUS AND PARASITIC DISEASES (SYSTEMIC OR UNSPECIFIED SITES),2,Moderate,Major,Medical,Medicaid,,,,,Y,79636.19,21530.15
New York City,Kings,7002053,001304,NYU Langone Hospital-Brooklyn,70 or Older,112,F,Other Race,Spanish/Hispanic,4,Emergency,Hospice - Home,2020,INF002,SEPTICEMIA,,,720,SEPTICEMIA & DISSEMINATED INFECTIONS,18,INFECTIOUS AND PARASITIC DISEASES (SYSTEMIC OR UNSPECIFIED SITES),4,Extreme,Extreme,Medical,Medicare,,,,,Y,63190.54,15992.78
New York City,Kings,7002053,001304,NYU Langone Hospital-Brooklyn,70 or Older,112,F,Other Race,Unknown,4,Emergency,Home w/ Home Health Services,2020,INF002,SEPTICEMIA,,,720,SEPTICEMIA & DISSEMINATED INFECTIONS,18,INFECTIOUS AND PARASITIC DISEASES (SYSTEMIC OR UNSPECIFIED SITES),3,Major,Major,Medical,Medicaid,,,,,Y,53077.98,14565.66
New York City,Kings,7002053,001304,NYU Langone Hospital-Brooklyn,30 to 49,112,M,Black/African American,Spanish/Hispanic,2,Emergency,Home or Self Care,2020,INF002,SEPTICEMIA,,,720,SEPTICEMIA & DISSEMINATED INFECTIONS,18,INFECTIOUS AND PARASITIC DISEASES (SYSTEMIC OR UNSPECIFIED SITES),3,Major,Major,Medical,Medicare,Private Health Insurance,,,,Y,42633.17,8835.07
New York City,Kings,7002053,001304,NYU Langone Hospital-Brooklyn,70 or Older,112,M,White,Not Span/Hispanic,8,Emergency,Skilled Nursing Home,2020,INF002,SEPTICEMIA,,,720,SEPTICEMIA & DISSEMINATED INFECTIONS,18,INFECTIOUS AND PARASITIC DISEASES (SYSTEMIC OR UNSPECIFIED SITES),2,Moderate,Minor,Medical,Medicare,,,,,Y,150613.19,30902.54
New York City,Kings,7002053,001304,NYU Langone Hospital-Brooklyn,50 to 69,112,M,White,Not Span/Hispanic,2,Emergency,Home or Self Care,2020,INF002,SEPTICEMIA,,,720,SEPTICEMIA & DISSEMINATED INFECTIONS,18,INFECTIOUS AND PARASITIC DISEASES (SYSTEMIC OR UNSPECIFIED SITES),2,Moderate,Minor,Medical,Medicare,Medicaid,,,,Y,61247.27,15710.06
New York City,Kings,7002053,001304,NYU Langone Hospital-Brooklyn,70 or Older,112,F,Black/African American,Not Span/Hispanic,4,Emergency,Home w/ Home Health Services,2020,INF002,SEPTICEMIA,ESA001,HEMODIALYSIS,720,SEPTICEMIA & DISSEMINATED INFECTIONS,18,INFECTIOUS AND PARASITIC DISEASES (SYSTEMIC OR UNSPECIFIED SITES),3,Major,Extreme,Medical,Private Health Insurance,Medicaid,,,,Y,78356.36,19086.86
New York City,Kings,7002053,001304,NYU Langone Hospital-Brooklyn,50 to 69,112,M,Other Race,Not Span/Hispanic,1,Emergency,Left Against Medical Advice,2020,INF002,SEPTICEMIA,OTR004,ISOLATION PROCEDURES,720,SEPTICEMIA & DISSEMINATED INFECTIONS,18,INFECTIOUS AND PARASITIC DISEASES (SYSTEMIC OR UNSPECIFIED SITES),3,Major,Minor,Medical,Medicaid,,,,,Y,36215.43,9385.36
New York City,Kings,7002053,001304,NYU Langone Hospital-Brooklyn,70 or Older,112,M,Other Race,Spanish/Hispanic,7,Emergency,Hospice - Home,2020,INF002,SEPTICEMIA,RES007,AIRWAY INTUBATION,720,SEPTICEMIA & DISSEMINATED INFECTIONS,18,INFECTIOUS AND PARASITIC DISEASES (SYSTEMIC OR UNSPECIFIED SITES),4,Extreme,Extreme,Medical,Medicare,Medicaid,,,,Y,95919.56,30427.29
New York City,Kings,7002053,001304,NYU Langone Hospital-Brooklyn,50 to 69,OOS,F,White,Not Span/Hispanic,2,Emergency,Home or Self Care,2020,INF002,SEPTICEMIA,CNS002,LUMBAR PUNCTURE,720,SEPTICEMIA & DISSEMINATED INFECTIONS,18,INFECTIOUS AND PARASITIC DISEASES (SYSTEMIC OR UNSPECIFIED SITES),2,Moderate,Minor,Medical,Medicare,,,,,Y,29234.62,8211.07
New York City,Kings,7002053,001304,NYU Langone Hospital-Brooklyn,70 or Older,112,M,White,Not Span/Hispanic,4,Emergency,Skilled Nursing Home,2020,INF002,SEPTICEMIA,,,720,SEPTICEMIA & DISSEMINATED INFECTIONS,18,INFECTIOUS AND PARASITIC DISEASES (SYSTEMIC OR UNSPECIFIED SITES),3,Major,Major,Medical,Private Health Insurance,Medicaid,,,,Y,62989.39,16259.91
New York City,Kings,7002053,001304,NYU Langone Hospital-Brooklyn,50 to 69,112,M,Other Race,Not Span/Hispanic,1,Emergency,Home or Self Care,2020,INF002,SEPTICEMIA,URN003,URETER AND OTHER URINARY TRACT DILATION,720,SEPTICEMIA & DISSEMINATED INFECTIONS,18,INFECTIOUS AND PARASITIC DISEASES (SYSTEMIC OR UNSPECIFIED SITES),2,Moderate,Moderate,Medical,Medicaid,,,,,Y,65527.72,13096.61
New York City,Kings,7002053,001304,NYU Langone Hospital-Brooklyn,50 to 69,112,M,Other Race,Not Span/Hispanic,6,Emergency,Expired,2020,INF002,SEPTICEMIA,,,720,SEPTICEMIA & DISSEMINATED INFECTIONS,18,INFECTIOUS AND PARASITIC DISEASES (SYSTEMIC OR UNSPECIFIED SITES),4,Extreme,Extreme,Medical,Medicare,Medicaid,,,,Y,119423.17,46435.8
New York City,Kings,7002053,001304,NYU Langone Hospital-Brooklyn,70 or Older,112,F,White,Unknown,7,Emergency,Home w/ Home Health Services,2020,INF002,SEPTICEMIA,HEP010,HEPATOBILIARY AND PANCREATIC DRAINAGE,720,SEPTICEMIA & DISSEMINATED INFECTIONS,18,INFECTIOUS AND PARASITIC DISEASES (SYSTEMIC OR UNSPECIFIED SITES),3,Major,Major,Medical,Medicaid,,,,,Y,116276.81,30552.02
New York City,Kings,7002053,001304,NYU Langone Hospital-Brooklyn,70 or Older,112,M,Other Race,Not Span/Hispanic,3,Emergency,Short-term Hospital,2020,INF002,SEPTICEMIA,ADM015,ADMINISTRATION OF ANTIBIOTICS,720,SEPTICEMIA & DISSEMINATED INFECTIONS,18,INFECTIOUS AND PARASITIC DISEASES (SYSTEMIC OR UNSPECIFIED SITES),4,Extreme,Extreme,Medical,Medicare,Medicaid,,,,Y,112685.69,27697.79
New York City,Kings,7002053,001304,NYU Langone Hospital-Brooklyn,70 or Older,112,F,White,Not Span/Hispanic,15,Emergency,Skilled Nursing Home,2020,INF002,SEPTICEMIA,ADM015,ADMINISTRATION OF ANTIBIOTICS,720,SEPTICEMIA & DISSEMINATED INFECTIONS,18,INFECTIOUS AND PARASITIC DISEASES (SYSTEMIC OR UNSPECIFIED SITES),4,Extreme,Extreme,Medical,Medicare,,,,,Y,184662.5,55754
New York City,Kings,7002053,001304,NYU Langone Hospital-Brooklyn,70 or Older,112,F,Black/African American,Not Span/Hispanic,3,Elective,Home w/ Home Health Services,2020,INF002,SEPTICEMIA,MST020,SUBCUTANEOUS TISSUE AND FASCIA EXCISION,720,SEPTICEMIA & DISSEMINATED INFECTIONS,18,INFECTIOUS AND PARASITIC DISEASES (SYSTEMIC OR UNSPECIFIED SITES),2,Moderate,Moderate,Medical,Private Health Insurance,Medicaid,,,,N,71060.96,14663.32
New York City,Kings,7002053,001304,NYU Langone Hospital-Brooklyn,70 or Older,112,F,Black/African American,Not Span/Hispanic,6,Emergency,Home w/ Home Health Services,2020,INF002,SEPTICEMIA,PLC001,IMMOBILIZATION BY SPLINT OR OTHER EXTERNAL DEVICE,720,SEPTICEMIA & DISSEMINATED INFECTIONS,18,INFECTIOUS AND PARASITIC DISEASES (SYSTEMIC OR UNSPECIFIED SITES),3,Major,Major,Medical,Medicare,Blue Cross/Blue Shield,,,,Y,83623.64,23166.05
New York City,Kings,7002053,001304,NYU Langone Hospital-Brooklyn,50 to 69,112,M,White,Not Span/Hispanic,15,Emergency,Skilled Nursing Home,2020,INF002,SEPTICEMIA,ESA004,NON-INVASIVE VENTILATION,720,SEPTICEMIA & DISSEMINATED INFECTIONS,18,INFECTIOUS AND PARASITIC DISEASES (SYSTEMIC OR UNSPECIFIED SITES),4,Extreme,Extreme,Medical,Medicare,Private Health Insurance,,,,Y,242642.08,74239.1
New York City,Kings,7002053,001304,NYU Langone Hospital-Brooklyn,70 or Older,112,F,White,Not Span/Hispanic,7,Emergency,Home w/ Home Health Services,2020,INF002,SEPTICEMIA,HEP010,HEPATOBILIARY AND PANCREATIC DRAINAGE,720,SEPTICEMIA & DISSEMINATED INFECTIONS,18,INFECTIOUS AND PARASITIC DISEASES (SYSTEMIC OR UNSPECIFIED SITES),4,Extreme,Extreme,Medical,Medicare,,,,,Y,124638.89,37109.02
New York City,Kings,7002053,001304,NYU Langone Hospital-Brooklyn,30 to 49,112,F,Black/African American,Not Span/Hispanic,10,Emergency,Short-term Hospital,2020,INF002,SEPTICEMIA,OTR004,ISOLATION PROCEDURES,720,SEPTICEMIA & DISSEMINATED INFECTIONS,18,INFECTIOUS AND PARASITIC DISEASES (SYSTEMIC OR UNSPECIFIED SITES),3,Major,Major,Medical,Medicare,Medicaid,,,,Y,145252.65,36987.87
New York City,Kings,7002053,001304,NYU Langone Hospital-Brooklyn,30 to 49,112,M,White,Not Span/Hispanic,2,Emergency,Home w/ Home Health Services,2020,INF002,SEPTICEMIA,,,720,SEPTICEMIA & DISSEMINATED INFECTIONS,18,INFECTIOUS AND PARASITIC DISEASES (SYSTEMIC OR UNSPECIFIED SITES),1,Minor,Minor,Medical,Private Health Insurance,,,,,Y,24975.11,7586.24
New York City,Kings,7002053,001304,NYU Langone Hospital-Brooklyn,70 or Older,112,M,Other Race,Not Span/Hispanic,21,Emergency,Hospice - Medical Facility,2020,INF002,SEPTICEMIA,ADM015,ADMINISTRATION OF ANTIBIOTICS,720,SEPTICEMIA & DISSEMINATED INFECTIONS,18,INFECTIOUS AND PARASITIC DISEASES (SYSTEMIC OR UNSPECIFIED SITES),4,Extreme,Extreme,Medical,Medicare,Medicaid,,,,Y,355865.71,100384.58
New York City,Kings,7002053,001304,NYU Langone Hospital-Brooklyn,70 or Older,112,M,White,Not Span/Hispanic,8,Emergency,Hospice - Medical Facility,2020,INF002,SEPTICEMIA,,,720,SEPTICEMIA & DISSEMINATED INFECTIONS,18,INFECTIOUS AND PARASITIC DISEASES (SYSTEMIC OR UNSPECIFIED SITES),4,Extreme,Extreme,Medical,Medicare,Private Health Insurance,,,,Y,131034.92,43322.19
New York City,Kings,7002053,001304,NYU Langone Hospital-Brooklyn,50 to 69,112,F,Black/African American,Not Span/Hispanic,4,Emergency,Home or Self Care,2020,INF002,SEPTICEMIA,OTR004,ISOLATION PROCEDURES,720,SEPTICEMIA & DISSEMINATED INFECTIONS,18,INFECTIOUS AND PARASITIC DISEASES (SYSTEMIC OR UNSPECIFIED SITES),3,Major,Moderate,Medical,Private Health Insurance,,,,,Y,40972.09,13754.25
New York City,Kings,7002053,001304,NYU Langone Hospital-Brooklyn,50 to 69,112,M,Black/African American,Not Span/Hispanic,8,Emergency,Home w/ Home Health Services,2020,INF002,SEPTICEMIA,,,720,SEPTICEMIA & DISSEMINATED INFECTIONS,18,INFECTIOUS AND PARASITIC DISEASES (SYSTEMIC OR UNSPECIFIED SITES),2,Moderate,Major,Medical,Medicare,Medicaid,,,,Y,93337.14,27316.33
New York City,Kings,7002053,001304,NYU Langone Hospital-Brooklyn,18 to 29,,F,White,Unknown,20,Emergency,Skilled Nursing Home,2020,INF002,SEPTICEMIA,ADM021,"ADMINISTRATION OF THERAPEUTIC SUBSTANCES, NEC",720,SEPTICEMIA & DISSEMINATED INFECTIONS,18,INFECTIOUS AND PARASITIC DISEASES (SYSTEMIC OR UNSPECIFIED SITES),4,Extreme,Extreme,Medical,Medicaid,,,,,Y,181884.36,65956.64
New York City,Kings,7002053,001304,NYU Langone Hospital-Brooklyn,70 or Older,112,F,White,Not Span/Hispanic,7,Emergency,Home or Self Care,2020,INF002,SEPTICEMIA,ESA004,NON-INVASIVE VENTILATION,720,SEPTICEMIA & DISSEMINATED INFECTIONS,18,INFECTIOUS AND PARASITIC DISEASES (SYSTEMIC OR UNSPECIFIED SITES),4,Extreme,Extreme,Medical,Medicare,Medicare,,,,Y,108694.51,34134.06
New York City,Kings,7002053,001304,NYU Langone Hospital-Brooklyn,50 to 69,112,M,White,Not Span/Hispanic,3,Emergency,Home w/ Home Health Services,2020,INF002,SEPTICEMIA,HEP010,HEPATOBILIARY AND PANCREATIC DRAINAGE,720,SEPTICEMIA & DISSEMINATED INFECTIONS,18,INFECTIOUS AND PARASITIC DISEASES (SYSTEMIC OR UNSPECIFIED SITES),3,Major,Major,Medical,Medicare,Private Health Insurance,,,,Y,105671.4,23719.7
New York City,Kings,7002053,001304,NYU Langone Hospital-Brooklyn,50 to 69,112,F,White,Not Span/Hispanic,2,Emergency,Home or Self Care,2020,INF002,SEPTICEMIA,,,720,SEPTICEMIA & DISSEMINATED INFECTIONS,18,INFECTIOUS AND PARASITIC DISEASES (SYSTEMIC OR UNSPECIFIED SITES),2,Moderate,Minor,Medical,Medicare,Medicaid,,,,Y,63793.21,17150.01
New York City,Kings,7002053,001304,NYU Langone Hospital-Brooklyn,50 to 69,112,M,Other Race,Spanish/Hispanic,2,Emergency,Home or Self Care,2020,INF002,SEPTICEMIA,URN003,URETER AND OTHER URINARY TRACT DILATION,720,SEPTICEMIA & DISSEMINATED INFECTIONS,18,INFECTIOUS AND PARASITIC DISEASES (SYSTEMIC OR UNSPECIFIED SITES),2,Moderate,Moderate,Medical,Blue Cross/Blue Shield,,,,,Y,59855.7,12392.86
New York City,Kings,7002053,001304,NYU Langone Hospital-Brooklyn,70 or Older,112,F,White,Not Span/Hispanic,9,Emergency,Skilled Nursing Home,2020,INF002,SEPTICEMIA,CAR024,VENOUS AND ARTERIAL CATHETER PLACEMENT,720,SEPTICEMIA & DISSEMINATED INFECTIONS,18,INFECTIOUS AND PARASITIC DISEASES (SYSTEMIC OR UNSPECIFIED SITES),4,Extreme,Extreme,Medical,Medicare,,,,,Y,238234.13,50715.74
New York City,Kings,7002053,001304,NYU Langone Hospital-Brooklyn,70 or Older,112,F,Other Race,Spanish/Hispanic,2,Emergency,Home w/ Home Health Services,2020,INF002,SEPTICEMIA,IMG008,ULTRASONOGRAPHY,720,SEPTICEMIA & DISSEMINATED INFECTIONS,18,INFECTIOUS AND PARASITIC DISEASES (SYSTEMIC OR UNSPECIFIED SITES),2,Moderate,Moderate,Medical,Medicare,Medicaid,,,,Y,38683.58,9097.88
New York City,Kings,7002053,001304,NYU Langone Hospital-Brooklyn,50 to 69,112,F,Other Race,Not Span/Hispanic,14,Emergency,Home or Self Care,2020,INF002,SEPTICEMIA,ADM015,ADMINISTRATION OF ANTIBIOTICS,720,SEPTICEMIA & DISSEMINATED INFECTIONS,18,INFECTIOUS AND PARASITIC DISEASES (SYSTEMIC OR UNSPECIFIED SITES),3,Major,Major,Medical,Blue Cross/Blue Shield,,,,,Y,205470.04,55130.61
New York City,Kings,7002053,001304,NYU Langone Hospital-Brooklyn,70 or Older,112,F,Other Race,Spanish/Hispanic,6,Emergency,Home or Self Care,2020,INF002,SEPTICEMIA,,,720,SEPTICEMIA & DISSEMINATED INFECTIONS,18,INFECTIOUS AND PARASITIC DISEASES (SYSTEMIC OR UNSPECIFIED SITES),2,Moderate,Moderate,Medical,Medicare,Medicare,,,,Y,69738.82,20785.86
New York City,Kings,7002053,001304,NYU Langone Hospital-Brooklyn,30 to 49,112,F,Other Race,Not Span/Hispanic,4,Emergency,Home or Self Care,2020,INF002,SEPTICEMIA,ADM015,ADMINISTRATION OF ANTIBIOTICS,720,SEPTICEMIA & DISSEMINATED INFECTIONS,18,INFECTIOUS AND PARASITIC DISEASES (SYSTEMIC OR UNSPECIFIED SITES),2,Moderate,Minor,Medical,Private Health Insurance,,,,,Y,55486.26,15458.91
New York City,Kings,7002053,001304,NYU Langone Hospital-Brooklyn,50 to 69,112,F,Other Race,Spanish/Hispanic,3,Emergency,Home or Self Care,2020,INF002,SEPTICEMIA,ESA001,HEMODIALYSIS,720,SEPTICEMIA & DISSEMINATED INFECTIONS,18,INFECTIOUS AND PARASITIC DISEASES (SYSTEMIC OR UNSPECIFIED SITES),3,Major,Moderate,Medical,Medicaid,,,,,Y,53427.84,12448.69
New York City,Kings,7002053,001304,NYU Langone Hospital-Brooklyn,50 to 69,112,F,White,Spanish/Hispanic,3,Emergency,Home w/ Home Health Services,2020,INF002,SEPTICEMIA,URN005,NEPHROSTOMY AND URETEROSTOMY PROCEDURES (INCLUDING STENTS),720,SEPTICEMIA & DISSEMINATED INFECTIONS,18,INFECTIOUS AND PARASITIC DISEASES (SYSTEMIC OR UNSPECIFIED SITES),3,Major,Minor,Medical,Medicaid,,,,,Y,67422.64,13140.5
New York City,Kings,7002053,001304,NYU Langone Hospital-Brooklyn,50 to 69,103,F,White,Not Span/Hispanic,5,Emergency,Home w/ Home Health Services,2020,INF002,SEPTICEMIA,,,720,SEPTICEMIA & DISSEMINATED INFECTIONS,18,INFECTIOUS AND PARASITIC DISEASES (SYSTEMIC OR UNSPECIFIED SITES),3,Major,Moderate,Medical,Private Health Insurance,,,,,Y,69621.04,19070.2
New York City,Kings,7002053,001304,NYU Langone Hospital-Brooklyn,70 or Older,112,M,White,Not Span/Hispanic,1,Emergency,Expired,2020,INF002,SEPTICEMIA,OTR004,ISOLATION PROCEDURES,720,SEPTICEMIA & DISSEMINATED INFECTIONS,18,INFECTIOUS AND PARASITIC DISEASES (SYSTEMIC OR UNSPECIFIED SITES),3,Major,Major,Medical,Medicare,Medicaid,,,,Y,44600.25,7572.39
New York City,Kings,7002053,001304,NYU Langone Hospital-Brooklyn,70 or Older,112,F,White,Not Span/Hispanic,5,Emergency,Home w/ Home Health Services,2020,INF002,SEPTICEMIA,ADM015,ADMINISTRATION OF ANTIBIOTICS,720,SEPTICEMIA & DISSEMINATED INFECTIONS,18,INFECTIOUS AND PARASITIC DISEASES (SYSTEMIC OR UNSPECIFIED SITES),3,Major,Extreme,Medical,Medicare,Blue Cross/Blue Shield,,,,Y,105295.15,27983.21
New York City,Kings,7002053,001304,NYU Langone Hospital-Brooklyn,70 or Older,112,F,White,Not Span/Hispanic,25,Emergency,Hospice - Medical Facility,2020,INF002,SEPTICEMIA,ESA003,MECHANICAL VENTILATION,720,SEPTICEMIA & DISSEMINATED INFECTIONS,18,INFECTIOUS AND PARASITIC DISEASES (SYSTEMIC OR UNSPECIFIED SITES),4,Extreme,Extreme,Medical,Medicare,Medicare,,,,Y,440687.69,148859.56
New York City,Kings,7002053,001304,NYU Langone Hospital-Brooklyn,50 to 69,112,F,White,Not Span/Hispanic,6,Emergency,Home w/ Home Health Services,2020,INF002,SEPTICEMIA,,,720,SEPTICEMIA & DISSEMINATED INFECTIONS,18,INFECTIOUS AND PARASITIC DISEASES (SYSTEMIC OR UNSPECIFIED SITES),2,Moderate,Major,Medical,Medicare,Medicaid,,,,Y,112304.8,23354.53
New York City,Kings,7002053,001304,NYU Langone Hospital-Brooklyn,70 or Older,112,F,White,Not Span/Hispanic,3,Emergency,Hospice - Medical Facility,2020,INF002,SEPTICEMIA,,,720,SEPTICEMIA & DISSEMINATED INFECTIONS,18,INFECTIOUS AND PARASITIC DISEASES (SYSTEMIC OR UNSPECIFIED SITES),3,Major,Major,Medical,Medicare,Private Health Insurance,Medicaid,,,Y,65256.16,20520.69
New York City,Kings,7002053,001304,NYU Langone Hospital-Brooklyn,70 or Older,112,F,White,Not Span/Hispanic,3,Emergency,Home or Self Care,2020,INF002,SEPTICEMIA,,,720,SEPTICEMIA & DISSEMINATED INFECTIONS,18,INFECTIOUS AND PARASITIC DISEASES (SYSTEMIC OR UNSPECIFIED SITES),3,Major,Extreme,Medical,Medicare,Medicare,,,,Y,62787.24,20334.65
New York City,Kings,7002053,001304,NYU Langone Hospital-Brooklyn,30 to 49,112,M,White,Not Span/Hispanic,4,Emergency,Left Against Medical Advice,2020,INF002,SEPTICEMIA,CNS002,LUMBAR PUNCTURE,720,SEPTICEMIA & DISSEMINATED INFECTIONS,18,INFECTIOUS AND PARASITIC DISEASES (SYSTEMIC OR UNSPECIFIED SITES),3,Major,Major,Medical,Medicaid,,,,,Y,67094.52,16706.12
New York City,Kings,7002053,001304,NYU Langone Hospital-Brooklyn,70 or Older,112,M,White,Not Span/Hispanic,13,Emergency,Skilled Nursing Home,2020,INF002,SEPTICEMIA,IMG008,ULTRASONOGRAPHY,720,SEPTICEMIA & DISSEMINATED INFECTIONS,18,INFECTIOUS AND PARASITIC DISEASES (SYSTEMIC OR UNSPECIFIED SITES),4,Extreme,Extreme,Medical,Medicare,Blue Cross/Blue Shield,,,,Y,271479.07,67114.89
New York City,Kings,7002053,001304,NYU Langone Hospital-Brooklyn,70 or Older,112,F,White,Not Span/Hispanic,8,Emergency,Home w/ Home Health Services,2020,INF002,SEPTICEMIA,IMG008,ULTRASONOGRAPHY,720,SEPTICEMIA & DISSEMINATED INFECTIONS,18,INFECTIOUS AND PARASITIC DISEASES (SYSTEMIC OR UNSPECIFIED SITES),4,Extreme,Extreme,Medical,Medicare,Medicaid,,,,Y,131345.57,46551.28
New York City,Kings,7002053,001304,NYU Langone Hospital-Brooklyn,70 or Older,112,F,White,Not Span/Hispanic,6,Emergency,Skilled Nursing Home,2020,INF002,SEPTICEMIA,,,720,SEPTICEMIA & DISSEMINATED INFECTIONS,18,INFECTIOUS AND PARASITIC DISEASES (SYSTEMIC OR UNSPECIFIED SITES),3,Major,Extreme,Medical,Medicare,Blue Cross/Blue Shield,,,,Y,90430.5,26316.04
New York City,Kings,7002053,001304,NYU Langone Hospital-Brooklyn,70 or Older,112,F,White,Not Span/Hispanic,7,Emergency,Skilled Nursing Home,2020,INF002,SEPTICEMIA,HEP003,DIAGNOSTIC ERCP WITH OR WITHOUT BIOPSY,720,SEPTICEMIA & DISSEMINATED INFECTIONS,18,INFECTIOUS AND PARASITIC DISEASES (SYSTEMIC OR UNSPECIFIED SITES),3,Major,Extreme,Medical,Medicare,Medicaid,,,,Y,147654.24,39765.32
New York City,Kings,7002053,001304,NYU Langone Hospital-Brooklyn,70 or Older,112,F,Other Race,Not Span/Hispanic,4,Emergency,Home w/ Home Health Services,2020,INF002,SEPTICEMIA,,,720,SEPTICEMIA & DISSEMINATED INFECTIONS,18,INFECTIOUS AND PARASITIC DISEASES (SYSTEMIC OR UNSPECIFIED SITES),3,Major,Major,Medical,Medicare,Medicaid,,,,Y,53018.97,14637.84
New York City,Kings,7002053,001304,NYU Langone Hospital-Brooklyn,70 or Older,112,F,Other Race,Spanish/Hispanic,4,Emergency,Home or Self Care,2020,INF002,SEPTICEMIA,OTR004,ISOLATION PROCEDURES,720,SEPTICEMIA & DISSEMINATED INFECTIONS,18,INFECTIOUS AND PARASITIC DISEASES (SYSTEMIC OR UNSPECIFIED SITES),3,Major,Major,Medical,Medicaid,,,,,Y,48463.06,14577.64
New York City,Kings,7002053,001304,NYU Langone Hospital-Brooklyn,50 to 69,112,F,Other Race,Not Span/Hispanic,6,Emergency,Home w/ Home Health Services,2020,INF002,SEPTICEMIA,IMG008,ULTRASONOGRAPHY,720,SEPTICEMIA & DISSEMINATED INFECTIONS,18,INFECTIOUS AND PARASITIC DISEASES (SYSTEMIC OR UNSPECIFIED SITES),3,Major,Extreme,Medical,Medicare,Medicaid,,,,Y,100252.54,28576.31
New York City,Kings,7002053,001304,NYU Langone Hospital-Brooklyn,30 to 49,112,M,Black/African American,Not Span/Hispanic,1,Emergency,Home or Self Care,2020,INF002,SEPTICEMIA,OTR004,ISOLATION PROCEDURES,720,SEPTICEMIA & DISSEMINATED INFECTIONS,18,INFECTIOUS AND PARASITIC DISEASES (SYSTEMIC OR UNSPECIFIED SITES),2,Moderate,Minor,Medical,Blue Cross/Blue Shield,,,,,Y,21037.73,4781.16
New York City,Kings,7002053,001304,NYU Langone Hospital-Brooklyn,50 to 69,112,F,Other Race,Spanish/Hispanic,8,Emergency,Home or Self Care,2020,INF002,SEPTICEMIA,ADM015,ADMINISTRATION OF ANTIBIOTICS,720,SEPTICEMIA & DISSEMINATED INFECTIONS,18,INFECTIOUS AND PARASITIC DISEASES (SYSTEMIC OR UNSPECIFIED SITES),2,Moderate,Moderate,Medical,Medicaid,,,,,Y,83741.83,27431.68
New York City,Kings,7002053,001304,NYU Langone Hospital-Brooklyn,70 or Older,112,F,White,Not Span/Hispanic,4,Emergency,Skilled Nursing Home,2020,INF002,SEPTICEMIA,,,720,SEPTICEMIA & DISSEMINATED INFECTIONS,18,INFECTIOUS AND PARASITIC DISEASES (SYSTEMIC OR UNSPECIFIED SITES),2,Moderate,Major,Medical,Medicare,Medicare,,,,Y,41661.08,14289.22
New York City,Kings,7002053,001304,NYU Langone Hospital-Brooklyn,70 or Older,112,F,Other Race,Not Span/Hispanic,3,Emergency,Skilled Nursing Home,2020,INF002,SEPTICEMIA,ESA003,MECHANICAL VENTILATION,720,SEPTICEMIA & DISSEMINATED INFECTIONS,18,INFECTIOUS AND PARASITIC DISEASES (SYSTEMIC OR UNSPECIFIED SITES),4,Extreme,Extreme,Medical,Medicare,Private Health Insurance,Medicaid,,,Y,81837.18,25305.97
New York City,Kings,7002053,001304,NYU Langone Hospital-Brooklyn,18 to 29,103,M,White,Not Span/Hispanic,3,Emergency,Home or Self Care,2020,INF002,SEPTICEMIA,,,720,SEPTICEMIA & DISSEMINATED INFECTIONS,18,INFECTIOUS AND PARASITIC DISEASES (SYSTEMIC OR UNSPECIFIED SITES),2,Moderate,Moderate,Medical,Private Health Insurance,,,,,Y,63296.47,13856.66
New York City,Kings,7002053,001304,NYU Langone Hospital-Brooklyn,50 to 69,112,F,Other Race,Not Span/Hispanic,3,Emergency,Home or Self Care,2020,INF002,SEPTICEMIA,HEP007,BILIARY AND PANCREATIC CALCULUS REMOVAL,720,SEPTICEMIA & DISSEMINATED INFECTIONS,18,INFECTIOUS AND PARASITIC DISEASES (SYSTEMIC OR UNSPECIFIED SITES),2,Moderate,Moderate,Medical,Private Health Insurance,,,,,Y,84322.2,16918.3