Hospital Service Area,Hospital County,Operating Certificate Number,Permanent Facility Id,Facility Name,Age Group,Zip Code - 3 digits,Gender,Race,Ethnicity,Length of Stay,Type of Admission,Patient Disposition,Discharge Year,CCS Diagnosis Code,CCS Diagnosis Description,CCS Procedure Code,CCS Procedure Description,APR DRG Code,APR DRG Description,APR MDC Code,APR MDC Description,APR Severity of Illness Code,APR Severity of Illness Description,APR Risk of Mortality,APR Medical Surgical Description,Payment Typology 1,Payment Typology 2,Payment Typology 3,Birth Weight,Abortion Edit Indicator,Emergency Department Indicator,Total Charges,Total Costs
Hudson Valley,Westchester,5903001,001061,Montefiore Mount Vernon Hospital,50 to 69,105,F,White,Not Span/Hispanic,4,Emergency,Skilled Nursing Home,2017,238,Complications of surgical procedures or medical care,222,BLOOD TRANSFUSION,721,"Post-operative, post-traumatic, other device infections",18,"Infectious and Parasitic Diseases, Systemic or Unspecified Sites",2,Moderate,Moderate,Medical,Medicaid,Medicaid,Self-Pay,,N,N,36031.09,16118.84
New York City,Manhattan,7002024,001456,Mount Sinai Hospital,50 to 69,100,M,Black/African American,Not Span/Hispanic,6,Emergency,Home w/ Home Health Services,2017,238,Complications of surgical procedures or medical care,000,NO PROC,721,"Post-operative, post-traumatic, other device infections",18,"Infectious and Parasitic Diseases, Systemic or Unspecified Sites",3,Major,Major,Medical,Medicare,Medicaid,Self-Pay,,N,Y,44888.07,15532.57
New York City,Bronx,7000006,001169,Montefiore Medical Center - Henry & Lucy Moses Div,50 to 69,104,M,Black/African American,Not Span/Hispanic,10,Emergency,Home w/ Home Health Services,2017,238,Complications of surgical procedures or medical care,231,OTHER THERAPEUTIC PRCS,721,"Post-operative, post-traumatic, other device infections",18,"Infectious and Parasitic Diseases, Systemic or Unspecified Sites",3,Major,Moderate,Medical,Medicare,Medicaid,,,N,Y,89229.39,18499.64
New York City,Bronx,7000006,001169,Montefiore Medical Center - Henry & Lucy Moses Div,70 or Older,104,M,Other Race,Spanish/Hispanic,10,Emergency,Skilled Nursing Home,2017,238,Complications of surgical procedures or medical care,231,OTHER THERAPEUTIC PRCS,721,"Post-operative, post-traumatic, other device infections",18,"Infectious and Parasitic Diseases, Systemic or Unspecified Sites",3,Major,Major,Medical,Medicare,Medicaid,,,N,Y,129232.47,22003.37
New York City,Bronx,7000006,001169,Montefiore Medical Center - Henry & Lucy Moses Div,50 to 69,104,F,White,Not Span/Hispanic,4,Emergency,Home or Self Care,2017,238,Complications of surgical procedures or medical care,088,ABDOMINAL PARACENTESIS,721,"Post-operative, post-traumatic, other device infections",18,"Infectious and Parasitic Diseases, Systemic or Unspecified Sites",3,Major,Moderate,Medical,Medicare,,,,N,Y,87584.75,18830.23
New York City,Bronx,7000006,001169,Montefiore Medical Center - Henry & Lucy Moses Div,70 or Older,104,M,Other Race,Spanish/Hispanic,3,Emergency,Home w/ Home Health Services,2017,238,Complications of surgical procedures or medical care,000,NO PROC,721,"Post-operative, post-traumatic, other device infections",18,"Infectious and Parasitic Diseases, Systemic or Unspecified Sites",3,Major,Major,Medical,Medicare,,,,N,Y,34789.43,7205.03
New York City,Bronx,7000006,001169,Montefiore Medical Center - Henry & Lucy Moses Div,50 to 69,104,M,Other Race,Spanish/Hispanic,1,Emergency,Home w/ Home Health Services,2017,238,Complications of surgical procedures or medical care,000,NO PROC,721,"Post-operative, post-traumatic, other device infections",18,"Infectious and Parasitic Diseases, Systemic or Unspecified Sites",2,Moderate,Minor,Medical,Medicaid,,,,N,Y,15475.70,2796.08
New York City,Bronx,7000006,003058,Montefiore Med Center - Jack D Weiler Hosp of A Einstein College Div,50 to 69,104,M,Other Race,Not Span/Hispanic,12,Emergency,Home w/ Home Health Services,2017,238,Complications of surgical procedures or medical care,054,OT VASC CATH; NOT HEART,721,"Post-operative, post-traumatic, other device infections",18,"Infectious and Parasitic Diseases, Systemic or Unspecified Sites",3,Major,Major,Medical,Medicaid,,,,N,Y,182166.95,54082.69
New York City,Manhattan,7002002,001439,Mount Sinai Beth Israel,30 to 49,113,F,Other Race,Not Span/Hispanic,5,Emergency,Home w/ Home Health Services,2017,238,Complications of surgical procedures or medical care,231,OTHER THERAPEUTIC PRCS,721,"Post-operative, post-traumatic, other device infections",18,"Infectious and Parasitic Diseases, Systemic or Unspecified Sites",2,Moderate,Minor,Medical,Medicaid,Medicaid,Self-Pay,,N,Y,46953.40,13913.50
New York City,Manhattan,7002002,001439,Mount Sinai Beth Israel,30 to 49,112,M,Black/African American,Spanish/Hispanic,3,Emergency,Home w/ Home Health Services,2017,238,Complications of surgical procedures or medical care,088,ABDOMINAL PARACENTESIS,721,"Post-operative, post-traumatic, other device infections",18,"Infectious and Parasitic Diseases, Systemic or Unspecified Sites",2,Moderate,Minor,Medical,Medicaid,Medicaid,Self-Pay,,N,Y,31352.60,9312.29
New York City,Manhattan,7002024,001456,Mount Sinai Hospital,50 to 69,112,F,Other Race,Not Span/Hispanic,8,Urgent,Home w/ Home Health Services,2017,238,Complications of surgical procedures or medical care,222,BLOOD TRANSFUSION,721,"Post-operative, post-traumatic, other device infections",18,"Infectious and Parasitic Diseases, Systemic or Unspecified Sites",4,Extreme,Major,Medical,Medicaid,Medicaid,Self-Pay,,N,N,62346.26,20547.44
Hudson Valley,Orange,3523000,000699,Orange Regional Medical Center,70 or Older,109,F,White,Not Span/Hispanic,3,Emergency,Home or Self Care,2017,238,Complications of surgical procedures or medical care,000,NO PROC,721,"Post-operative, post-traumatic, other device infections",18,"Infectious and Parasitic Diseases, Systemic or Unspecified Sites",3,Major,Moderate,Medical,Medicare,Blue Cross/Blue Shield,,,N,Y,19875.48,4898.97
Hudson Valley,Orange,3523000,000699,Orange Regional Medical Center,50 to 69,125,F,White,Not Span/Hispanic,4,Elective,Home w/ Home Health Services,2017,238,Complications of surgical procedures or medical care,175,OT OR THER PRC SKN/BRST,721,"Post-operative, post-traumatic, other device infections",18,"Infectious and Parasitic Diseases, Systemic or Unspecified Sites",1,Minor,Minor,Medical,Medicare,Private Health Insurance,,,N,N,35224.52,10531.10
Hudson Valley,Rockland,4329000,000779,Good Samaritan Hospital of Suffern,50 to 69,109,F,Black/African American,Not Span/Hispanic,9,Emergency,Skilled Nursing Home,2017,238,Complications of surgical procedures or medical care,058,HEMODIALYSIS,721,"Post-operative, post-traumatic, other device infections",18,"Infectious and Parasitic Diseases, Systemic or Unspecified Sites",3,Major,Major,Medical,Medicare,Medicaid,,,N,Y,105101.26,21865.42
Hudson Valley,Rockland,4329000,000779,Good Samaritan Hospital of Suffern,70 or Older,109,F,Black/African American,Not Span/Hispanic,4,Emergency,Skilled Nursing Home,2017,238,Complications of surgical procedures or medical care,058,HEMODIALYSIS,721,"Post-operative, post-traumatic, other device infections",18,"Infectious and Parasitic Diseases, Systemic or Unspecified Sites",3,Major,Major,Medical,Medicare,Blue Cross/Blue Shield,Medicaid,,N,Y,79246.73,16165.51
New York City,Bronx,7000006,003058,Montefiore Med Center - Jack D Weiler Hosp of A Einstein College Div,18 to 29,104,F,Other Race,Not Span/Hispanic,4,Emergency,Home or Self Care,2017,238,Complications of surgical procedures or medical care,231,OTHER THERAPEUTIC PRCS,721,"Post-operative, post-traumatic, other device infections",18,"Infectious and Parasitic Diseases, Systemic or Unspecified Sites",2,Moderate,Moderate,Medical,Private Health Insurance,,,,N,Y,47417.23,8334.14
New York City,Kings,7002002,001324,Mount Sinai Brooklyn,50 to 69,112,F,Black/African American,Not Span/Hispanic,5,Emergency,Home or Self Care,2017,238,Complications of surgical procedures or medical care,168,"INCIS/DRAIN, SKIN/SUBCU",721,"Post-operative, post-traumatic, other device infections",18,"Infectious and Parasitic Diseases, Systemic or Unspecified Sites",2,Moderate,Moderate,Medical,Blue Cross/Blue Shield,Self-Pay,,,N,N,43280.00,7630.35
New York City,Manhattan,7002024,001456,Mount Sinai Hospital,50 to 69,100,F,White,Not Span/Hispanic,4,Emergency,Home w/ Home Health Services,2017,238,Complications of surgical procedures or medical care,223,ENTERAL/PARENTERAL NUTR,721,"Post-operative, post-traumatic, other device infections",18,"Infectious and Parasitic Diseases, Systemic or Unspecified Sites",3,Major,Major,Medical,Blue Cross/Blue Shield,Self-Pay,,,N,Y,42328.07,14134.78
New York City,Manhattan,7002024,001456,Mount Sinai Hospital,30 to 49,104,F,Other Race,Not Span/Hispanic,8,Emergency,Home w/ Home Health Services,2017,238,Complications of surgical procedures or medical care,088,ABDOMINAL PARACENTESIS,721,"Post-operative, post-traumatic, other device infections",18,"Infectious and Parasitic Diseases, Systemic or Unspecified Sites",2,Moderate,Major,Medical,Blue Cross/Blue Shield,Self-Pay,,,N,Y,72984.61,24317.47
Hudson Valley,Westchester,5904001,001072,Montefiore New Rochelle Hospital,50 to 69,108,M,White,Unknown,2,Emergency,Short-term Hospital,2017,237,Complication of device; implant or graft,000,NO PROC,721,"Post-operative, post-traumatic, other device infections",18,"Infectious and Parasitic Diseases, Systemic or Unspecified Sites",4,Extreme,Major,Medical,Medicaid,Medicaid,Self-Pay,,N,N,22720.00,9563.32
New York City,Bronx,7000006,001169,Montefiore Medical Center - Henry & Lucy Moses Div,30 to 49,104,F,Other Race,Spanish/Hispanic,7,Emergency,Home w/ Home Health Services,2017,238,Complications of surgical procedures or medical care,221,NASOGASTRIC TUBE,721,"Post-operative, post-traumatic, other device infections",18,"Infectious and Parasitic Diseases, Systemic or Unspecified Sites",2,Moderate,Moderate,Medical,Medicaid,,,,N,N,82627.63,16988.15
New York City,Bronx,7000006,003058,Montefiore Med Center - Jack D Weiler Hosp of A Einstein College Div,18 to 29,104,F,Other Race,Not Span/Hispanic,8,Emergency,Home w/ Home Health Services,2017,238,Complications of surgical procedures or medical care,054,OT VASC CATH; NOT HEART,721,"Post-operative, post-traumatic, other device infections",18,"Infectious and Parasitic Diseases, Systemic or Unspecified Sites",2,Moderate,Minor,Medical,Medicaid,,,,N,Y,109851.17,31630.62
New York City,Kings,7001003,001288,Brooklyn Hospital Center - Downtown Campus,70 or Older,112,F,Black/African American,Unknown,5,Emergency,Home w/ Home Health Services,2017,238,Complications of surgical procedures or medical care,000,NO PROC,721,"Post-operative, post-traumatic, other device infections",18,"Infectious and Parasitic Diseases, Systemic or Unspecified Sites",2,Moderate,Major,Medical,Medicare,Medicare,Self-Pay,,N,Y,36690.04,6608.45
New York City,Kings,7001003,001288,Brooklyn Hospital Center - Downtown Campus,18 to 29,OOS,M,Black/African American,Unknown,3,Emergency,Home or Self Care,2017,238,Complications of surgical procedures or medical care,231,OTHER THERAPEUTIC PRCS,721,"Post-operative, post-traumatic, other device infections",18,"Infectious and Parasitic Diseases, Systemic or Unspecified Sites",1,Minor,Minor,Medical,Medicare,Self-Pay,,,N,Y,18918.94,3784.24
New York City,Kings,7001003,001288,Brooklyn Hospital Center - Downtown Campus,70 or Older,112,F,Black/African American,Not Span/Hispanic,6,Emergency,Skilled Nursing Home,2017,238,Complications of surgical procedures or medical care,088,ABDOMINAL PARACENTESIS,721,"Post-operative, post-traumatic, other device infections",18,"Infectious and Parasitic Diseases, Systemic or Unspecified Sites",3,Major,Major,Medical,Medicare,Medicare,Medicaid,,N,Y,93817.68,15384.83
New York City,Kings,7001037,001320,University Hospital of Brooklyn,70 or Older,112,F,White,Not Span/Hispanic,1,Emergency,Short-term Hospital,2017,238,Complications of surgical procedures or medical care,178,CT SCAN CHEST,721,"Post-operative, post-traumatic, other device infections",18,"Infectious and Parasitic Diseases, Systemic or Unspecified Sites",2,Moderate,Moderate,Medical,Medicare,Medicare,Self-Pay,,N,Y,11528.00,6487.17
New York City,Manhattan,7002024,001456,Mount Sinai Hospital,70 or Older,100,F,Other Race,Not Span/Hispanic,12,Emergency,Home w/ Home Health Services,2017,238,Complications of surgical procedures or medical care,000,NO PROC,721,"Post-operative, post-traumatic, other device infections",18,"Infectious and Parasitic Diseases, Systemic or Unspecified Sites",4,Extreme,Extreme,Medical,Medicare,Private Health Insurance,Self-Pay,,N,Y,99517.68,29147.26
New York City,Manhattan,7002024,001456,Mount Sinai Hospital,30 to 49,112,F,Black/African American,Not Span/Hispanic,4,Emergency,Home or Self Care,2017,238,Complications of surgical procedures or medical care,088,ABDOMINAL PARACENTESIS,721,"Post-operative, post-traumatic, other device infections",18,"Infectious and Parasitic Diseases, Systemic or Unspecified Sites",3,Major,Moderate,Medical,Blue Cross/Blue Shield,Self-Pay,,,N,Y,51460.87,18732.24
New York City,Manhattan,7002024,001456,Mount Sinai Hospital,30 to 49,100,F,Black/African American,Not Span/Hispanic,4,Emergency,Home w/ Home Health Services,2017,238,Complications of surgical procedures or medical care,000,NO PROC,721,"Post-operative, post-traumatic, other device infections",18,"Infectious and Parasitic Diseases, Systemic or Unspecified Sites",2,Moderate,Minor,Medical,Medicaid,Medicaid,Self-Pay,,N,Y,28435.53,9822.08
New York City,Manhattan,7002024,001456,Mount Sinai Hospital,18 to 29,OOS,F,White,Not Span/Hispanic,7,Emergency,Home w/ Home Health Services,2017,238,Complications of surgical procedures or medical care,000,NO PROC,721,"Post-operative, post-traumatic, other device infections",18,"Infectious and Parasitic Diseases, Systemic or Unspecified Sites",3,Major,Moderate,Medical,Blue Cross/Blue Shield,Self-Pay,,,N,Y,57147.01,18791.76
New York City,Kings,7001008,001293,"New York Community Hospital of Brooklyn, Inc",30 to 49,112,F,White,Not Span/Hispanic,4,Emergency,Home or Self Care,2017,238,Complications of surgical procedures or medical care,173,OT DX PRC SKIN/SUBCUTAN,721,"Post-operative, post-traumatic, other device infections",18,"Infectious and Parasitic Diseases, Systemic or Unspecified Sites",2,Moderate,Minor,Medical,Private Health Insurance,Self-Pay,,,N,Y,14622.37,10961.30
New York City,Kings,7001021,001306,New York - Presbyterian Brooklyn Methodist Hospital,70 or Older,114,F,White,Not Span/Hispanic,13,Elective,Skilled Nursing Home,2017,238,Complications of surgical procedures or medical care,054,OT VASC CATH; NOT HEART,721,"Post-operative, post-traumatic, other device infections",18,"Infectious and Parasitic Diseases, Systemic or Unspecified Sites",3,Major,Major,Medical,Medicare,Medicare,Medicaid,,N,N,78781.61,25921.91
New York City,Kings,7001021,001306,New York - Presbyterian Brooklyn Methodist Hospital,70 or Older,117,F,Other Race,Not Span/Hispanic,6,Emergency,Home w/ Home Health Services,2017,238,Complications of surgical procedures or medical care,054,OT VASC CATH; NOT HEART,721,"Post-operative, post-traumatic, other device infections",18,"Infectious and Parasitic Diseases, Systemic or Unspecified Sites",2,Moderate,Minor,Medical,Medicare,Self-Pay,,,N,N,33907.23,11107.84
New York City,Kings,7001021,001306,New York - Presbyterian Brooklyn Methodist Hospital,30 to 49,112,F,Black/African American,Not Span/Hispanic,6,Emergency,Home or Self Care,2017,238,Complications of surgical procedures or medical care,222,BLOOD TRANSFUSION,721,"Post-operative, post-traumatic, other device infections",18,"Infectious and Parasitic Diseases, Systemic or Unspecified Sites",3,Major,Moderate,Medical,Medicare,Medicaid,Medicaid,,N,Y,44779.85,16064.02
New York City,Kings,7001021,001306,New York - Presbyterian Brooklyn Methodist Hospital,70 or Older,112,M,Black/African American,Not Span/Hispanic,7,Emergency,Skilled Nursing Home,2017,238,Complications of surgical procedures or medical care,000,NO PROC,721,"Post-operative, post-traumatic, other device infections",18,"Infectious and Parasitic Diseases, Systemic or Unspecified Sites",3,Major,Moderate,Medical,Medicare,Private Health Insurance,Self-Pay,,N,Y,40883.63,12406.62
New York City,Kings,7001021,001306,New York - Presbyterian Brooklyn Methodist Hospital,30 to 49,112,M,White,Spanish/Hispanic,4,Emergency,Home or Self Care,2017,238,Complications of surgical procedures or medical care,223,ENTERAL/PARENTERAL NUTR,721,"Post-operative, post-traumatic, other device infections",18,"Infectious and Parasitic Diseases, Systemic or Unspecified Sites",3,Major,Minor,Medical,Medicare,Medicaid,Self-Pay,,N,Y,27107.78,8856.57
New York City,Manhattan,7002002,001439,Mount Sinai Beth Israel,30 to 49,OOS,F,Other Race,Not Span/Hispanic,3,Urgent,Home w/ Home Health Services,2017,238,Complications of surgical procedures or medical care,168,"INCIS/DRAIN, SKIN/SUBCU",721,"Post-operative, post-traumatic, other device infections",18,"Infectious and Parasitic Diseases, Systemic or Unspecified Sites",2,Moderate,Minor,Medical,Private Health Insurance,Self-Pay,,,N,N,29521.21,9398.58
New York City,Manhattan,7002024,001456,Mount Sinai Hospital,0 to 17,114,F,Other Race,Not Span/Hispanic,11,Urgent,Home w/ Home Health Services,2017,238,Complications of surgical procedures or medical care,223,ENTERAL/PARENTERAL NUTR,721,"Post-operative, post-traumatic, other device infections",18,"Infectious and Parasitic Diseases, Systemic or Unspecified Sites",3,Major,Minor,Medical,Medicaid,Medicaid,Self-Pay,,N,N,76410.20,60136.21
New York City,Manhattan,7002024,001456,Mount Sinai Hospital,50 to 69,100,M,Black/African American,Not Span/Hispanic,5,Emergency,Home or Self Care,2017,238,Complications of surgical procedures or medical care,058,HEMODIALYSIS,721,"Post-operative, post-traumatic, other device infections",18,"Infectious and Parasitic Diseases, Systemic or Unspecified Sites",3,Major,Moderate,Medical,Medicare,Self-Pay,,,N,Y,53426.32,17194.69
New York City,Manhattan,7002024,001456,Mount Sinai Hospital,18 to 29,117,M,Black/African American,Not Span/Hispanic,6,Emergency,Home or Self Care,2017,238,Complications of surgical procedures or medical care,223,ENTERAL/PARENTERAL NUTR,721,"Post-operative, post-traumatic, other device infections",18,"Infectious and Parasitic Diseases, Systemic or Unspecified Sites",4,Extreme,Moderate,Medical,Medicaid,Medicaid,Self-Pay,,N,Y,42000.60,14303.47
New York City,Manhattan,7002024,001456,Mount Sinai Hospital,50 to 69,101,M,White,Not Span/Hispanic,5,Emergency,Home or Self Care,2017,238,Complications of surgical procedures or medical care,058,HEMODIALYSIS,721,"Post-operative, post-traumatic, other device infections",18,"Infectious and Parasitic Diseases, Systemic or Unspecified Sites",3,Major,Moderate,Medical,Medicare,Private Health Insurance,Self-Pay,,N,Y,49499.59,15749.24
New York City,Manhattan,7002054,001458,New York Presbyterian Hospital - New York Weill Cornell Center,50 to 69,106,F,Other Race,Not Span/Hispanic,12,Emergency,Home w/ Home Health Services,2017,238,Complications of surgical procedures or medical care,039,INCISION OF PLEURA,721,"Post-operative, post-traumatic, other device infections",18,"Infectious and Parasitic Diseases, Systemic or Unspecified Sites",4,Extreme,Major,Medical,Blue Cross/Blue Shield,Self-Pay,,,N,N,142682.82,39134.85
New York City,Manhattan,7002054,001464,New York Presbyterian Hospital - Columbia Presbyterian Center,70 or Older,109,F,White,Not Span/Hispanic,7,Urgent,Home w/ Home Health Services,2017,238,Complications of surgical procedures or medical care,231,OTHER THERAPEUTIC PRCS,721,"Post-operative, post-traumatic, other device infections",18,"Infectious and Parasitic Diseases, Systemic or Unspecified Sites",2,Moderate,Moderate,Medical,Medicare,Self-Pay,,,N,N,68902.93,17013.55
New York City,Manhattan,7002054,001464,New York Presbyterian Hospital - Columbia Presbyterian Center,50 to 69,OOS,F,White,Not Span/Hispanic,3,Urgent,Home w/ Home Health Services,2017,238,Complications of surgical procedures or medical care,174,OT NON-OR THER PRC SKIN,721,"Post-operative, post-traumatic, other device infections",18,"Infectious and Parasitic Diseases, Systemic or Unspecified Sites",2,Moderate,Minor,Medical,Blue Cross/Blue Shield,Self-Pay,,,N,N,28240.10,6760.61
New York City,Manhattan,7002054,001464,New York Presbyterian Hospital - Columbia Presbyterian Center,50 to 69,117,M,White,Not Span/Hispanic,5,Emergency,Expired,2017,238,Complications of surgical procedures or medical care,041,OT NON-OR THER PRC RESP,721,"Post-operative, post-traumatic, other device infections",18,"Infectious and Parasitic Diseases, Systemic or Unspecified Sites",3,Major,Major,Medical,Medicare,Private Health Insurance,Self-Pay,,N,Y,29022.27,12661.86
New York City,Manhattan,7002054,001464,New York Presbyterian Hospital - Columbia Presbyterian Center,70 or Older,OOS,F,Other Race,Not Span/Hispanic,3,Urgent,Home w/ Home Health Services,2017,238,Complications of surgical procedures or medical care,088,ABDOMINAL PARACENTESIS,721,"Post-operative, post-traumatic, other device infections",18,"Infectious and Parasitic Diseases, Systemic or Unspecified Sites",3,Major,Major,Medical,Medicare,Self-Pay,,,N,N,33368.96,8815.30
New York City,Manhattan,7002054,001464,New York Presbyterian Hospital - Columbia Presbyterian Center,30 to 49,125,F,White,Not Span/Hispanic,4,Urgent,Home w/ Home Health Services,2017,238,Complications of surgical procedures or medical care,088,ABDOMINAL PARACENTESIS,721,"Post-operative, post-traumatic, other device infections",18,"Infectious and Parasitic Diseases, Systemic or Unspecified Sites",2,Moderate,Moderate,Medical,Private Health Insurance,Self-Pay,,,N,N,45925.36,12019.30
New York City,Manhattan,7002054,001464,New York Presbyterian Hospital - Columbia Presbyterian Center,0 to 17,112,M,White,Not Span/Hispanic,11,Emergency,Home or Self Care,2017,238,Complications of surgical procedures or medical care,223,ENTERAL/PARENTERAL NUTR,721,"Post-operative, post-traumatic, other device infections",18,"Infectious and Parasitic Diseases, Systemic or Unspecified Sites",2,Moderate,Minor,Medical,Private Health Insurance,Medicaid,Self-Pay,,N,Y,145347.57,44163.11
New York City,Manhattan,7002054,001464,New York Presbyterian Hospital - Columbia Presbyterian Center,50 to 69,100,F,Multi-racial,Multi-ethnic,7,Emergency,Home w/ Home Health Services,2017,238,Complications of surgical procedures or medical care,175,OT OR THER PRC SKN/BRST,721,"Post-operative, post-traumatic, other device infections",18,"Infectious and Parasitic Diseases, Systemic or Unspecified Sites",2,Moderate,Minor,Medical,Medicaid,Medicaid,Self-Pay,,N,Y,70837.40,18005.84
New York City,Manhattan,7002054,001464,New York Presbyterian Hospital - Columbia Presbyterian Center,50 to 69,100,M,Other Race,Not Span/Hispanic,8,Emergency,Skilled Nursing Home,2017,238,Complications of surgical procedures or medical care,231,OTHER THERAPEUTIC PRCS,721,"Post-operative, post-traumatic, other device infections",18,"Infectious and Parasitic Diseases, Systemic or Unspecified Sites",3,Major,Major,Medical,Medicare,Medicaid,Self-Pay,,N,Y,85316.09,21767.81
New York City,Manhattan,7002054,001464,New York Presbyterian Hospital - Columbia Presbyterian Center,0 to 17,104,F,Black/African American,Not Span/Hispanic,8,Emergency,Home w/ Home Health Services,2017,238,Complications of surgical procedures or medical care,095,OT NON-OR LW GI THER PR,721,"Post-operative, post-traumatic, other device infections",18,"Infectious and Parasitic Diseases, Systemic or Unspecified Sites",3,Major,Moderate,Medical,Medicaid,Medicaid,Self-Pay,,N,Y,93582.63,26735.33