Hospital Service Area,Hospital County,Operating Certificate Number,Permanent Facility Id,Facility Name,Age Group,Zip Code - 3 digits,Gender,Race,Ethnicity,Length of Stay,Type of Admission,Patient Disposition,Discharge Year,CCS Diagnosis Code,CCS Diagnosis Description,CCS Procedure Code,CCS Procedure Description,APR DRG Code,APR DRG Description,APR MDC Code,APR MDC Description,APR Severity of Illness Code,APR Severity of Illness Description,APR Risk of Mortality,APR Medical Surgical Description,Payment Typology 1,Payment Typology 2,Payment Typology 3,Birth Weight,Abortion Edit Indicator,Emergency Department Indicator,Total Charges,Total Costs
New York City,Bronx,7000006,003058,Montefiore Med Center - Jack D Weiler Hosp of A Einstein College Div,30 to 49,104,F,Other Race,Not Span/Hispanic,7,Emergency,Home or Self Care,2020,INJ037,"COMPLICATION OF OTHER SURGICAL OR MEDICAL CARE, INJURY, INITIAL ENCOUNTER",GIS006,PARACENTESIS,721,"POST-OPERATIVE, POST-TRAUMATIC, OTHER DEVICE INFECTIONS",18,INFECTIOUS AND PARASITIC DISEASES (SYSTEMIC OR UNSPECIFIED SITES),2,Moderate,Minor,Medical,Private Health Insurance,,,,,Y,104312.49,18344.17
New York City,Bronx,7000006,001168,Montefiore Medical Center-Wakefield Hospital,50 to 69,105,M,Other Race,Spanish/Hispanic,4,Emergency,Home w/ Home Health Services,2020,INJ037,"COMPLICATION OF OTHER SURGICAL OR MEDICAL CARE, INJURY, INITIAL ENCOUNTER",ADM015,ADMINISTRATION OF ANTIBIOTICS,721,"POST-OPERATIVE, POST-TRAUMATIC, OTHER DEVICE INFECTIONS",18,INFECTIOUS AND PARASITIC DISEASES (SYSTEMIC OR UNSPECIFIED SITES),2,Moderate,Moderate,Medical,Private Health Insurance,,,,,Y,61977.56,11038.25
New York City,Bronx,7000006,001169,Montefiore Medical Center - Henry & Lucy Moses Div,0 to 17,104,M,Other Race,Unknown,15,Emergency,Home w/ Home Health Services,2020,INJ037,"COMPLICATION OF OTHER SURGICAL OR MEDICAL CARE, INJURY, INITIAL ENCOUNTER",ADM015,ADMINISTRATION OF ANTIBIOTICS,721,"POST-OPERATIVE, POST-TRAUMATIC, OTHER DEVICE INFECTIONS",18,INFECTIOUS AND PARASITIC DISEASES (SYSTEMIC OR UNSPECIFIED SITES),4,Extreme,Moderate,Medical,Medicaid,,,,,Y,184310.72,45310.32
New York City,Bronx,7000006,001169,Montefiore Medical Center - Henry & Lucy Moses Div,50 to 69,104,M,Other Race,Not Span/Hispanic,4,Emergency,Home w/ Home Health Services,2020,INJ037,"COMPLICATION OF OTHER SURGICAL OR MEDICAL CARE, INJURY, INITIAL ENCOUNTER",ADM016,ADMINISTRATION OF ANTI-INFLAMMATORY AGENTS,721,"POST-OPERATIVE, POST-TRAUMATIC, OTHER DEVICE INFECTIONS",18,INFECTIOUS AND PARASITIC DISEASES (SYSTEMIC OR UNSPECIFIED SITES),2,Moderate,Moderate,Medical,Medicare,Medicaid,,,,Y,64444.52,8898.06
New York City,Bronx,7000006,001169,Montefiore Medical Center - Henry & Lucy Moses Div,70 or Older,105,F,Black/African American,Not Span/Hispanic,17,Emergency,Expired,2020,INJ037,"COMPLICATION OF OTHER SURGICAL OR MEDICAL CARE, INJURY, INITIAL ENCOUNTER",CAR025,PLACEMENT OF TUNNELED OR IMPLANTABLE PORTION OF A VASCULAR ACCESS DEVICE,721,"POST-OPERATIVE, POST-TRAUMATIC, OTHER DEVICE INFECTIONS",18,INFECTIOUS AND PARASITIC DISEASES (SYSTEMIC OR UNSPECIFIED SITES),4,Extreme,Extreme,Medical,Medicare,Medicaid,,,,Y,288662.7,50869.03
Hudson Valley,Westchester,5903001,001061,Montefiore Mount Vernon Hospital,70 or Older,105,M,White,Not Span/Hispanic,5,Emergency,Short-term Hospital,2020,INJ037,"COMPLICATION OF OTHER SURGICAL OR MEDICAL CARE, INJURY, INITIAL ENCOUNTER",RES007,AIRWAY INTUBATION,721,"POST-OPERATIVE, POST-TRAUMATIC, OTHER DEVICE INFECTIONS",18,INFECTIOUS AND PARASITIC DISEASES (SYSTEMIC OR UNSPECIFIED SITES),4,Extreme,Extreme,Medical,Medicare,Medicare,Self-Pay,,,N,73955.21,24039.28
New York City,Manhattan,7002032,001469,Mount Sinai Morningside,70 or Older,100,F,Other Race,Unknown,6,Emergency,Home or Self Care,2020,INJ037,"COMPLICATION OF OTHER SURGICAL OR MEDICAL CARE, INJURY, INITIAL ENCOUNTER",IMG008,ULTRASONOGRAPHY,721,"POST-OPERATIVE, POST-TRAUMATIC, OTHER DEVICE INFECTIONS",18,INFECTIOUS AND PARASITIC DISEASES (SYSTEMIC OR UNSPECIFIED SITES),3,Major,Major,Medical,Medicare,Medicare,Self-Pay,,,Y,70681.03,17034.04
New York City,Manhattan,7002032,001469,Mount Sinai Morningside,70 or Older,100,F,White,Not Span/Hispanic,2,Emergency,Home w/ Home Health Services,2020,INJ037,"COMPLICATION OF OTHER SURGICAL OR MEDICAL CARE, INJURY, INITIAL ENCOUNTER",ADM015,ADMINISTRATION OF ANTIBIOTICS,721,"POST-OPERATIVE, POST-TRAUMATIC, OTHER DEVICE INFECTIONS",18,INFECTIOUS AND PARASITIC DISEASES (SYSTEMIC OR UNSPECIFIED SITES),2,Moderate,Minor,Medical,Medicare,Medicare,Self-Pay,,,Y,21562.33,4635.88
New York City,Kings,7002002,001324,Mount Sinai Brooklyn,50 to 69,112,M,White,Unknown,9,Emergency,Skilled Nursing Home,2020,INJ037,"COMPLICATION OF OTHER SURGICAL OR MEDICAL CARE, INJURY, INITIAL ENCOUNTER",GIS006,PARACENTESIS,721,"POST-OPERATIVE, POST-TRAUMATIC, OTHER DEVICE INFECTIONS",18,INFECTIOUS AND PARASITIC DISEASES (SYSTEMIC OR UNSPECIFIED SITES),4,Extreme,Major,Medical,Medicare,Medicaid,Self-Pay,,,Y,124048.81,20009.19
New York City,Bronx,7000006,001169,Montefiore Medical Center - Henry & Lucy Moses Div,70 or Older,104,F,Other Race,Unknown,6,Emergency,Home w/ Home Health Services,2020,INJ037,"COMPLICATION OF OTHER SURGICAL OR MEDICAL CARE, INJURY, INITIAL ENCOUNTER",ADM015,ADMINISTRATION OF ANTIBIOTICS,721,"POST-OPERATIVE, POST-TRAUMATIC, OTHER DEVICE INFECTIONS",18,INFECTIOUS AND PARASITIC DISEASES (SYSTEMIC OR UNSPECIFIED SITES),3,Major,Major,Medical,Medicaid,,,,,Y,81954.87,14526.96
New York City,Manhattan,7002032,001466,Mount Sinai West,30 to 49,OOS,F,White,Not Span/Hispanic,1,Emergency,Home or Self Care,2020,INJ037,"COMPLICATION OF OTHER SURGICAL OR MEDICAL CARE, INJURY, INITIAL ENCOUNTER",MST005,INCISION AND DRAINAGE OF SUBCUTANEOUS TISSUE AND FASCIA,721,"POST-OPERATIVE, POST-TRAUMATIC, OTHER DEVICE INFECTIONS",18,INFECTIOUS AND PARASITIC DISEASES (SYSTEMIC OR UNSPECIFIED SITES),2,Moderate,Minor,Medical,Private Health Insurance,Self-Pay,,,,N,12053.65,2718.38
New York City,Manhattan,7002002,001439,Mount Sinai Beth Israel,50 to 69,100,F,Other Race,Spanish/Hispanic,2,Emergency,Home w/ Home Health Services,2020,INJ037,"COMPLICATION OF OTHER SURGICAL OR MEDICAL CARE, INJURY, INITIAL ENCOUNTER",SKB002,INCISION AND DRAINAGE OF SKIN,721,"POST-OPERATIVE, POST-TRAUMATIC, OTHER DEVICE INFECTIONS",18,INFECTIOUS AND PARASITIC DISEASES (SYSTEMIC OR UNSPECIFIED SITES),1,Minor,Minor,Medical,Medicare,Miscellaneous/Other,Medicaid,,,Y,28041.15,6476.13
New York City,Manhattan,7002032,001466,Mount Sinai West,50 to 69,112,F,Other Race,Spanish/Hispanic,6,Emergency,Home or Self Care,2020,INJ037,"COMPLICATION OF OTHER SURGICAL OR MEDICAL CARE, INJURY, INITIAL ENCOUNTER",GIS006,PARACENTESIS,721,"POST-OPERATIVE, POST-TRAUMATIC, OTHER DEVICE INFECTIONS",18,INFECTIOUS AND PARASITIC DISEASES (SYSTEMIC OR UNSPECIFIED SITES),3,Major,Major,Medical,Medicaid,Medicaid,Self-Pay,,,Y,87493.16,19511.07
New York City,Manhattan,7002032,001466,Mount Sinai West,50 to 69,100,F,Other Race,Spanish/Hispanic,2,Emergency,Home or Self Care,2020,INJ037,"COMPLICATION OF OTHER SURGICAL OR MEDICAL CARE, INJURY, INITIAL ENCOUNTER",ADM017,ADMINISTRATION OF NUTRITIONAL AND ELECTROLYTIC SUBSTANCES,721,"POST-OPERATIVE, POST-TRAUMATIC, OTHER DEVICE INFECTIONS",18,INFECTIOUS AND PARASITIC DISEASES (SYSTEMIC OR UNSPECIFIED SITES),3,Major,Major,Medical,Private Health Insurance,Self-Pay,,,,Y,37565.73,9334.47
New York City,Manhattan,7002032,001466,Mount Sinai West,50 to 69,113,F,Other Race,Not Span/Hispanic,2,Emergency,Home w/ Home Health Services,2020,INJ037,"COMPLICATION OF OTHER SURGICAL OR MEDICAL CARE, INJURY, INITIAL ENCOUNTER",ADM015,ADMINISTRATION OF ANTIBIOTICS,721,"POST-OPERATIVE, POST-TRAUMATIC, OTHER DEVICE INFECTIONS",18,INFECTIOUS AND PARASITIC DISEASES (SYSTEMIC OR UNSPECIFIED SITES),2,Moderate,Minor,Medical,Medicaid,Medicaid,Self-Pay,,,Y,24456.66,5490.4
New York City,Manhattan,7002032,001466,Mount Sinai West,50 to 69,100,M,Black/African American,Not Span/Hispanic,19,Urgent,Skilled Nursing Home,2020,INJ037,"COMPLICATION OF OTHER SURGICAL OR MEDICAL CARE, INJURY, INITIAL ENCOUNTER",CAR025,PLACEMENT OF TUNNELED OR IMPLANTABLE PORTION OF A VASCULAR ACCESS DEVICE,721,"POST-OPERATIVE, POST-TRAUMATIC, OTHER DEVICE INFECTIONS",18,INFECTIOUS AND PARASITIC DISEASES (SYSTEMIC OR UNSPECIFIED SITES),3,Major,Major,Medical,Medicaid,Medicaid,Self-Pay,,,N,230097.62,51009.18
New York City,Bronx,7000006,001169,Montefiore Medical Center - Henry & Lucy Moses Div,50 to 69,104,F,Other Race,Spanish/Hispanic,6,Emergency,Home or Self Care,2020,INJ037,"COMPLICATION OF OTHER SURGICAL OR MEDICAL CARE, INJURY, INITIAL ENCOUNTER",HEP008,COMMON BILE DUCT SPHINCTEROTOMY AND STENTING,721,"POST-OPERATIVE, POST-TRAUMATIC, OTHER DEVICE INFECTIONS",18,INFECTIOUS AND PARASITIC DISEASES (SYSTEMIC OR UNSPECIFIED SITES),4,Extreme,Extreme,Medical,Private Health Insurance,,,,,Y,142825.11,29978.88
New York City,Manhattan,7002024,001456,Mount Sinai Hospital,50 to 69,113,F,Other Race,Unknown,9,Emergency,Expired,2020,INJ037,"COMPLICATION OF OTHER SURGICAL OR MEDICAL CARE, INJURY, INITIAL ENCOUNTER",CAR024,VENOUS AND ARTERIAL CATHETER PLACEMENT,721,"POST-OPERATIVE, POST-TRAUMATIC, OTHER DEVICE INFECTIONS",18,INFECTIOUS AND PARASITIC DISEASES (SYSTEMIC OR UNSPECIFIED SITES),4,Extreme,Extreme,Medical,Medicaid,Medicaid,Self-Pay,,,Y,247376.83,60645.55
New York City,Manhattan,7002024,001456,Mount Sinai Hospital,18 to 29,112,M,Other Race,Spanish/Hispanic,11,Emergency,Home w/ Home Health Services,2020,INJ037,"COMPLICATION OF OTHER SURGICAL OR MEDICAL CARE, INJURY, INITIAL ENCOUNTER",ADM017,ADMINISTRATION OF NUTRITIONAL AND ELECTROLYTIC SUBSTANCES,721,"POST-OPERATIVE, POST-TRAUMATIC, OTHER DEVICE INFECTIONS",18,INFECTIOUS AND PARASITIC DISEASES (SYSTEMIC OR UNSPECIFIED SITES),4,Extreme,Major,Medical,"Managed Care, Unspecified",Medicaid,Self-Pay,,,Y,136195.24,35532.58
New York City,Manhattan,7002024,001456,Mount Sinai Hospital,30 to 49,109,M,White,Not Span/Hispanic,3,Urgent,Home or Self Care,2020,INJ037,"COMPLICATION OF OTHER SURGICAL OR MEDICAL CARE, INJURY, INITIAL ENCOUNTER",ADM021,"ADMINISTRATION OF THERAPEUTIC SUBSTANCES, NEC",721,"POST-OPERATIVE, POST-TRAUMATIC, OTHER DEVICE INFECTIONS",18,INFECTIOUS AND PARASITIC DISEASES (SYSTEMIC OR UNSPECIFIED SITES),1,Minor,Minor,Medical,Blue Cross/Blue Shield,Self-Pay,,,,N,31142.43,8492.6
New York City,Bronx,7000006,001169,Montefiore Medical Center - Henry & Lucy Moses Div,30 to 49,104,F,Other Race,Spanish/Hispanic,14,Emergency,Hospice - Home,2020,INJ037,"COMPLICATION OF OTHER SURGICAL OR MEDICAL CARE, INJURY, INITIAL ENCOUNTER",,,721,"POST-OPERATIVE, POST-TRAUMATIC, OTHER DEVICE INFECTIONS",18,INFECTIOUS AND PARASITIC DISEASES (SYSTEMIC OR UNSPECIFIED SITES),3,Major,Major,Medical,Medicaid,,,,,Y,181762.74,33064.78
New York City,Bronx,7000006,001168,Montefiore Medical Center-Wakefield Hospital,70 or Older,104,F,Black/African American,Not Span/Hispanic,13,Emergency,Home or Self Care,2020,INJ037,"COMPLICATION OF OTHER SURGICAL OR MEDICAL CARE, INJURY, INITIAL ENCOUNTER",CAR029,"CARDIOVASCULAR DEVICE PROCEDURES, NEC",721,"POST-OPERATIVE, POST-TRAUMATIC, OTHER DEVICE INFECTIONS",18,INFECTIOUS AND PARASITIC DISEASES (SYSTEMIC OR UNSPECIFIED SITES),3,Major,Major,Medical,Medicare,Medicaid,,,,Y,184194.43,36560.73
New York City,Bronx,7000006,001169,Montefiore Medical Center - Henry & Lucy Moses Div,50 to 69,117,M,White,Not Span/Hispanic,4,Emergency,Home or Self Care,2020,INJ037,"COMPLICATION OF OTHER SURGICAL OR MEDICAL CARE, INJURY, INITIAL ENCOUNTER",CAR024,VENOUS AND ARTERIAL CATHETER PLACEMENT,721,"POST-OPERATIVE, POST-TRAUMATIC, OTHER DEVICE INFECTIONS",18,INFECTIOUS AND PARASITIC DISEASES (SYSTEMIC OR UNSPECIFIED SITES),3,Major,Moderate,Medical,Medicare,Private Health Insurance,,,,Y,82848.35,14598.2
New York City,Bronx,7000006,003058,Montefiore Med Center - Jack D Weiler Hosp of A Einstein College Div,30 to 49,114,F,White,Spanish/Hispanic,2,Emergency,Home w/ Home Health Services,2020,INJ037,"COMPLICATION OF OTHER SURGICAL OR MEDICAL CARE, INJURY, INITIAL ENCOUNTER",SKB002,INCISION AND DRAINAGE OF SKIN,721,"POST-OPERATIVE, POST-TRAUMATIC, OTHER DEVICE INFECTIONS",18,INFECTIOUS AND PARASITIC DISEASES (SYSTEMIC OR UNSPECIFIED SITES),2,Moderate,Moderate,Medical,Private Health Insurance,Private Health Insurance,,,,Y,32724.78,5429.78
New York City,Bronx,7000006,001169,Montefiore Medical Center - Henry & Lucy Moses Div,0 to 17,104,F,Other Race,Spanish/Hispanic,6,Emergency,Home or Self Care,2020,INJ037,"COMPLICATION OF OTHER SURGICAL OR MEDICAL CARE, INJURY, INITIAL ENCOUNTER",ADM017,ADMINISTRATION OF NUTRITIONAL AND ELECTROLYTIC SUBSTANCES,721,"POST-OPERATIVE, POST-TRAUMATIC, OTHER DEVICE INFECTIONS",18,INFECTIOUS AND PARASITIC DISEASES (SYSTEMIC OR UNSPECIFIED SITES),4,Extreme,Moderate,Medical,Medicaid,,,,,Y,77695.39,19784.45
New York City,Bronx,7000006,003058,Montefiore Med Center - Jack D Weiler Hosp of A Einstein College Div,50 to 69,104,F,Other Race,Not Span/Hispanic,9,Emergency,Expired,2020,INJ037,"COMPLICATION OF OTHER SURGICAL OR MEDICAL CARE, INJURY, INITIAL ENCOUNTER",ADM015,ADMINISTRATION OF ANTIBIOTICS,721,"POST-OPERATIVE, POST-TRAUMATIC, OTHER DEVICE INFECTIONS",18,INFECTIOUS AND PARASITIC DISEASES (SYSTEMIC OR UNSPECIFIED SITES),4,Extreme,Extreme,Medical,Medicaid,,,,,Y,118049.78,19467.58
Hudson Valley,Westchester,5904001,001072,Montefiore New Rochelle Hospital,30 to 49,108,F,Other Race,Unknown,4,Emergency,Home or Self Care,2020,INJ037,"COMPLICATION OF OTHER SURGICAL OR MEDICAL CARE, INJURY, INITIAL ENCOUNTER",ADM015,ADMINISTRATION OF ANTIBIOTICS,721,"POST-OPERATIVE, POST-TRAUMATIC, OTHER DEVICE INFECTIONS",18,INFECTIOUS AND PARASITIC DISEASES (SYSTEMIC OR UNSPECIFIED SITES),2,Moderate,Minor,Medical,Blue Cross/Blue Shield,Self-Pay,,,,Y,41324.35,14941.35
New York City,Manhattan,7002012,001447,Hospital for Special Surgery,50 to 69,OOS,F,White,Not Span/Hispanic,2,Urgent,Home w/ Home Health Services,2020,INJ037,"COMPLICATION OF OTHER SURGICAL OR MEDICAL CARE, INJURY, INITIAL ENCOUNTER",MST020,SUBCUTANEOUS TISSUE AND FASCIA EXCISION,721,"POST-OPERATIVE, POST-TRAUMATIC, OTHER DEVICE INFECTIONS",18,INFECTIOUS AND PARASITIC DISEASES (SYSTEMIC OR UNSPECIFIED SITES),2,Moderate,Minor,Medical,Blue Cross/Blue Shield,,,,,N,45359,15410.34
New York City,Manhattan,7002012,001447,Hospital for Special Surgery,50 to 69,117,M,White,Not Span/Hispanic,2,Urgent,Home w/ Home Health Services,2020,INJ037,"COMPLICATION OF OTHER SURGICAL OR MEDICAL CARE, INJURY, INITIAL ENCOUNTER",SKB008,SKIN EXCISION AND DEBRIDEMENT,721,"POST-OPERATIVE, POST-TRAUMATIC, OTHER DEVICE INFECTIONS",18,INFECTIOUS AND PARASITIC DISEASES (SYSTEMIC OR UNSPECIFIED SITES),2,Moderate,Minor,Medical,Private Health Insurance,,,,,N,40431,13507.56
New York City,Manhattan,7002012,001447,Hospital for Special Surgery,50 to 69,OOS,M,White,Not Span/Hispanic,3,Urgent,Home or Self Care,2020,INJ037,"COMPLICATION OF OTHER SURGICAL OR MEDICAL CARE, INJURY, INITIAL ENCOUNTER",MST020,SUBCUTANEOUS TISSUE AND FASCIA EXCISION,721,"POST-OPERATIVE, POST-TRAUMATIC, OTHER DEVICE INFECTIONS",18,INFECTIOUS AND PARASITIC DISEASES (SYSTEMIC OR UNSPECIFIED SITES),2,Moderate,Minor,Medical,Blue Cross/Blue Shield,,,,,N,59697,19890.93
New York City,Manhattan,7002054,001464,New York-Presbyterian Hospital - Columbia Presbyterian Center,0 to 17,112,F,Multi-racial,Not Span/Hispanic,5,Emergency,Home w/ Home Health Services,2020,INJ037,"COMPLICATION OF OTHER SURGICAL OR MEDICAL CARE, INJURY, INITIAL ENCOUNTER",,,721,"POST-OPERATIVE, POST-TRAUMATIC, OTHER DEVICE INFECTIONS",18,INFECTIOUS AND PARASITIC DISEASES (SYSTEMIC OR UNSPECIFIED SITES),3,Major,Moderate,Medical,Private Health Insurance,Medicaid,Self-Pay,,,Y,62163.21,13550.24
New York City,Manhattan,7002054,001464,New York-Presbyterian Hospital - Columbia Presbyterian Center,70 or Older,104,F,Other Race,Spanish/Hispanic,6,Emergency,Home w/ Home Health Services,2020,INJ037,"COMPLICATION OF OTHER SURGICAL OR MEDICAL CARE, INJURY, INITIAL ENCOUNTER",CAR024,VENOUS AND ARTERIAL CATHETER PLACEMENT,721,"POST-OPERATIVE, POST-TRAUMATIC, OTHER DEVICE INFECTIONS",18,INFECTIOUS AND PARASITIC DISEASES (SYSTEMIC OR UNSPECIFIED SITES),3,Major,Major,Medical,Medicare,Medicare,Self-Pay,,,Y,95516.06,24152.35
New York City,Manhattan,7002054,001464,New York-Presbyterian Hospital - Columbia Presbyterian Center,50 to 69,104,F,Multi-racial,Multi-ethnic,8,Emergency,Home w/ Home Health Services,2020,INJ037,"COMPLICATION OF OTHER SURGICAL OR MEDICAL CARE, INJURY, INITIAL ENCOUNTER",CAR024,VENOUS AND ARTERIAL CATHETER PLACEMENT,721,"POST-OPERATIVE, POST-TRAUMATIC, OTHER DEVICE INFECTIONS",18,INFECTIOUS AND PARASITIC DISEASES (SYSTEMIC OR UNSPECIFIED SITES),2,Moderate,Moderate,Medical,Medicaid,Medicaid,Self-Pay,,,Y,116799.11,26128.45
New York City,Manhattan,7002054,001464,New York-Presbyterian Hospital - Columbia Presbyterian Center,18 to 29,112,M,White,Not Span/Hispanic,7,Emergency,Home or Self Care,2020,INJ037,"COMPLICATION OF OTHER SURGICAL OR MEDICAL CARE, INJURY, INITIAL ENCOUNTER",,,721,"POST-OPERATIVE, POST-TRAUMATIC, OTHER DEVICE INFECTIONS",18,INFECTIOUS AND PARASITIC DISEASES (SYSTEMIC OR UNSPECIFIED SITES),3,Major,Major,Medical,Private Health Insurance,Medicaid,Self-Pay,,,Y,99959.29,27075.41
New York City,Manhattan,7002054,001464,New York-Presbyterian Hospital - Columbia Presbyterian Center,50 to 69,100,F,Other Race,Multi-ethnic,6,Emergency,Home w/ Home Health Services,2020,INJ037,"COMPLICATION OF OTHER SURGICAL OR MEDICAL CARE, INJURY, INITIAL ENCOUNTER",ADM001,TRANSFUSION OF BLOOD AND BLOOD PRODUCTS,721,"POST-OPERATIVE, POST-TRAUMATIC, OTHER DEVICE INFECTIONS",18,INFECTIOUS AND PARASITIC DISEASES (SYSTEMIC OR UNSPECIFIED SITES),3,Major,Extreme,Medical,Medicaid,Medicaid,Self-Pay,,,Y,99152.92,20964.48
New York City,Manhattan,7002054,001464,New York-Presbyterian Hospital - Columbia Presbyterian Center,0 to 17,104,F,White,Spanish/Hispanic,8,Emergency,Home w/ Home Health Services,2020,INJ037,"COMPLICATION OF OTHER SURGICAL OR MEDICAL CARE, INJURY, INITIAL ENCOUNTER",,,721,"POST-OPERATIVE, POST-TRAUMATIC, OTHER DEVICE INFECTIONS",18,INFECTIOUS AND PARASITIC DISEASES (SYSTEMIC OR UNSPECIFIED SITES),4,Extreme,Moderate,Medical,Medicaid,Medicaid,Self-Pay,,,Y,102787.52,24682.49
New York City,Manhattan,7002054,001464,New York-Presbyterian Hospital - Columbia Presbyterian Center,0 to 17,104,M,Multi-racial,Multi-ethnic,3,Emergency,Home or Self Care,2020,INJ037,"COMPLICATION OF OTHER SURGICAL OR MEDICAL CARE, INJURY, INITIAL ENCOUNTER",,,721,"POST-OPERATIVE, POST-TRAUMATIC, OTHER DEVICE INFECTIONS",18,INFECTIOUS AND PARASITIC DISEASES (SYSTEMIC OR UNSPECIFIED SITES),2,Moderate,Minor,Medical,Medicaid,Medicaid,Self-Pay,,,Y,44940.39,11119.14
New York City,Manhattan,7002054,001464,New York-Presbyterian Hospital - Columbia Presbyterian Center,30 to 49,OOS,F,Other Race,Spanish/Hispanic,5,Emergency,Home w/ Home Health Services,2020,INJ037,"COMPLICATION OF OTHER SURGICAL OR MEDICAL CARE, INJURY, INITIAL ENCOUNTER",MST003,"SUBCUTANEOUS TISSUE, FASCIA, AND MUSCLE BIOPSY",721,"POST-OPERATIVE, POST-TRAUMATIC, OTHER DEVICE INFECTIONS",18,INFECTIOUS AND PARASITIC DISEASES (SYSTEMIC OR UNSPECIFIED SITES),3,Major,Major,Medical,Medicare,Private Health Insurance,Self-Pay,,,Y,71338.04,14807.18
New York City,Manhattan,7002054,001464,New York-Presbyterian Hospital - Columbia Presbyterian Center,50 to 69,105,F,Other Race,Not Span/Hispanic,4,Urgent,Home or Self Care,2020,INJ037,"COMPLICATION OF OTHER SURGICAL OR MEDICAL CARE, INJURY, INITIAL ENCOUNTER",SKB002,INCISION AND DRAINAGE OF SKIN,721,"POST-OPERATIVE, POST-TRAUMATIC, OTHER DEVICE INFECTIONS",18,INFECTIOUS AND PARASITIC DISEASES (SYSTEMIC OR UNSPECIFIED SITES),2,Moderate,Moderate,Medical,Blue Cross/Blue Shield,Self-Pay,,,,N,45156.55,9744.21
New York City,Manhattan,7002054,001464,New York-Presbyterian Hospital - Columbia Presbyterian Center,50 to 69,100,M,Other Race,Not Span/Hispanic,8,Urgent,Home w/ Home Health Services,2020,INJ037,"COMPLICATION OF OTHER SURGICAL OR MEDICAL CARE, INJURY, INITIAL ENCOUNTER",CAR025,PLACEMENT OF TUNNELED OR IMPLANTABLE PORTION OF A VASCULAR ACCESS DEVICE,721,"POST-OPERATIVE, POST-TRAUMATIC, OTHER DEVICE INFECTIONS",18,INFECTIOUS AND PARASITIC DISEASES (SYSTEMIC OR UNSPECIFIED SITES),4,Extreme,Moderate,Medical,Medicare,Private Health Insurance,Self-Pay,,,N,128791.48,30549.87
New York City,Manhattan,7002054,001464,New York-Presbyterian Hospital - Columbia Presbyterian Center,70 or Older,100,F,Multi-racial,Multi-ethnic,6,Emergency,Home or Self Care,2020,INJ037,"COMPLICATION OF OTHER SURGICAL OR MEDICAL CARE, INJURY, INITIAL ENCOUNTER",CAR029,"CARDIOVASCULAR DEVICE PROCEDURES, NEC",721,"POST-OPERATIVE, POST-TRAUMATIC, OTHER DEVICE INFECTIONS",18,INFECTIOUS AND PARASITIC DISEASES (SYSTEMIC OR UNSPECIFIED SITES),4,Extreme,Major,Medical,Medicare,Medicaid,Self-Pay,,,Y,88905.15,21035.33
New York City,Manhattan,7002054,001464,New York-Presbyterian Hospital - Columbia Presbyterian Center,0 to 17,,M,Other Race,Multi-ethnic,1,Emergency,Home or Self Care,2020,INJ037,"COMPLICATION OF OTHER SURGICAL OR MEDICAL CARE, INJURY, INITIAL ENCOUNTER",ADM017,ADMINISTRATION OF NUTRITIONAL AND ELECTROLYTIC SUBSTANCES,721,"POST-OPERATIVE, POST-TRAUMATIC, OTHER DEVICE INFECTIONS",18,INFECTIOUS AND PARASITIC DISEASES (SYSTEMIC OR UNSPECIFIED SITES),4,Extreme,Minor,Medical,Private Health Insurance,Private Health Insurance,Self-Pay,,,Y,20215.78,4562.23
New York City,Manhattan,7002054,001464,New York-Presbyterian Hospital - Columbia Presbyterian Center,30 to 49,115,M,White,Not Span/Hispanic,9,Urgent,Home w/ Home Health Services,2020,INJ037,"COMPLICATION OF OTHER SURGICAL OR MEDICAL CARE, INJURY, INITIAL ENCOUNTER",MST020,SUBCUTANEOUS TISSUE AND FASCIA EXCISION,721,"POST-OPERATIVE, POST-TRAUMATIC, OTHER DEVICE INFECTIONS",18,INFECTIOUS AND PARASITIC DISEASES (SYSTEMIC OR UNSPECIFIED SITES),2,Moderate,Minor,Medical,Blue Cross/Blue Shield,Self-Pay,,,,N,160344.05,76269.49
New York City,Manhattan,7002054,001464,New York-Presbyterian Hospital - Columbia Presbyterian Center,50 to 69,109,F,White,Not Span/Hispanic,11,Urgent,Home w/ Home Health Services,2020,INJ037,"COMPLICATION OF OTHER SURGICAL OR MEDICAL CARE, INJURY, INITIAL ENCOUNTER",ADM001,TRANSFUSION OF BLOOD AND BLOOD PRODUCTS,721,"POST-OPERATIVE, POST-TRAUMATIC, OTHER DEVICE INFECTIONS",18,INFECTIOUS AND PARASITIC DISEASES (SYSTEMIC OR UNSPECIFIED SITES),3,Major,Major,Medical,Medicare,Private Health Insurance,Self-Pay,,,N,131708.22,29567.28
New York City,Manhattan,7002054,001464,New York-Presbyterian Hospital - Columbia Presbyterian Center,50 to 69,112,F,Black/African American,Not Span/Hispanic,32,Emergency,Hospice - Medical Facility,2020,INJ037,"COMPLICATION OF OTHER SURGICAL OR MEDICAL CARE, INJURY, INITIAL ENCOUNTER",GNR006,"CHEST WALL PROCEDURES, NEC",721,"POST-OPERATIVE, POST-TRAUMATIC, OTHER DEVICE INFECTIONS",18,INFECTIOUS AND PARASITIC DISEASES (SYSTEMIC OR UNSPECIFIED SITES),4,Extreme,Extreme,Medical,Medicaid,Self-Pay,,,,Y,796111.26,370473.89
New York City,Manhattan,7002024,001456,Mount Sinai Hospital,30 to 49,104,F,Black/African American,Not Span/Hispanic,6,Emergency,Home w/ Home Health Services,2020,INJ037,"COMPLICATION OF OTHER SURGICAL OR MEDICAL CARE, INJURY, INITIAL ENCOUNTER",MST020,SUBCUTANEOUS TISSUE AND FASCIA EXCISION,721,"POST-OPERATIVE, POST-TRAUMATIC, OTHER DEVICE INFECTIONS",18,INFECTIOUS AND PARASITIC DISEASES (SYSTEMIC OR UNSPECIFIED SITES),1,Minor,Minor,Medical,Medicaid,Self-Pay,,,,Y,115306.65,33906.61
New York City,Queens,7003010,001637,New York - Presbyterian/Queens,70 or Older,114,M,White,Not Span/Hispanic,24,Emergency,Skilled Nursing Home,2020,INJ037,"COMPLICATION OF OTHER SURGICAL OR MEDICAL CARE, INJURY, INITIAL ENCOUNTER",MST005,INCISION AND DRAINAGE OF SUBCUTANEOUS TISSUE AND FASCIA,721,"POST-OPERATIVE, POST-TRAUMATIC, OTHER DEVICE INFECTIONS",18,INFECTIOUS AND PARASITIC DISEASES (SYSTEMIC OR UNSPECIFIED SITES),4,Extreme,Major,Medical,Medicare,Blue Cross/Blue Shield,Self-Pay,,,Y,177504.07,43627.8