Hospital Service Area,Hospital County,Operating Certificate Number,Permanent Facility Id,Facility Name,Age Group,Zip Code - 3 digits,Gender,Race,Ethnicity,Length of Stay,Type of Admission,Patient Disposition,Discharge Year,CCS Diagnosis Code,CCS Diagnosis Description,CCS Procedure Code,CCS Procedure Description,APR DRG Code,APR DRG Description,APR MDC Code,APR MDC Description,APR Severity of Illness Code,APR Severity of Illness Description,APR Risk of Mortality,APR Medical Surgical Description,Payment Typology 1,Payment Typology 2,Payment Typology 3,Birth Weight,Abortion Edit Indicator,Emergency Department Indicator,Total Charges,Total Costs
New York City,Manhattan,7002024,001456,Mount Sinai Hospital,50 to 69,100,M,Other Race,Not Span/Hispanic,2,Emergency,Skilled Nursing Home,2017,246,Fever of unknown origin,058,HEMODIALYSIS,722,Fever,18,"Infectious and Parasitic Diseases, Systemic or Unspecified Sites",3,Major,Major,Medical,Medicare,Blue Cross/Blue Shield,Medicaid,,N,Y,20654.29,6589.47
New York City,Bronx,7000006,001169,Montefiore Medical Center - Henry & Lucy Moses Div,50 to 69,104,M,Other Race,Not Span/Hispanic,2,Emergency,Home or Self Care,2017,246,Fever of unknown origin,000,NO PROC,722,Fever,18,"Infectious and Parasitic Diseases, Systemic or Unspecified Sites",2,Moderate,Moderate,Medical,Private Health Insurance,,,,N,Y,39157.91,6679.33
New York City,Bronx,7000006,001169,Montefiore Medical Center - Henry & Lucy Moses Div,0 to 17,104,M,Other Race,Not Span/Hispanic,3,Emergency,Home or Self Care,2017,224,Other perinatal conditions,227,"OT DX PRC (INTERVW,EVAL",722,Fever,18,"Infectious and Parasitic Diseases, Systemic or Unspecified Sites",2,Moderate,Minor,Medical,Medicaid,,,04000,N,Y,32345.74,8313.78
New York City,Bronx,7000006,003058,Montefiore Med Center - Jack D Weiler Hosp of A Einstein College Div,0 to 17,104,M,Other Race,Not Span/Hispanic,4,Emergency,Home or Self Care,2017,246,Fever of unknown origin,004,DIAGNOSTIC SPINAL TAP,722,Fever,18,"Infectious and Parasitic Diseases, Systemic or Unspecified Sites",1,Minor,Minor,Medical,Medicaid,,,,N,Y,36956.10,10286.93
New York City,Kings,7002002,001324,Mount Sinai Brooklyn,50 to 69,112,F,White,Not Span/Hispanic,3,Emergency,Home or Self Care,2017,246,Fever of unknown origin,231,OTHER THERAPEUTIC PRCS,722,Fever,18,"Infectious and Parasitic Diseases, Systemic or Unspecified Sites",2,Moderate,Minor,Medical,Medicare,Medicaid,Self-Pay,,N,Y,22014.58,3834.26
New York City,Manhattan,7002002,001439,Mount Sinai Beth Israel,30 to 49,114,M,Black/African American,Not Span/Hispanic,1,Emergency,Home or Self Care,2017,238,Complications of surgical procedures or medical care,231,OTHER THERAPEUTIC PRCS,722,Fever,18,"Infectious and Parasitic Diseases, Systemic or Unspecified Sites",1,Minor,Minor,Medical,Medicaid,Medicaid,Self-Pay,,N,N,12633.76,2693.52
New York City,Manhattan,7002024,001456,Mount Sinai Hospital,0 to 17,109,M,White,Not Span/Hispanic,4,Emergency,Home or Self Care,2017,224,Other perinatal conditions,004,DIAGNOSTIC SPINAL TAP,722,Fever,18,"Infectious and Parasitic Diseases, Systemic or Unspecified Sites",1,Minor,Minor,Medical,Medicaid,Medicaid,Self-Pay,03900,N,Y,31966.40,23246.99
Finger Lakes,Livingston,2527000,000393,Nicholas H Noyes Memorial Hospital,70 or Older,144,F,White,Not Span/Hispanic,4,Emergency,Home or Self Care,2017,246,Fever of unknown origin,000,NO PROC,722,Fever,18,"Infectious and Parasitic Diseases, Systemic or Unspecified Sites",2,Moderate,Minor,Medical,Medicare,Blue Cross/Blue Shield,,,N,Y,9114.48,4857.21
New York City,Bronx,7000006,001168,Montefiore Medical Center-Wakefield Hospital,18 to 29,104,M,Black/African American,Not Span/Hispanic,2,Emergency,Home or Self Care,2017,246,Fever of unknown origin,000,NO PROC,722,Fever,18,"Infectious and Parasitic Diseases, Systemic or Unspecified Sites",3,Major,Moderate,Medical,Medicare,Medicaid,,,N,Y,31034.81,5362.56
New York City,Bronx,7000006,001169,Montefiore Medical Center - Henry & Lucy Moses Div,50 to 69,104,F,Other Race,Spanish/Hispanic,1,Emergency,Home or Self Care,2017,246,Fever of unknown origin,231,OTHER THERAPEUTIC PRCS,722,Fever,18,"Infectious and Parasitic Diseases, Systemic or Unspecified Sites",1,Minor,Minor,Medical,Medicaid,,,,N,Y,34521.28,5747.21
New York City,Bronx,7000006,001169,Montefiore Medical Center - Henry & Lucy Moses Div,70 or Older,104,F,Other Race,Not Span/Hispanic,1,Emergency,Left Against Medical Advice,2017,246,Fever of unknown origin,231,OTHER THERAPEUTIC PRCS,722,Fever,18,"Infectious and Parasitic Diseases, Systemic or Unspecified Sites",2,Moderate,Moderate,Medical,Medicare,,,,N,Y,16208.88,2740.39
New York City,Bronx,7000006,001169,Montefiore Medical Center - Henry & Lucy Moses Div,18 to 29,104,M,Other Race,Spanish/Hispanic,2,Emergency,Home or Self Care,2017,246,Fever of unknown origin,000,NO PROC,722,Fever,18,"Infectious and Parasitic Diseases, Systemic or Unspecified Sites",2,Moderate,Moderate,Medical,Medicaid,,,,N,Y,21395.88,4237.14
New York City,Bronx,7000006,001169,Montefiore Medical Center - Henry & Lucy Moses Div,0 to 17,104,M,White,Not Span/Hispanic,1,Emergency,Home or Self Care,2017,246,Fever of unknown origin,000,NO PROC,722,Fever,18,"Infectious and Parasitic Diseases, Systemic or Unspecified Sites",1,Minor,Minor,Medical,Private Health Insurance,,,,N,Y,13646.82,3372.13
New York City,Kings,7002002,001324,Mount Sinai Brooklyn,70 or Older,112,M,White,Not Span/Hispanic,3,Emergency,Skilled Nursing Home,2017,246,Fever of unknown origin,231,OTHER THERAPEUTIC PRCS,722,Fever,18,"Infectious and Parasitic Diseases, Systemic or Unspecified Sites",2,Moderate,Moderate,Medical,Medicare,Medicaid,Self-Pay,,N,Y,27915.55,4472.30
New York City,Manhattan,7002024,001456,Mount Sinai Hospital,0 to 17,100,F,White,Not Span/Hispanic,2,Emergency,Home or Self Care,2017,246,Fever of unknown origin,187,INTRAVENOUS PYELOGRAM,722,Fever,18,"Infectious and Parasitic Diseases, Systemic or Unspecified Sites",3,Major,Minor,Medical,Medicare,Medicaid,Self-Pay,,N,Y,21605.15,13614.35
New York City,Manhattan,7002024,001456,Mount Sinai Hospital,50 to 69,100,F,Other Race,Not Span/Hispanic,5,Emergency,Home or Self Care,2017,238,Complications of surgical procedures or medical care,000,NO PROC,722,Fever,18,"Infectious and Parasitic Diseases, Systemic or Unspecified Sites",3,Major,Major,Medical,Medicaid,Self-Pay,,,N,Y,49369.91,16940.89
New York City,Bronx,7000006,001169,Montefiore Medical Center - Henry & Lucy Moses Div,30 to 49,104,F,Other Race,Spanish/Hispanic,2,Emergency,Home or Self Care,2017,238,Complications of surgical procedures or medical care,231,OTHER THERAPEUTIC PRCS,722,Fever,18,"Infectious and Parasitic Diseases, Systemic or Unspecified Sites",1,Minor,Minor,Medical,Medicaid,,,,N,Y,21107.91,4363.17
New York City,Bronx,7000006,001169,Montefiore Medical Center - Henry & Lucy Moses Div,18 to 29,100,F,Other Race,Not Span/Hispanic,2,Emergency,Left Against Medical Advice,2017,246,Fever of unknown origin,198,MAG RESONANCE IMAGING,722,Fever,18,"Infectious and Parasitic Diseases, Systemic or Unspecified Sites",1,Minor,Minor,Medical,Medicaid,,,,N,Y,47134.74,6922.72
New York City,Bronx,7000006,001169,Montefiore Medical Center - Henry & Lucy Moses Div,50 to 69,104,F,Black/African American,Not Span/Hispanic,2,Emergency,Home or Self Care,2017,246,Fever of unknown origin,179,CT SCAN ABDOMEN,722,Fever,18,"Infectious and Parasitic Diseases, Systemic or Unspecified Sites",2,Moderate,Minor,Medical,Medicaid,,,,N,Y,29084.73,4502.29
New York City,Bronx,7000006,003058,Montefiore Med Center - Jack D Weiler Hosp of A Einstein College Div,30 to 49,104,M,Other Race,Spanish/Hispanic,7,Emergency,Home w/ Home Health Services,2017,246,Fever of unknown origin,231,OTHER THERAPEUTIC PRCS,722,Fever,18,"Infectious and Parasitic Diseases, Systemic or Unspecified Sites",2,Moderate,Moderate,Medical,Medicare,Medicaid,,,N,Y,68029.27,12230.75
New York City,Bronx,7000006,003058,Montefiore Med Center - Jack D Weiler Hosp of A Einstein College Div,70 or Older,104,M,White,Not Span/Hispanic,4,Emergency,Home or Self Care,2017,246,Fever of unknown origin,000,NO PROC,722,Fever,18,"Infectious and Parasitic Diseases, Systemic or Unspecified Sites",2,Moderate,Moderate,Medical,Medicare,Blue Cross/Blue Shield,,,N,Y,34400.01,6925.91
New York City,Kings,7001003,001288,Brooklyn Hospital Center - Downtown Campus,70 or Older,112,F,Black/African American,Not Span/Hispanic,1,Emergency,Skilled Nursing Home,2017,246,Fever of unknown origin,000,NO PROC,722,Fever,18,"Infectious and Parasitic Diseases, Systemic or Unspecified Sites",3,Major,Major,Medical,Medicare,Medicaid,Self-Pay,,N,Y,11204.34,1877.04
New York City,Kings,7001037,001320,University Hospital of Brooklyn,18 to 29,112,F,Black/African American,Not Span/Hispanic,5,Emergency,Home or Self Care,2017,246,Fever of unknown origin,054,OT VASC CATH; NOT HEART,722,Fever,18,"Infectious and Parasitic Diseases, Systemic or Unspecified Sites",1,Minor,Minor,Medical,Private Health Insurance,Medicaid,Self-Pay,,N,Y,23573.00,16366.02
New York City,Manhattan,7002024,001456,Mount Sinai Hospital,0 to 17,100,F,Other Race,Not Span/Hispanic,3,Emergency,Home or Self Care,2017,224,Other perinatal conditions,000,NO PROC,722,Fever,18,"Infectious and Parasitic Diseases, Systemic or Unspecified Sites",2,Moderate,Minor,Medical,Medicaid,Medicaid,Self-Pay,03200,N,Y,22905.26,17081.79
New York City,Manhattan,7002032,001466,Mount Sinai West,30 to 49,107,F,White,Spanish/Hispanic,2,Emergency,Home w/ Home Health Services,2017,238,Complications of surgical procedures or medical care,231,OTHER THERAPEUTIC PRCS,722,Fever,18,"Infectious and Parasitic Diseases, Systemic or Unspecified Sites",2,Moderate,Minor,Medical,Private Health Insurance,Self-Pay,,,N,Y,28446.86,6728.60
New York City,Manhattan,7002032,001469,Mount Sinai St. Luke's,50 to 69,100,M,Black/African American,Spanish/Hispanic,2,Emergency,Left Against Medical Advice,2017,246,Fever of unknown origin,226,OT DX RADIO & RELATED,722,Fever,18,"Infectious and Parasitic Diseases, Systemic or Unspecified Sites",3,Major,Major,Medical,Medicaid,Medicaid,Self-Pay,,N,Y,27092.49,7391.79
Long Island,Nassau,2950002,000528,Nassau University Medical Center,50 to 69,113,F,Black/African American,Not Span/Hispanic,5,Emergency,Skilled Nursing Home,2017,246,Fever of unknown origin,177,COMP AXIAL TOMOGR (CT),722,Fever,18,"Infectious and Parasitic Diseases, Systemic or Unspecified Sites",3,Major,Moderate,Medical,Medicare,Medicaid,Self-Pay,,N,N,55440.05,19110.65
New York City,Kings,7001021,001306,New York - Presbyterian Brooklyn Methodist Hospital,0 to 17,,M,White,Not Span/Hispanic,3,Emergency,Home or Self Care,2017,246,Fever of unknown origin,004,DIAGNOSTIC SPINAL TAP,722,Fever,18,"Infectious and Parasitic Diseases, Systemic or Unspecified Sites",1,Minor,Minor,Medical,Medicaid,Medicaid,Self-Pay,,N,Y,16177.30,8623.51
New York City,Manhattan,7002054,001458,New York Presbyterian Hospital - New York Weill Cornell Center,50 to 69,100,M,Other Race,Not Span/Hispanic,2,Emergency,Home or Self Care,2017,246,Fever of unknown origin,231,OTHER THERAPEUTIC PRCS,722,Fever,18,"Infectious and Parasitic Diseases, Systemic or Unspecified Sites",3,Major,Minor,Medical,Miscellaneous/Other,,,,N,Y,27895.37,6665.50
New York City,Manhattan,7002054,001458,New York Presbyterian Hospital - New York Weill Cornell Center,50 to 69,112,F,Other Race,Not Span/Hispanic,1,Emergency,Home or Self Care,2017,246,Fever of unknown origin,231,OTHER THERAPEUTIC PRCS,722,Fever,18,"Infectious and Parasitic Diseases, Systemic or Unspecified Sites",2,Moderate,Moderate,Medical,Medicaid,Medicaid,Self-Pay,,N,Y,17823.88,4284.16
New York City,Manhattan,7002054,001458,New York Presbyterian Hospital - New York Weill Cornell Center,0 to 17,104,M,Black/African American,Spanish/Hispanic,2,Emergency,Home or Self Care,2017,246,Fever of unknown origin,004,DIAGNOSTIC SPINAL TAP,722,Fever,18,"Infectious and Parasitic Diseases, Systemic or Unspecified Sites",1,Minor,Minor,Medical,Medicaid,Medicaid,Self-Pay,,N,Y,22154.55,7816.78
New York City,Manhattan,7002054,001458,New York Presbyterian Hospital - New York Weill Cornell Center,30 to 49,OOS,F,Other Race,Not Span/Hispanic,1,Emergency,Home or Self Care,2017,246,Fever of unknown origin,000,NO PROC,722,Fever,18,"Infectious and Parasitic Diseases, Systemic or Unspecified Sites",2,Moderate,Minor,Medical,Blue Cross/Blue Shield,Self-Pay,,,N,Y,20642.13,4954.27
New York City,Manhattan,7002054,001458,New York Presbyterian Hospital - New York Weill Cornell Center,50 to 69,112,F,Multi-racial,Not Span/Hispanic,2,Emergency,Home or Self Care,2017,238,Complications of surgical procedures or medical care,054,OT VASC CATH; NOT HEART,722,Fever,18,"Infectious and Parasitic Diseases, Systemic or Unspecified Sites",2,Moderate,Moderate,Medical,Blue Cross/Blue Shield,Self-Pay,,,N,N,37923.72,10792.61
New York City,Manhattan,7002054,001464,New York Presbyterian Hospital - Columbia Presbyterian Center,50 to 69,107,F,White,Not Span/Hispanic,6,Urgent,Home or Self Care,2017,246,Fever of unknown origin,000,NO PROC,722,Fever,18,"Infectious and Parasitic Diseases, Systemic or Unspecified Sites",3,Major,Moderate,Medical,Medicaid,Medicaid,Self-Pay,,N,N,68208.77,17102.25
New York City,Manhattan,7002054,001464,New York Presbyterian Hospital - Columbia Presbyterian Center,0 to 17,OOS,F,Other Race,Not Span/Hispanic,5,Emergency,Home or Self Care,2017,246,Fever of unknown origin,000,NO PROC,722,Fever,18,"Infectious and Parasitic Diseases, Systemic or Unspecified Sites",1,Minor,Minor,Medical,Private Health Insurance,Self-Pay,,,N,N,47828.49,15056.81
New York City,Manhattan,7002054,001464,New York Presbyterian Hospital - Columbia Presbyterian Center,0 to 17,109,F,White,Not Span/Hispanic,1,Emergency,Home or Self Care,2017,246,Fever of unknown origin,231,OTHER THERAPEUTIC PRCS,722,Fever,18,"Infectious and Parasitic Diseases, Systemic or Unspecified Sites",1,Minor,Minor,Medical,Private Health Insurance,Self-Pay,,,N,Y,15731.45,3795.91
New York City,Manhattan,7002054,001464,New York Presbyterian Hospital - Columbia Presbyterian Center,0 to 17,112,M,Black/African American,Multi-ethnic,2,Emergency,Home w/ Home Health Services,2017,246,Fever of unknown origin,223,ENTERAL/PARENTERAL NUTR,722,Fever,18,"Infectious and Parasitic Diseases, Systemic or Unspecified Sites",3,Major,Minor,Medical,Medicaid,Self-Pay,,,N,Y,24793.12,6573.53
New York City,Manhattan,7002054,001464,New York Presbyterian Hospital - Columbia Presbyterian Center,0 to 17,104,F,Multi-racial,Spanish/Hispanic,1,Emergency,Home or Self Care,2017,246,Fever of unknown origin,000,NO PROC,722,Fever,18,"Infectious and Parasitic Diseases, Systemic or Unspecified Sites",1,Minor,Minor,Medical,Medicaid,Medicaid,Self-Pay,,N,Y,14574.69,3584.57
New York City,Manhattan,7002054,001464,New York Presbyterian Hospital - Columbia Presbyterian Center,0 to 17,100,M,Multi-racial,Multi-ethnic,2,Emergency,Home or Self Care,2017,246,Fever of unknown origin,000,NO PROC,722,Fever,18,"Infectious and Parasitic Diseases, Systemic or Unspecified Sites",1,Minor,Minor,Medical,Medicaid,Medicaid,Self-Pay,,N,Y,25989.67,6293.51
New York City,Manhattan,7002054,003975,New York Presbyterian Hospital - Allen Hospital,50 to 69,104,F,Other Race,Not Span/Hispanic,3,Emergency,Home or Self Care,2017,246,Fever of unknown origin,178,CT SCAN CHEST,722,Fever,18,"Infectious and Parasitic Diseases, Systemic or Unspecified Sites",2,Moderate,Minor,Medical,Medicare,Medicaid,Self-Pay,,N,Y,36718.70,8952.90
New York City,Queens,7003010,001637,New York - Presbyterian/Queens,0 to 17,113,M,Other Race,Not Span/Hispanic,2,Emergency,Home or Self Care,2017,246,Fever of unknown origin,231,OTHER THERAPEUTIC PRCS,722,Fever,18,"Infectious and Parasitic Diseases, Systemic or Unspecified Sites",1,Minor,Minor,Medical,Medicaid,Medicaid,Self-Pay,,N,Y,13839.92,9530.77
New York City,Queens,7003010,001637,New York - Presbyterian/Queens,0 to 17,113,M,Other Race,Not Span/Hispanic,7,Emergency,Home or Self Care,2017,224,Other perinatal conditions,004,DIAGNOSTIC SPINAL TAP,722,Fever,18,"Infectious and Parasitic Diseases, Systemic or Unspecified Sites",1,Minor,Minor,Medical,Medicaid,Medicaid,Self-Pay,03500,N,Y,39796.38,30908.10
New York City,Queens,7003010,001637,New York - Presbyterian/Queens,50 to 69,113,F,Other Race,Not Span/Hispanic,5,Emergency,Skilled Nursing Home,2017,246,Fever of unknown origin,071,GASTROSTOMY; TEMP/PERM,722,Fever,18,"Infectious and Parasitic Diseases, Systemic or Unspecified Sites",3,Major,Moderate,Medical,Medicaid,Self-Pay,,,N,Y,43677.02,13836.51
New York City,Queens,7003010,001637,New York - Presbyterian/Queens,0 to 17,114,F,White,Not Span/Hispanic,2,Emergency,Home or Self Care,2017,246,Fever of unknown origin,004,DIAGNOSTIC SPINAL TAP,722,Fever,18,"Infectious and Parasitic Diseases, Systemic or Unspecified Sites",2,Moderate,Minor,Medical,Medicaid,Medicaid,Self-Pay,,N,Y,13702.92,6839.96
New York City,Queens,7003010,001637,New York - Presbyterian/Queens,70 or Older,113,M,White,Not Span/Hispanic,1,Emergency,Home or Self Care,2017,246,Fever of unknown origin,231,OTHER THERAPEUTIC PRCS,722,Fever,18,"Infectious and Parasitic Diseases, Systemic or Unspecified Sites",2,Moderate,Moderate,Medical,Medicare,Medicare,Self-Pay,,N,Y,12546.42,2991.60
New York City,Queens,7003010,001637,New York - Presbyterian/Queens,30 to 49,113,M,White,Not Span/Hispanic,2,Emergency,Home or Self Care,2017,246,Fever of unknown origin,179,CT SCAN ABDOMEN,722,Fever,18,"Infectious and Parasitic Diseases, Systemic or Unspecified Sites",2,Moderate,Minor,Medical,Blue Cross/Blue Shield,Self-Pay,,,N,Y,16395.40,4340.87
New York City,Queens,7003010,001637,New York - Presbyterian/Queens,0 to 17,114,F,Black/African American,Not Span/Hispanic,2,Emergency,Home or Self Care,2017,246,Fever of unknown origin,231,OTHER THERAPEUTIC PRCS,722,Fever,18,"Infectious and Parasitic Diseases, Systemic or Unspecified Sites",1,Minor,Minor,Medical,Medicaid,Self-Pay,,,N,Y,14111.43,6952.02
Central NY,Onondaga,3301008,000636,Crouse Hospital,70 or Older,132,M,White,Not Span/Hispanic,5,Emergency,Skilled Nursing Home,2017,246,Fever of unknown origin,231,OTHER THERAPEUTIC PRCS,722,Fever,18,"Infectious and Parasitic Diseases, Systemic or Unspecified Sites",3,Major,Major,Medical,Medicare,Medicaid,,,N,Y,17861.79,8187.59
Central NY,Onondaga,3301008,000636,Crouse Hospital,70 or Older,132,F,White,Not Span/Hispanic,4,Emergency,Skilled Nursing Home,2017,246,Fever of unknown origin,231,OTHER THERAPEUTIC PRCS,722,Fever,18,"Infectious and Parasitic Diseases, Systemic or Unspecified Sites",2,Moderate,Moderate,Medical,Medicare,Medicare,Private Health Insurance,,N,Y,11283.03,4990.25
Hudson Valley,Westchester,5907001,001097,SJRH - St Johns Division,70 or Older,107,M,White,Not Span/Hispanic,1,Emergency,Home or Self Care,2017,246,Fever of unknown origin,000,NO PROC,722,Fever,18,"Infectious and Parasitic Diseases, Systemic or Unspecified Sites",2,Moderate,Moderate,Medical,Miscellaneous/Other,Medicare,Blue Cross/Blue Shield,,N,Y,14384.17,4814.15
New York City,Bronx,7000001,001178,Bronx-Lebanon Hospital Center - Concourse Division,0 to 17,104,F,Other Race,Spanish/Hispanic,5,Emergency,Home or Self Care,2017,246,Fever of unknown origin,000,NO PROC,722,Fever,18,"Infectious and Parasitic Diseases, Systemic or Unspecified Sites",1,Minor,Minor,Medical,Medicaid,Medicaid,,,N,Y,13365.25,11498.95
New York City,Bronx,7000001,001178,Bronx-Lebanon Hospital Center - Concourse Division,0 to 17,104,F,Other Race,Spanish/Hispanic,3,Emergency,Home or Self Care,2017,246,Fever of unknown origin,000,NO PROC,722,Fever,18,"Infectious and Parasitic Diseases, Systemic or Unspecified Sites",2,Moderate,Minor,Medical,Medicaid,Medicaid,Private Health Insurance,,N,Y,9776.18,8262.46
New York City,Bronx,7000001,001178,Bronx-Lebanon Hospital Center - Concourse Division,0 to 17,104,F,Black/African American,Not Span/Hispanic,2,Emergency,Home or Self Care,2017,224,Other perinatal conditions,000,NO PROC,722,Fever,18,"Infectious and Parasitic Diseases, Systemic or Unspecified Sites",2,Moderate,Moderate,Medical,Medicaid,Medicaid,,03200,N,Y,7855.94,6697.31
New York City,Kings,7002053,001304,NYU Langone Hospital-Brooklyn,70 or Older,112,M,Black/African American,Not Span/Hispanic,1,Emergency,Medicare Cert Long Term Care Hospital,2017,246,Fever of unknown origin,000,NO PROC,722,Fever,18,"Infectious and Parasitic Diseases, Systemic or Unspecified Sites",1,Minor,Minor,Medical,Medicare,,,,N,Y,15465.98,3158.14
New York City,Manhattan,7002053,001446,NYU Langone Orthopedic Hospital,0 to 17,112,M,White,Not Span/Hispanic,3,Emergency,Home or Self Care,2017,246,Fever of unknown origin,223,ENTERAL/PARENTERAL NUTR,722,Fever,18,"Infectious and Parasitic Diseases, Systemic or Unspecified Sites",2,Moderate,Minor,Medical,Medicaid,,,,N,Y,20450.45,9024.52
New York City,Manhattan,7002024,001456,Mount Sinai Hospital,0 to 17,117,F,White,Not Span/Hispanic,1,Urgent,Home or Self Care,2017,246,Fever of unknown origin,000,NO PROC,722,Fever,18,"Infectious and Parasitic Diseases, Systemic or Unspecified Sites",3,Major,Moderate,Medical,Blue Cross/Blue Shield,Self-Pay,,,N,N,6350.91,4996.15
New York City,Manhattan,7002032,001466,Mount Sinai West,50 to 69,100,M,White,Not Span/Hispanic,1,Emergency,Home or Self Care,2017,246,Fever of unknown origin,231,OTHER THERAPEUTIC PRCS,722,Fever,18,"Infectious and Parasitic Diseases, Systemic or Unspecified Sites",2,Moderate,Moderate,Medical,Private Health Insurance,Self-Pay,,,N,Y,12579.11,3172.71
Long Island,Suffolk,5123000,000885,Brookhaven Memorial Hospital Medical Center Inc,70 or Older,117,F,White,Not Span/Hispanic,6,Emergency,Skilled Nursing Home,2017,246,Fever of unknown origin,000,NO PROC,722,Fever,18,"Infectious and Parasitic Diseases, Systemic or Unspecified Sites",3,Major,Moderate,Medical,Medicare,,,,N,Y,48718.67,8885.52
Long Island,Suffolk,5123000,000885,Brookhaven Memorial Hospital Medical Center Inc,70 or Older,117,M,Other Race,Not Span/Hispanic,3,Emergency,Home or Self Care,2017,246,Fever of unknown origin,000,NO PROC,722,Fever,18,"Infectious and Parasitic Diseases, Systemic or Unspecified Sites",2,Moderate,Major,Medical,Medicare,,,,N,Y,26015.69,4656.20
Western NY,Erie,1401014,000207,Buffalo General Medical Center,50 to 69,140,M,White,Not Span/Hispanic,6,Emergency,Home or Self Care,2017,246,Fever of unknown origin,058,HEMODIALYSIS,722,Fever,18,"Infectious and Parasitic Diseases, Systemic or Unspecified Sites",3,Major,Major,Medical,Medicare,Blue Cross/Blue Shield,Self-Pay,,N,Y,27758.62,13585.93
Western NY,Erie,1401014,000208,Women And Children's Hospital Of Buffalo,0 to 17,142,F,Black/African American,Not Span/Hispanic,2,Emergency,Home or Self Care,2017,246,Fever of unknown origin,004,DIAGNOSTIC SPINAL TAP,722,Fever,18,"Infectious and Parasitic Diseases, Systemic or Unspecified Sites",1,Minor,Minor,Medical,Medicaid,Self-Pay,,,N,Y,10393.65,4934.62
Western NY,Erie,1401014,000208,Women And Children's Hospital Of Buffalo,0 to 17,142,M,Black/African American,Not Span/Hispanic,4,Emergency,Home or Self Care,2017,224,Other perinatal conditions,004,DIAGNOSTIC SPINAL TAP,722,Fever,18,"Infectious and Parasitic Diseases, Systemic or Unspecified Sites",1,Minor,Minor,Medical,Medicaid,Self-Pay,,03200,N,Y,12252.23,6633.44
Western NY,Erie,1401014,000208,Women And Children's Hospital Of Buffalo,0 to 17,142,M,Other Race,Not Span/Hispanic,2,Urgent,Home or Self Care,2017,246,Fever of unknown origin,004,DIAGNOSTIC SPINAL TAP,722,Fever,18,"Infectious and Parasitic Diseases, Systemic or Unspecified Sites",1,Minor,Minor,Medical,Medicaid,Self-Pay,,,N,Y,8946.96,4522.77
Western NY,Erie,1401014,003067,Millard Fillmore Suburban Hospital,50 to 69,142,F,White,Not Span/Hispanic,3,Emergency,Home w/ Home Health Services,2017,246,Fever of unknown origin,000,NO PROC,722,Fever,18,"Infectious and Parasitic Diseases, Systemic or Unspecified Sites",2,Moderate,Moderate,Medical,Medicare,Self-Pay,,,N,Y,9596.49,5044.76