Hospital Service Area,Hospital County,Operating Certificate Number,Permanent Facility Id,Facility Name,Age Group,Zip Code - 3 digits,Gender,Race,Ethnicity,Length of Stay,Type of Admission,Patient Disposition,Discharge Year,CCS Diagnosis Code,CCS Diagnosis Description,CCS Procedure Code,CCS Procedure Description,APR DRG Code,APR DRG Description,APR MDC Code,APR MDC Description,APR Severity of Illness Code,APR Severity of Illness Description,APR Risk of Mortality,APR Medical Surgical Description,Payment Typology 1,Payment Typology 2,Payment Typology 3,Birth Weight,Abortion Edit Indicator,Emergency Department Indicator,Total Charges,Total Costs
New York City,Manhattan,7002001,001438,Bellevue Hospital Center,30 to 49,100,M,White,Not Span/Hispanic,4,Emergency,Home or Self Care,2020,SYM002,FEVER,IMG009,PLAIN RADIOGRAPHY,722,FEVER & INFLAMMATORY CONDITIONS,18,INFECTIOUS AND PARASITIC DISEASES (SYSTEMIC OR UNSPECIFIED SITES),1,Minor,Minor,Medical,Medicaid,,,,,Y,27963.3,16081.25
New York City,Manhattan,7002001,001438,Bellevue Hospital Center,0 to 17,112,F,Black/African American,Not Span/Hispanic,1,Emergency,Home or Self Care,2020,SYM002,FEVER,ADM017,ADMINISTRATION OF NUTRITIONAL AND ELECTROLYTIC SUBSTANCES,722,FEVER & INFLAMMATORY CONDITIONS,18,INFECTIOUS AND PARASITIC DISEASES (SYSTEMIC OR UNSPECIFIED SITES),2,Moderate,Moderate,Medical,Medicaid,,,,,Y,9257.65,5323.93
New York City,Manhattan,7002001,001438,Bellevue Hospital Center,50 to 69,104,M,Other Race,Spanish/Hispanic,2,Emergency,Home or Self Care,2020,SYM002,FEVER,,,722,FEVER & INFLAMMATORY CONDITIONS,18,INFECTIOUS AND PARASITIC DISEASES (SYSTEMIC OR UNSPECIFIED SITES),1,Minor,Minor,Medical,Medicaid,,,,,Y,14839.25,8533.82
New York City,Manhattan,7002001,001438,Bellevue Hospital Center,50 to 69,113,F,Other Race,Unknown,1,Emergency,Home or Self Care,2020,SYM002,FEVER,IMG009,PLAIN RADIOGRAPHY,722,FEVER & INFLAMMATORY CONDITIONS,18,INFECTIOUS AND PARASITIC DISEASES (SYSTEMIC OR UNSPECIFIED SITES),1,Minor,Minor,Medical,Private Health Insurance,Medicare,,,,Y,8890.72,5112.91
New York City,Manhattan,7002001,001438,Bellevue Hospital Center,30 to 49,114,M,Black/African American,Not Span/Hispanic,3,Emergency,Home or Self Care,2020,SYM002,FEVER,IMG008,ULTRASONOGRAPHY,722,FEVER & INFLAMMATORY CONDITIONS,18,INFECTIOUS AND PARASITIC DISEASES (SYSTEMIC OR UNSPECIFIED SITES),2,Moderate,Major,Medical,Medicaid,,,,,Y,22896.38,13167.34
New York City,Manhattan,7002001,001438,Bellevue Hospital Center,30 to 49,112,M,Other Race,Spanish/Hispanic,1,Emergency,Home or Self Care,2020,SYM002,FEVER,IMG009,PLAIN RADIOGRAPHY,722,FEVER & INFLAMMATORY CONDITIONS,18,INFECTIOUS AND PARASITIC DISEASES (SYSTEMIC OR UNSPECIFIED SITES),1,Minor,Minor,Medical,Private Health Insurance,,,,,Y,8540.08,4911.26
New York City,Manhattan,7002001,001438,Bellevue Hospital Center,18 to 29,113,M,Black/African American,Not Span/Hispanic,1,Emergency,Left Against Medical Advice,2020,SYM002,FEVER,ADM021,"ADMINISTRATION OF THERAPEUTIC SUBSTANCES, NEC",722,FEVER & INFLAMMATORY CONDITIONS,18,INFECTIOUS AND PARASITIC DISEASES (SYSTEMIC OR UNSPECIFIED SITES),3,Major,Major,Medical,Medicaid,,,,,Y,8911.85,5125.06
New York City,Manhattan,7002001,001438,Bellevue Hospital Center,50 to 69,100,M,Black/African American,Not Span/Hispanic,2,Emergency,Home or Self Care,2020,SYM002,FEVER,,,722,FEVER & INFLAMMATORY CONDITIONS,18,INFECTIOUS AND PARASITIC DISEASES (SYSTEMIC OR UNSPECIFIED SITES),1,Minor,Minor,Medical,Medicaid,,,,,Y,14112.43,8115.83
New York City,Manhattan,7002001,001438,Bellevue Hospital Center,50 to 69,100,M,Other Race,Not Span/Hispanic,12,Emergency,Skilled Nursing Home,2020,SYM002,FEVER,ADM021,"ADMINISTRATION OF THERAPEUTIC SUBSTANCES, NEC",722,FEVER & INFLAMMATORY CONDITIONS,18,INFECTIOUS AND PARASITIC DISEASES (SYSTEMIC OR UNSPECIFIED SITES),3,Major,Major,Medical,Medicare,Medicaid,,,,Y,85245.46,49023.3
New York City,Manhattan,7002001,001438,Bellevue Hospital Center,30 to 49,104,M,Black/African American,Unknown,6,Urgent,Psychiatric Hospital or Unit of Hosp,2020,SYM002,FEVER,,,722,FEVER & INFLAMMATORY CONDITIONS,18,INFECTIOUS AND PARASITIC DISEASES (SYSTEMIC OR UNSPECIFIED SITES),3,Major,Moderate,Medical,Medicaid,,,,,N,38262.53,22004.17
New York City,Manhattan,7002001,001438,Bellevue Hospital Center,30 to 49,100,F,Other Race,Not Span/Hispanic,1,Emergency,Left Against Medical Advice,2020,SYM002,FEVER,ADM021,"ADMINISTRATION OF THERAPEUTIC SUBSTANCES, NEC",722,FEVER & INFLAMMATORY CONDITIONS,18,INFECTIOUS AND PARASITIC DISEASES (SYSTEMIC OR UNSPECIFIED SITES),1,Minor,Minor,Medical,Medicaid,,,,,Y,8191.54,4710.82
New York City,Manhattan,7002001,001438,Bellevue Hospital Center,30 to 49,112,M,Other Race,Spanish/Hispanic,1,Emergency,Home or Self Care,2020,SYM002,FEVER,ADM017,ADMINISTRATION OF NUTRITIONAL AND ELECTROLYTIC SUBSTANCES,722,FEVER & INFLAMMATORY CONDITIONS,18,INFECTIOUS AND PARASITIC DISEASES (SYSTEMIC OR UNSPECIFIED SITES),1,Minor,Minor,Medical,Medicaid,,,,,Y,8789.19,5054.52
New York City,Manhattan,7002001,001438,Bellevue Hospital Center,30 to 49,114,F,White,Unknown,1,Emergency,Psychiatric Hospital or Unit of Hosp,2020,SYM002,FEVER,ADM017,ADMINISTRATION OF NUTRITIONAL AND ELECTROLYTIC SUBSTANCES,722,FEVER & INFLAMMATORY CONDITIONS,18,INFECTIOUS AND PARASITIC DISEASES (SYSTEMIC OR UNSPECIFIED SITES),2,Moderate,Minor,Medical,Medicaid,,,,,Y,9951.27,5722.82
New York City,Manhattan,7002001,001438,Bellevue Hospital Center,30 to 49,104,M,Other Race,Not Span/Hispanic,3,Urgent,Short-term Hospital,2020,SYM002,FEVER,ADM014,REGIONAL ANESTHESIA,722,FEVER & INFLAMMATORY CONDITIONS,18,INFECTIOUS AND PARASITIC DISEASES (SYSTEMIC OR UNSPECIFIED SITES),2,Moderate,Moderate,Medical,Medicaid,,,,,N,26748.15,15382.43
New York City,Manhattan,7002001,001438,Bellevue Hospital Center,30 to 49,112,M,White,Not Span/Hispanic,1,Emergency,Home or Self Care,2020,SYM002,FEVER,ADM015,ADMINISTRATION OF ANTIBIOTICS,722,FEVER & INFLAMMATORY CONDITIONS,18,INFECTIOUS AND PARASITIC DISEASES (SYSTEMIC OR UNSPECIFIED SITES),1,Minor,Minor,Medical,Private Health Insurance,,,,,Y,9001.69,5176.73
New York City,Manhattan,7002001,001438,Bellevue Hospital Center,0 to 17,112,M,Other Race,Not Span/Hispanic,2,Urgent,Home or Self Care,2020,SYM002,FEVER,,,722,FEVER & INFLAMMATORY CONDITIONS,18,INFECTIOUS AND PARASITIC DISEASES (SYSTEMIC OR UNSPECIFIED SITES),2,Moderate,Minor,Medical,Medicaid,,,,,N,13749.01,7906.84
New York City,Manhattan,7002001,001438,Bellevue Hospital Center,50 to 69,113,M,White,Not Span/Hispanic,2,Emergency,Court/Law Enforcement,2020,SYM002,FEVER,ADM021,"ADMINISTRATION OF THERAPEUTIC SUBSTANCES, NEC",722,FEVER & INFLAMMATORY CONDITIONS,18,INFECTIOUS AND PARASITIC DISEASES (SYSTEMIC OR UNSPECIFIED SITES),1,Minor,Minor,Medical,Medicaid,,,,,Y,17185.83,9883.3
New York City,Manhattan,7002001,001438,Bellevue Hospital Center,50 to 69,100,M,Black/African American,Not Span/Hispanic,1,Emergency,Home or Self Care,2020,SYM002,FEVER,ADM015,ADMINISTRATION OF ANTIBIOTICS,722,FEVER & INFLAMMATORY CONDITIONS,18,INFECTIOUS AND PARASITIC DISEASES (SYSTEMIC OR UNSPECIFIED SITES),1,Minor,Minor,Medical,Medicaid,,,,,Y,15387.45,8849.08
New York City,Manhattan,7002001,001438,Bellevue Hospital Center,70 or Older,111,F,Other Race,Not Span/Hispanic,4,Urgent,Psychiatric Hospital or Unit of Hosp,2020,INJ030,DRUG INDUCED OR TOXIC RELATED CONDITION,,,722,FEVER & INFLAMMATORY CONDITIONS,18,INFECTIOUS AND PARASITIC DISEASES (SYSTEMIC OR UNSPECIFIED SITES),2,Moderate,Moderate,Medical,Medicare,Medicaid,,,,N,24930.81,14337.31
New York City,Manhattan,7002001,001438,Bellevue Hospital Center,30 to 49,104,M,Black/African American,Not Span/Hispanic,6,Emergency,Left Against Medical Advice,2020,SYM002,FEVER,ESA001,HEMODIALYSIS,722,FEVER & INFLAMMATORY CONDITIONS,18,INFECTIOUS AND PARASITIC DISEASES (SYSTEMIC OR UNSPECIFIED SITES),3,Major,Moderate,Medical,Medicaid,,,,,Y,41879.38,24084.16
New York City,Manhattan,7002001,001438,Bellevue Hospital Center,50 to 69,100,F,Black/African American,Not Span/Hispanic,8,Urgent,Home w/ Home Health Services,2020,SYM002,FEVER,CNS002,LUMBAR PUNCTURE,722,FEVER & INFLAMMATORY CONDITIONS,18,INFECTIOUS AND PARASITIC DISEASES (SYSTEMIC OR UNSPECIFIED SITES),2,Moderate,Moderate,Medical,Private Health Insurance,,,,,N,76890.25,44218.35
New York City,Manhattan,7002001,001438,Bellevue Hospital Center,70 or Older,100,M,Other Race,Spanish/Hispanic,33,Emergency,Home or Self Care,2020,SYM002,FEVER,IMG007,COMPUTERIZED TOMOGRAPHY (CT) WITHOUT CONTRAST,722,FEVER & INFLAMMATORY CONDITIONS,18,INFECTIOUS AND PARASITIC DISEASES (SYSTEMIC OR UNSPECIFIED SITES),3,Major,Moderate,Medical,Medicare,,,,,Y,263448.62,151505.09
