Hospital Service Area,Hospital County,Operating Certificate Number,Permanent Facility Id,Facility Name,Age Group,Zip Code - 3 digits,Gender,Race,Ethnicity,Length of Stay,Type of Admission,Patient Disposition,Discharge Year,CCS Diagnosis Code,CCS Diagnosis Description,CCS Procedure Code,CCS Procedure Description,APR DRG Code,APR DRG Description,APR MDC Code,APR MDC Description,APR Severity of Illness Code,APR Severity of Illness Description,APR Risk of Mortality,APR Medical Surgical Description,Payment Typology 1,Payment Typology 2,Payment Typology 3,Birth Weight,Abortion Edit Indicator,Emergency Department Indicator,Total Charges,Total Costs
New York City,Kings,7002053,001304,NYU Langone Hospital-Brooklyn,18 to 29,112,M,Other Race,Not Span/Hispanic,4,Emergency,Left Against Medical Advice,2019,INF008,VIRAL INFECTION,CNS002,LUMBAR PUNCTURE,723,VIRAL ILLNESS,18,INFECTIOUS AND PARASITIC DISEASES (SYSTEMIC OR UNSPECIFIED SITES),1,Minor,Minor,Medical,Medicaid,,,,,true,57396.93,16304.84
New York City,Kings,7002053,001304,NYU Langone Hospital-Brooklyn,70 or Older,112,F,Black/African American,Not Span/Hispanic,6,Emergency,Skilled Nursing Home,2019,INF008,VIRAL INFECTION,,,723,VIRAL ILLNESS,18,INFECTIOUS AND PARASITIC DISEASES (SYSTEMIC OR UNSPECIFIED SITES),3,Major,Major,Medical,Medicare,Medicaid,,,,true,53597.45,21282.42
New York City,Kings,7002053,001304,NYU Langone Hospital-Brooklyn,18 to 29,112,M,White,Not Span/Hispanic,3,Emergency,Home or Self Care,2019,INF008,VIRAL INFECTION,,,723,VIRAL ILLNESS,18,INFECTIOUS AND PARASITIC DISEASES (SYSTEMIC OR UNSPECIFIED SITES),1,Minor,Minor,Medical,Blue Cross/Blue Shield,,,,,true,72092.77,23566.49
New York City,Kings,7002053,001304,NYU Langone Hospital-Brooklyn,30 to 49,112,M,Other Race,Spanish/Hispanic,4,Emergency,Home or Self Care,2019,INF008,VIRAL INFECTION,IMG008,ULTRASONOGRAPHY,723,VIRAL ILLNESS,18,INFECTIOUS AND PARASITIC DISEASES (SYSTEMIC OR UNSPECIFIED SITES),2,Moderate,Moderate,Medical,Medicaid,,,,,true,46459.8,15524.49
New York City,Kings,7002053,001304,NYU Langone Hospital-Brooklyn,0 to 17,112,F,Other Race,Not Span/Hispanic,5,Emergency,Home or Self Care,2019,INF008,VIRAL INFECTION,,,723,VIRAL ILLNESS,18,INFECTIOUS AND PARASITIC DISEASES (SYSTEMIC OR UNSPECIFIED SITES),3,Major,Minor,Medical,Medicaid,,,,,true,59647.51,15010.4
New York City,Kings,7002053,001304,NYU Langone Hospital-Brooklyn,50 to 69,112,M,Other Race,Spanish/Hispanic,5,Emergency,Home or Self Care,2019,INF008,VIRAL INFECTION,OTR004,ISOLATION PROCEDURES,723,VIRAL ILLNESS,18,INFECTIOUS AND PARASITIC DISEASES (SYSTEMIC OR UNSPECIFIED SITES),2,Moderate,Minor,Medical,Medicaid,,,,,true,42111.77,17149.14
New York City,Kings,7002053,001304,NYU Langone Hospital-Brooklyn,0 to 17,112,M,White,Not Span/Hispanic,2,Emergency,Home or Self Care,2019,INF008,VIRAL INFECTION,CNS002,LUMBAR PUNCTURE,723,VIRAL ILLNESS,18,INFECTIOUS AND PARASITIC DISEASES (SYSTEMIC OR UNSPECIFIED SITES),1,Minor,Minor,Medical,Medicaid,,,,,true,23746.29,6818.11
New York City,Kings,7002053,001304,NYU Langone Hospital-Brooklyn,50 to 69,112,F,Other Race,Not Span/Hispanic,6,Emergency,Home or Self Care,2019,DIG003,DISEASES OF MOUTH; EXCLUDING DENTAL,ADM015,ADMINISTRATION OF ANTIBIOTICS,723,VIRAL ILLNESS,18,INFECTIOUS AND PARASITIC DISEASES (SYSTEMIC OR UNSPECIFIED SITES),2,Moderate,Minor,Medical,Medicaid,,,,,true,65674.2,22608.7
New York City,Kings,7002053,001304,NYU Langone Hospital-Brooklyn,18 to 29,112,M,White,Spanish/Hispanic,3,Emergency,Home or Self Care,2019,INF008,VIRAL INFECTION,ENT001,LARYNGOSCOPY (DIAGNOSTIC),723,VIRAL ILLNESS,18,INFECTIOUS AND PARASITIC DISEASES (SYSTEMIC OR UNSPECIFIED SITES),2,Moderate,Minor,Medical,Medicaid,,,,,true,40519.34,12105.66
New York City,Kings,7002053,001304,NYU Langone Hospital-Brooklyn,0 to 17,112,F,White,Not Span/Hispanic,2,Emergency,Home or Self Care,2019,INF008,VIRAL INFECTION,CNS002,LUMBAR PUNCTURE,723,VIRAL ILLNESS,18,INFECTIOUS AND PARASITIC DISEASES (SYSTEMIC OR UNSPECIFIED SITES),1,Minor,Minor,Medical,Medicaid,,,,,true,23510.62,6527.96
New York City,Kings,7002053,001304,NYU Langone Hospital-Brooklyn,50 to 69,112,F,Other Race,Not Span/Hispanic,4,Emergency,Home or Self Care,2019,INF008,VIRAL INFECTION,ADM015,ADMINISTRATION OF ANTIBIOTICS,723,VIRAL ILLNESS,18,INFECTIOUS AND PARASITIC DISEASES (SYSTEMIC OR UNSPECIFIED SITES),3,Major,Minor,Medical,Medicaid,,,,,true,64532.13,16032.55
New York City,Kings,7002053,001304,NYU Langone Hospital-Brooklyn,70 or Older,112,F,Other Race,Unknown,1,Emergency,Home or Self Care,2019,INJ037,"COMPLICATION OF OTHER SURGICAL OR MEDICAL CARE, INJURY, INITIAL ENCOUNTER",,,723,VIRAL ILLNESS,18,INFECTIOUS AND PARASITIC DISEASES (SYSTEMIC OR UNSPECIFIED SITES),2,Moderate,Moderate,Medical,Medicaid,,,,,true,18643.9,4847.19
New York City,Kings,7002053,001304,NYU Langone Hospital-Brooklyn,50 to 69,112,F,White,Not Span/Hispanic,3,Emergency,Home or Self Care,2019,INF008,VIRAL INFECTION,,,723,VIRAL ILLNESS,18,INFECTIOUS AND PARASITIC DISEASES (SYSTEMIC OR UNSPECIFIED SITES),2,Moderate,Moderate,Medical,Medicaid,,,,,true,51650.91,13582.38
New York City,Kings,7002053,001304,NYU Langone Hospital-Brooklyn,50 to 69,112,M,Other Race,Not Span/Hispanic,1,Emergency,Home or Self Care,2019,INF008,VIRAL INFECTION,OTR004,ISOLATION PROCEDURES,723,VIRAL ILLNESS,18,INFECTIOUS AND PARASITIC DISEASES (SYSTEMIC OR UNSPECIFIED SITES),2,Moderate,Minor,Medical,Medicare,Medicaid,,,,true,22619.06,5466.57
New York City,Kings,7002053,001304,NYU Langone Hospital-Brooklyn,50 to 69,112,M,Other Race,Not Span/Hispanic,3,Emergency,Home or Self Care,2019,INF008,VIRAL INFECTION,,,723,VIRAL ILLNESS,18,INFECTIOUS AND PARASITIC DISEASES (SYSTEMIC OR UNSPECIFIED SITES),2,Moderate,Minor,Medical,Private Health Insurance,,,,,true,54903.48,14368.32
New York City,Kings,7002053,001304,NYU Langone Hospital-Brooklyn,70 or Older,112,F,White,Not Span/Hispanic,18,Emergency,Skilled Nursing Home,2019,RSP003,INFLUENZA,OTR004,ISOLATION PROCEDURES,723,VIRAL ILLNESS,18,INFECTIOUS AND PARASITIC DISEASES (SYSTEMIC OR UNSPECIFIED SITES),3,Major,Major,Medical,Medicare,Medicare,,,,true,158011.32,62281.9
New York City,Kings,7002053,001304,NYU Langone Hospital-Brooklyn,30 to 49,112,F,White,Not Span/Hispanic,4,Emergency,Home or Self Care,2019,INF008,VIRAL INFECTION,OTR004,ISOLATION PROCEDURES,723,VIRAL ILLNESS,18,INFECTIOUS AND PARASITIC DISEASES (SYSTEMIC OR UNSPECIFIED SITES),2,Moderate,Minor,Medical,Medicaid,,,,,true,76677.81,15369.27
New York City,Kings,7002053,001304,NYU Langone Hospital-Brooklyn,70 or Older,112,F,White,Not Span/Hispanic,1,Emergency,Home or Self Care,2019,INF008,VIRAL INFECTION,,,723,VIRAL ILLNESS,18,INFECTIOUS AND PARASITIC DISEASES (SYSTEMIC OR UNSPECIFIED SITES),3,Major,Moderate,Medical,Medicare,Medicaid,,,,true,36475.42,13117.84
New York City,Kings,7002053,001304,NYU Langone Hospital-Brooklyn,0 to 17,,F,Other Race,Spanish/Hispanic,2,Emergency,Home or Self Care,2019,INF008,VIRAL INFECTION,,,723,VIRAL ILLNESS,18,INFECTIOUS AND PARASITIC DISEASES (SYSTEMIC OR UNSPECIFIED SITES),2,Moderate,Minor,Medical,Medicaid,,,,,true,26719.63,7190.21
New York City,Kings,7002053,001304,NYU Langone Hospital-Brooklyn,18 to 29,112,F,Other Race,Spanish/Hispanic,1,Emergency,Home or Self Care,2019,INF008,VIRAL INFECTION,,,723,VIRAL ILLNESS,18,INFECTIOUS AND PARASITIC DISEASES (SYSTEMIC OR UNSPECIFIED SITES),1,Minor,Minor,Medical,Medicaid,,,,,true,12238.97,4118.65
New York City,Kings,7002053,001304,NYU Langone Hospital-Brooklyn,30 to 49,112,F,Other Race,Spanish/Hispanic,4,Emergency,Home or Self Care,2019,INF008,VIRAL INFECTION,OTR004,ISOLATION PROCEDURES,723,VIRAL ILLNESS,18,INFECTIOUS AND PARASITIC DISEASES (SYSTEMIC OR UNSPECIFIED SITES),3,Major,Minor,Medical,Medicaid,,,,,true,34043.53,13628.13
New York City,Kings,7002053,001304,NYU Langone Hospital-Brooklyn,0 to 17,112,F,Other Race,Unknown,1,Emergency,Home or Self Care,2019,INF008,VIRAL INFECTION,OTR004,ISOLATION PROCEDURES,723,VIRAL ILLNESS,18,INFECTIOUS AND PARASITIC DISEASES (SYSTEMIC OR UNSPECIFIED SITES),1,Minor,Minor,Medical,Medicaid,,,,,true,16007.15,4091.12
New York City,Kings,7002053,001304,NYU Langone Hospital-Brooklyn,50 to 69,112,F,Other Race,Spanish/Hispanic,3,Emergency,Home or Self Care,2019,INF008,VIRAL INFECTION,OTR004,ISOLATION PROCEDURES,723,VIRAL ILLNESS,18,INFECTIOUS AND PARASITIC DISEASES (SYSTEMIC OR UNSPECIFIED SITES),2,Moderate,Minor,Medical,Medicare,,,,,true,34494.34,11283.58
New York City,Kings,7002053,001304,NYU Langone Hospital-Brooklyn,18 to 29,112,M,Black/African American,Spanish/Hispanic,4,Emergency,Home or Self Care,2019,INF008,VIRAL INFECTION,OTR004,ISOLATION PROCEDURES,723,VIRAL ILLNESS,18,INFECTIOUS AND PARASITIC DISEASES (SYSTEMIC OR UNSPECIFIED SITES),3,Major,Moderate,Medical,Medicaid,,,,,true,44982.13,14842.18
New York City,Kings,7002053,001304,NYU Langone Hospital-Brooklyn,0 to 17,112,M,Other Race,Spanish/Hispanic,2,Emergency,Home or Self Care,2019,INF008,VIRAL INFECTION,CNS002,LUMBAR PUNCTURE,723,VIRAL ILLNESS,18,INFECTIOUS AND PARASITIC DISEASES (SYSTEMIC OR UNSPECIFIED SITES),1,Minor,Minor,Medical,Medicaid,,,,,true,30928.69,7300.69
New York City,Kings,7002053,001304,NYU Langone Hospital-Brooklyn,18 to 29,112,M,Other Race,Not Span/Hispanic,2,Emergency,Home or Self Care,2019,INF008,VIRAL INFECTION,,,723,VIRAL ILLNESS,18,INFECTIOUS AND PARASITIC DISEASES (SYSTEMIC OR UNSPECIFIED SITES),1,Minor,Minor,Medical,Blue Cross/Blue Shield,,,,,true,29286.45,8489.2
New York City,Kings,7002053,001304,NYU Langone Hospital-Brooklyn,0 to 17,112,M,White,Spanish/Hispanic,1,Emergency,Home or Self Care,2019,INF008,VIRAL INFECTION,,,723,VIRAL ILLNESS,18,INFECTIOUS AND PARASITIC DISEASES (SYSTEMIC OR UNSPECIFIED SITES),2,Moderate,Minor,Medical,Medicaid,,,,,true,11483.43,3515.29
New York City,Kings,7002053,001304,NYU Langone Hospital-Brooklyn,0 to 17,112,F,Other Race,Not Span/Hispanic,2,Emergency,Home or Self Care,2019,INF008,VIRAL INFECTION,ADM015,ADMINISTRATION OF ANTIBIOTICS,723,VIRAL ILLNESS,18,INFECTIOUS AND PARASITIC DISEASES (SYSTEMIC OR UNSPECIFIED SITES),1,Minor,Minor,Medical,Medicaid,,,02500,,true,23519.02,6457.03
New York City,Kings,7002053,001304,NYU Langone Hospital-Brooklyn,18 to 29,OOS,F,White,Not Span/Hispanic,3,Emergency,Home or Self Care,2019,INF008,VIRAL INFECTION,,,723,VIRAL ILLNESS,18,INFECTIOUS AND PARASITIC DISEASES (SYSTEMIC OR UNSPECIFIED SITES),3,Major,Major,Medical,Blue Cross/Blue Shield,,,,,true,45862.5,13076.23
New York City,Kings,7002053,001304,NYU Langone Hospital-Brooklyn,18 to 29,112,M,White,Not Span/Hispanic,3,Emergency,Home or Self Care,2019,INF008,VIRAL INFECTION,OTR004,ISOLATION PROCEDURES,723,VIRAL ILLNESS,18,INFECTIOUS AND PARASITIC DISEASES (SYSTEMIC OR UNSPECIFIED SITES),2,Moderate,Minor,Medical,Private Health Insurance,,,,,true,35700.29,11283.15
New York City,Kings,7002053,001304,NYU Langone Hospital-Brooklyn,50 to 69,112,M,Other Race,Not Span/Hispanic,2,Emergency,Home or Self Care,2019,INF008,VIRAL INFECTION,OTR004,ISOLATION PROCEDURES,723,VIRAL ILLNESS,18,INFECTIOUS AND PARASITIC DISEASES (SYSTEMIC OR UNSPECIFIED SITES),3,Major,Moderate,Medical,Medicare,,,,,true,28124.92,8357.23
New York City,Kings,7002053,001304,NYU Langone Hospital-Brooklyn,0 to 17,112,F,Other Race,Spanish/Hispanic,2,Emergency,Home or Self Care,2019,INF008,VIRAL INFECTION,CNS002,LUMBAR PUNCTURE,723,VIRAL ILLNESS,18,INFECTIOUS AND PARASITIC DISEASES (SYSTEMIC OR UNSPECIFIED SITES),2,Moderate,Minor,Medical,Medicaid,,,,,true,22143.93,6651.06
New York City,Kings,7002053,001304,NYU Langone Hospital-Brooklyn,30 to 49,112,F,White,Not Span/Hispanic,1,Emergency,Home or Self Care,2019,INF008,VIRAL INFECTION,,,723,VIRAL ILLNESS,18,INFECTIOUS AND PARASITIC DISEASES (SYSTEMIC OR UNSPECIFIED SITES),2,Moderate,Minor,Medical,Private Health Insurance,,,,,true,34250.33,7270.03
New York City,Kings,7002053,001304,NYU Langone Hospital-Brooklyn,0 to 17,112,M,Other Race,Not Span/Hispanic,1,Emergency,Home or Self Care,2019,INF008,VIRAL INFECTION,,,723,VIRAL ILLNESS,18,INFECTIOUS AND PARASITIC DISEASES (SYSTEMIC OR UNSPECIFIED SITES),1,Minor,Minor,Medical,Medicaid,,,,,true,15407.01,4300.41
New York City,Kings,7002053,001304,NYU Langone Hospital-Brooklyn,70 or Older,112,F,White,Spanish/Hispanic,3,Emergency,Home w/ Home Health Services,2019,INF008,VIRAL INFECTION,CNS002,LUMBAR PUNCTURE,723,VIRAL ILLNESS,18,INFECTIOUS AND PARASITIC DISEASES (SYSTEMIC OR UNSPECIFIED SITES),2,Moderate,Moderate,Medical,Medicare,,,,,true,54935.49,12866.72
New York City,Kings,7002053,001304,NYU Langone Hospital-Brooklyn,0 to 17,112,F,Other Race,Not Span/Hispanic,2,Emergency,Home or Self Care,2019,INF008,VIRAL INFECTION,ADM015,ADMINISTRATION OF ANTIBIOTICS,723,VIRAL ILLNESS,18,INFECTIOUS AND PARASITIC DISEASES (SYSTEMIC OR UNSPECIFIED SITES),2,Moderate,Moderate,Medical,Medicaid,,,,,true,28785.66,8046.62
New York City,Kings,7002053,001304,NYU Langone Hospital-Brooklyn,70 or Older,112,F,White,Not Span/Hispanic,3,Emergency,Home w/ Home Health Services,2019,INF008,VIRAL INFECTION,,,723,VIRAL ILLNESS,18,INFECTIOUS AND PARASITIC DISEASES (SYSTEMIC OR UNSPECIFIED SITES),3,Major,Moderate,Medical,Medicare,,,,,true,36199.52,12257.53
New York City,Kings,7002053,001304,NYU Langone Hospital-Brooklyn,18 to 29,,F,White,Spanish/Hispanic,4,Emergency,Home or Self Care,2019,INF008,VIRAL INFECTION,ADM010,VACCINATIONS,723,VIRAL ILLNESS,18,INFECTIOUS AND PARASITIC DISEASES (SYSTEMIC OR UNSPECIFIED SITES),3,Major,Moderate,Medical,Blue Cross/Blue Shield,,,,,true,75129.26,19040.89
New York City,Kings,7002053,001304,NYU Langone Hospital-Brooklyn,18 to 29,112,M,Other Race,Spanish/Hispanic,3,Emergency,Home or Self Care,2019,INF008,VIRAL INFECTION,OTR004,ISOLATION PROCEDURES,723,VIRAL ILLNESS,18,INFECTIOUS AND PARASITIC DISEASES (SYSTEMIC OR UNSPECIFIED SITES),2,Moderate,Minor,Medical,Medicaid,,,,,true,35792.15,11277.85
New York City,Kings,7002053,001304,NYU Langone Hospital-Brooklyn,0 to 17,112,F,White,Not Span/Hispanic,1,Emergency,Home or Self Care,2019,INF008,VIRAL INFECTION,OTR004,ISOLATION PROCEDURES,723,VIRAL ILLNESS,18,INFECTIOUS AND PARASITIC DISEASES (SYSTEMIC OR UNSPECIFIED SITES),2,Moderate,Minor,Medical,Medicaid,,,,,true,36927.67,4445.07
New York City,Kings,7002053,001304,NYU Langone Hospital-Brooklyn,0 to 17,112,F,White,Spanish/Hispanic,2,Emergency,Home or Self Care,2019,DIG003,DISEASES OF MOUTH; EXCLUDING DENTAL,,,723,VIRAL ILLNESS,18,INFECTIOUS AND PARASITIC DISEASES (SYSTEMIC OR UNSPECIFIED SITES),1,Minor,Minor,Medical,Medicaid,,,,,true,17682.68,6064.03
New York City,Kings,7002053,001304,NYU Langone Hospital-Brooklyn,0 to 17,112,F,Other Race,Not Span/Hispanic,2,Emergency,Home or Self Care,2019,INF008,VIRAL INFECTION,OTR004,ISOLATION PROCEDURES,723,VIRAL ILLNESS,18,INFECTIOUS AND PARASITIC DISEASES (SYSTEMIC OR UNSPECIFIED SITES),1,Minor,Minor,Medical,Medicaid,,,,,true,22045.09,6556.86
New York City,Kings,7002053,001304,NYU Langone Hospital-Brooklyn,50 to 69,112,F,Other Race,Spanish/Hispanic,1,Emergency,Home or Self Care,2019,INF008,VIRAL INFECTION,,,723,VIRAL ILLNESS,18,INFECTIOUS AND PARASITIC DISEASES (SYSTEMIC OR UNSPECIFIED SITES),1,Minor,Minor,Medical,Medicaid,,,,,true,11282.87,4047.5
New York City,Kings,7002053,001304,NYU Langone Hospital-Brooklyn,30 to 49,112,M,Multi-racial,Not Span/Hispanic,3,Emergency,Home or Self Care,2019,INF008,VIRAL INFECTION,,,723,VIRAL ILLNESS,18,INFECTIOUS AND PARASITIC DISEASES (SYSTEMIC OR UNSPECIFIED SITES),2,Moderate,Minor,Medical,Blue Cross/Blue Shield,,,,,true,48344.03,13193.84
New York City,Kings,7002053,001304,NYU Langone Hospital-Brooklyn,18 to 29,116,M,Other Race,Not Span/Hispanic,2,Emergency,Home or Self Care,2019,INF008,VIRAL INFECTION,,,723,VIRAL ILLNESS,18,INFECTIOUS AND PARASITIC DISEASES (SYSTEMIC OR UNSPECIFIED SITES),1,Minor,Minor,Medical,Blue Cross/Blue Shield,,,,,true,39999.08,13620.57
New York City,Kings,7002053,001304,NYU Langone Hospital-Brooklyn,70 or Older,112,F,Other Race,Not Span/Hispanic,4,Emergency,Home w/ Home Health Services,2019,INF008,VIRAL INFECTION,,,723,VIRAL ILLNESS,18,INFECTIOUS AND PARASITIC DISEASES (SYSTEMIC OR UNSPECIFIED SITES),2,Moderate,Moderate,Medical,Medicare,Medicaid,,,,true,38700.9,14320.76
New York City,Kings,7002053,001304,NYU Langone Hospital-Brooklyn,30 to 49,112,F,Other Race,Spanish/Hispanic,1,Emergency,Home or Self Care,2019,INF008,VIRAL INFECTION,ADM021,"ADMINISTRATION OF THERAPEUTIC SUBSTANCES, NEC",723,VIRAL ILLNESS,18,INFECTIOUS AND PARASITIC DISEASES (SYSTEMIC OR UNSPECIFIED SITES),1,Minor,Minor,Medical,Private Health Insurance,,,,,true,26649.05,9272.18
New York City,Kings,7002053,001304,NYU Langone Hospital-Brooklyn,0 to 17,112,F,White,Not Span/Hispanic,2,Emergency,Home or Self Care,2019,INF008,VIRAL INFECTION,,,723,VIRAL ILLNESS,18,INFECTIOUS AND PARASITIC DISEASES (SYSTEMIC OR UNSPECIFIED SITES),2,Moderate,Minor,Medical,Private Health Insurance,,,,,true,21007.08,6555.36
New York City,Kings,7002053,001304,NYU Langone Hospital-Brooklyn,30 to 49,112,F,Black/African American,Not Span/Hispanic,2,Emergency,Home or Self Care,2019,INF008,VIRAL INFECTION,ENT006,ENT DRAINAGE (EXCLUDING MYRINGOTOMY),723,VIRAL ILLNESS,18,INFECTIOUS AND PARASITIC DISEASES (SYSTEMIC OR UNSPECIFIED SITES),2,Moderate,Minor,Medical,Private Health Insurance,,,,,true,33465.35,9641.54
New York City,Kings,7002053,001304,NYU Langone Hospital-Brooklyn,18 to 29,112,F,White,Spanish/Hispanic,1,Emergency,Home or Self Care,2019,INF008,VIRAL INFECTION,IMG008,ULTRASONOGRAPHY,723,VIRAL ILLNESS,18,INFECTIOUS AND PARASITIC DISEASES (SYSTEMIC OR UNSPECIFIED SITES),2,Moderate,Minor,Medical,Blue Cross/Blue Shield,,,,,true,30542.88,9698.43
New York City,Kings,7002053,001304,NYU Langone Hospital-Brooklyn,50 to 69,112,F,White,Not Span/Hispanic,2,Emergency,Home or Self Care,2019,INF008,VIRAL INFECTION,,,723,VIRAL ILLNESS,18,INFECTIOUS AND PARASITIC DISEASES (SYSTEMIC OR UNSPECIFIED SITES),1,Minor,Minor,Medical,Private Health Insurance,,,,,true,42892.3,10802.52
New York City,Kings,7002053,001304,NYU Langone Hospital-Brooklyn,0 to 17,112,M,Other Race,Not Span/Hispanic,2,Emergency,Home or Self Care,2019,INF008,VIRAL INFECTION,,,723,VIRAL ILLNESS,18,INFECTIOUS AND PARASITIC DISEASES (SYSTEMIC OR UNSPECIFIED SITES),1,Minor,Minor,Medical,Medicaid,,,,,true,22279.12,6536.92
New York City,Kings,7002053,001304,NYU Langone Hospital-Brooklyn,50 to 69,112,M,Other Race,Spanish/Hispanic,1,Emergency,Home or Self Care,2019,RSP003,INFLUENZA,,,723,VIRAL ILLNESS,18,INFECTIOUS AND PARASITIC DISEASES (SYSTEMIC OR UNSPECIFIED SITES),1,Minor,Minor,Medical,Medicaid,,,,,true,20497.29,5157.62
New York City,Kings,7002053,001304,NYU Langone Hospital-Brooklyn,30 to 49,112,F,Other Race,Spanish/Hispanic,3,Emergency,Home or Self Care,2019,INF008,VIRAL INFECTION,ENT003,ENT DIAGNOSTIC PROCEDURES (NON-ENDOSCOPIC),723,VIRAL ILLNESS,18,INFECTIOUS AND PARASITIC DISEASES (SYSTEMIC OR UNSPECIFIED SITES),1,Minor,Minor,Medical,Medicaid,,,,,true,33287.17,11623.04
New York City,Kings,7002053,001304,NYU Langone Hospital-Brooklyn,30 to 49,112,F,Other Race,Not Span/Hispanic,1,Emergency,Home or Self Care,2019,INF008,VIRAL INFECTION,ADM015,ADMINISTRATION OF ANTIBIOTICS,723,VIRAL ILLNESS,18,INFECTIOUS AND PARASITIC DISEASES (SYSTEMIC OR UNSPECIFIED SITES),1,Minor,Minor,Medical,Medicaid,,,,,true,62329.22,18858.89
New York City,Kings,7002053,001304,NYU Langone Hospital-Brooklyn,0 to 17,112,F,Other Race,Not Span/Hispanic,2,Emergency,Home or Self Care,2019,INF008,VIRAL INFECTION,,,723,VIRAL ILLNESS,18,INFECTIOUS AND PARASITIC DISEASES (SYSTEMIC OR UNSPECIFIED SITES),1,Minor,Minor,Medical,Medicaid,,,,,true,22181.36,6670.85
New York City,Kings,7002053,001304,NYU Langone Hospital-Brooklyn,0 to 17,112,F,Other Race,Spanish/Hispanic,3,Emergency,Home or Self Care,2019,INF008,VIRAL INFECTION,CNS002,LUMBAR PUNCTURE,723,VIRAL ILLNESS,18,INFECTIOUS AND PARASITIC DISEASES (SYSTEMIC OR UNSPECIFIED SITES),1,Minor,Minor,Medical,Medicaid,,,,,true,32466.03,9687.88
New York City,Kings,7002053,001304,NYU Langone Hospital-Brooklyn,30 to 49,112,F,White,Not Span/Hispanic,6,Emergency,Home or Self Care,2019,INF008,VIRAL INFECTION,,,723,VIRAL ILLNESS,18,INFECTIOUS AND PARASITIC DISEASES (SYSTEMIC OR UNSPECIFIED SITES),2,Moderate,Minor,Medical,Medicaid,,,,,true,104719.75,26912.17
New York City,Kings,7002053,001304,NYU Langone Hospital-Brooklyn,0 to 17,112,F,Other Race,Spanish/Hispanic,1,Emergency,Home or Self Care,2019,INF008,VIRAL INFECTION,OTR004,ISOLATION PROCEDURES,723,VIRAL ILLNESS,18,INFECTIOUS AND PARASITIC DISEASES (SYSTEMIC OR UNSPECIFIED SITES),1,Minor,Minor,Medical,Medicaid,,,,,true,22932.62,4933.87
New York City,Kings,7002053,001304,NYU Langone Hospital-Brooklyn,18 to 29,112,F,White,Not Span/Hispanic,3,Emergency,Home or Self Care,2019,INF008,VIRAL INFECTION,,,723,VIRAL ILLNESS,18,INFECTIOUS AND PARASITIC DISEASES (SYSTEMIC OR UNSPECIFIED SITES),1,Minor,Minor,Medical,Medicaid,,,,,true,41772.97,12221.65
