Hospital Service Area,Hospital County,Operating Certificate Number,Permanent Facility Id,Facility Name,Age Group,Zip Code - 3 digits,Gender,Race,Ethnicity,Length of Stay,Type of Admission,Patient Disposition,Discharge Year,CCS Diagnosis Code,CCS Diagnosis Description,CCS Procedure Code,CCS Procedure Description,APR DRG Code,APR DRG Description,APR MDC Code,APR MDC Description,APR Severity of Illness Code,APR Severity of Illness Description,APR Risk of Mortality,APR Medical Surgical Description,Payment Typology 1,Payment Typology 2,Payment Typology 3,Birth Weight,Abortion Edit Indicator,Emergency Department Indicator,Total Charges,Total Costs
New York City,Manhattan,7002053,001463,NYU Langone Hospitals,18 to 29,112,M,Other Race,Spanish/Hispanic,8,Emergency,Home or Self Care,2017,009,Sexually transmitted infections (not HIV or hepatitis),173,OT DX PRC SKIN/SUBCUTAN,724,Other infectious & parasitic diseases,18,"Infectious and Parasitic Diseases, Systemic or Unspecified Sites",1,Minor,Minor,Medical,Blue Cross/Blue Shield,,,,N,Y,89878.35,33873.53
New York City,Manhattan,7002053,001463,NYU Langone Hospitals,50 to 69,114,M,Other Race,Not Span/Hispanic,1,Urgent,Home or Self Care,2017,004,Mycoses,170,EXCISION OF SKIN LESION,724,Other infectious & parasitic diseases,18,"Infectious and Parasitic Diseases, Systemic or Unspecified Sites",3,Major,Moderate,Medical,Private Health Insurance,,,,N,N,16693.52,7848.93
New York City,Manhattan,7002053,001463,NYU Langone Hospitals,0 to 17,112,F,Other Race,Not Span/Hispanic,6,Emergency,Home or Self Care,2017,001,Tuberculosis,221,NASOGASTRIC TUBE,724,Other infectious & parasitic diseases,18,"Infectious and Parasitic Diseases, Systemic or Unspecified Sites",2,Moderate,Minor,Medical,Private Health Insurance,,,,N,Y,79788.19,25718.69
New York City,Manhattan,7002053,001463,NYU Langone Hospitals,70 or Older,100,M,White,Not Span/Hispanic,3,Emergency,Home w/ Home Health Services,2017,003,Bacterial infection; unspecified site,054,OT VASC CATH; NOT HEART,724,Other infectious & parasitic diseases,18,"Infectious and Parasitic Diseases, Systemic or Unspecified Sites",1,Minor,Moderate,Medical,Private Health Insurance,,,,N,Y,46522.16,16951.32
New York City,Manhattan,7002053,001463,NYU Langone Hospitals,50 to 69,100,M,White,Not Span/Hispanic,10,Emergency,Home or Self Care,2017,004,Mycoses,004,DIAGNOSTIC SPINAL TAP,724,Other infectious & parasitic diseases,18,"Infectious and Parasitic Diseases, Systemic or Unspecified Sites",4,Extreme,Major,Medical,Private Health Insurance,,,,N,Y,175930.77,49255.75
New York City,Manhattan,7002053,001463,NYU Langone Hospitals,0 to 17,112,F,White,Not Span/Hispanic,5,Emergency,Home or Self Care,2017,224,Other perinatal conditions,216,RESP INTUB/MECH VENTIL,724,Other infectious & parasitic diseases,18,"Infectious and Parasitic Diseases, Systemic or Unspecified Sites",3,Major,Moderate,Medical,Private Health Insurance,,,02100,N,Y,52592.37,14520.89
New York City,Manhattan,7002053,001463,NYU Langone Hospitals,50 to 69,114,M,Black/African American,Not Span/Hispanic,12,Urgent,Inpatient Rehabilitation Facility,2017,004,Mycoses,174,OT NON-OR THER PRC SKIN,724,Other infectious & parasitic diseases,18,"Infectious and Parasitic Diseases, Systemic or Unspecified Sites",3,Major,Major,Medical,Medicare,,,,N,N,475220.91,105892.19
New York City,Manhattan,7002053,001463,NYU Langone Hospitals,30 to 49,100,M,White,Not Span/Hispanic,2,Emergency,Home or Self Care,2017,003,Bacterial infection; unspecified site,000,NO PROC,724,Other infectious & parasitic diseases,18,"Infectious and Parasitic Diseases, Systemic or Unspecified Sites",1,Minor,Minor,Medical,Blue Cross/Blue Shield,,,,N,Y,24721.66,7758.41
New York City,Manhattan,7002053,001463,NYU Langone Hospitals,70 or Older,OOS,M,White,Not Span/Hispanic,3,Emergency,Home w/ Home Health Services,2017,003,Bacterial infection; unspecified site,054,OT VASC CATH; NOT HEART,724,Other infectious & parasitic diseases,18,"Infectious and Parasitic Diseases, Systemic or Unspecified Sites",1,Minor,Minor,Medical,Medicare,,,,N,Y,39294.56,12126.22
New York City,Manhattan,7002053,001463,NYU Langone Hospitals,18 to 29,112,M,Other Race,Not Span/Hispanic,2,Emergency,Left Against Medical Advice,2017,003,Bacterial infection; unspecified site,000,NO PROC,724,Other infectious & parasitic diseases,18,"Infectious and Parasitic Diseases, Systemic or Unspecified Sites",2,Moderate,Minor,Medical,Private Health Insurance,,,,N,Y,31922.81,10870.46
New York City,Manhattan,7002053,001463,NYU Langone Hospitals,70 or Older,113,M,White,Not Span/Hispanic,5,Emergency,Home w/ Home Health Services,2017,003,Bacterial infection; unspecified site,054,OT VASC CATH; NOT HEART,724,Other infectious & parasitic diseases,18,"Infectious and Parasitic Diseases, Systemic or Unspecified Sites",1,Minor,Minor,Medical,Medicare,,,,N,Y,57468.76,22091.23
New York City,Manhattan,7002053,001463,NYU Langone Hospitals,70 or Older,100,F,White,Not Span/Hispanic,4,Urgent,Inpatient Rehabilitation Facility,2017,003,Bacterial infection; unspecified site,000,NO PROC,724,Other infectious & parasitic diseases,18,"Infectious and Parasitic Diseases, Systemic or Unspecified Sites",4,Extreme,Major,Medical,Medicare,,,,N,N,77903.72,33842.76
New York City,Manhattan,7002053,001463,NYU Langone Hospitals,50 to 69,112,F,White,Not Span/Hispanic,6,Emergency,Inpatient Rehabilitation Facility,2017,008,Other infections; including parasitic,000,NO PROC,724,Other infectious & parasitic diseases,18,"Infectious and Parasitic Diseases, Systemic or Unspecified Sites",3,Major,Major,Medical,Private Health Insurance,,,,N,Y,115177.29,26595.04
New York City,Manhattan,7002053,001463,NYU Langone Hospitals,70 or Older,100,F,White,Not Span/Hispanic,3,Emergency,Home or Self Care,2017,008,Other infections; including parasitic,231,OTHER THERAPEUTIC PRCS,724,Other infectious & parasitic diseases,18,"Infectious and Parasitic Diseases, Systemic or Unspecified Sites",2,Moderate,Minor,Medical,Private Health Insurance,,,,N,Y,36228.56,14548.69
New York City,Manhattan,7002053,001463,NYU Langone Hospitals,70 or Older,103,F,Other Race,Unknown,2,Emergency,Home or Self Care,2017,003,Bacterial infection; unspecified site,000,NO PROC,724,Other infectious & parasitic diseases,18,"Infectious and Parasitic Diseases, Systemic or Unspecified Sites",2,Moderate,Minor,Medical,Medicare,,,,N,Y,16394.40,6047.97
New York City,Manhattan,7002053,001463,NYU Langone Hospitals,50 to 69,100,M,White,Not Span/Hispanic,5,Emergency,Home w/ Home Health Services,2017,003,Bacterial infection; unspecified site,054,OT VASC CATH; NOT HEART,724,Other infectious & parasitic diseases,18,"Infectious and Parasitic Diseases, Systemic or Unspecified Sites",1,Minor,Minor,Medical,Private Health Insurance,,,,N,Y,80660.91,25717.65
New York City,Manhattan,7002053,001463,NYU Langone Hospitals,0 to 17,112,M,White,Unknown,4,Emergency,Home or Self Care,2017,224,Other perinatal conditions,004,DIAGNOSTIC SPINAL TAP,724,Other infectious & parasitic diseases,18,"Infectious and Parasitic Diseases, Systemic or Unspecified Sites",1,Minor,Minor,Medical,Medicaid,,,03700,N,Y,31469.50,9647.09
New York City,Manhattan,7002053,001463,NYU Langone Hospitals,70 or Older,100,F,White,Not Span/Hispanic,4,Emergency,Home w/ Home Health Services,2017,003,Bacterial infection; unspecified site,000,NO PROC,724,Other infectious & parasitic diseases,18,"Infectious and Parasitic Diseases, Systemic or Unspecified Sites",2,Moderate,Major,Medical,Medicare,,,,N,Y,54277.07,17609.00
New York City,Manhattan,7002053,001463,NYU Langone Hospitals,0 to 17,112,M,White,Not Span/Hispanic,2,Emergency,Home or Self Care,2017,224,Other perinatal conditions,004,DIAGNOSTIC SPINAL TAP,724,Other infectious & parasitic diseases,18,"Infectious and Parasitic Diseases, Systemic or Unspecified Sites",1,Minor,Minor,Medical,Private Health Insurance,,,03500,N,Y,22434.44,6428.47
New York City,Manhattan,7002053,001463,NYU Langone Hospitals,30 to 49,104,M,Other Race,Spanish/Hispanic,4,Urgent,Home w/ Home Health Services,2017,003,Bacterial infection; unspecified site,054,OT VASC CATH; NOT HEART,724,Other infectious & parasitic diseases,18,"Infectious and Parasitic Diseases, Systemic or Unspecified Sites",2,Moderate,Minor,Medical,Blue Cross/Blue Shield,,,,N,N,58505.59,17976.83
New York City,Manhattan,7002053,001463,NYU Langone Hospitals,18 to 29,104,F,Other Race,Spanish/Hispanic,2,Emergency,Home or Self Care,2017,135,Intestinal infection,231,OTHER THERAPEUTIC PRCS,724,Other infectious & parasitic diseases,18,"Infectious and Parasitic Diseases, Systemic or Unspecified Sites",3,Major,Moderate,Medical,Blue Cross/Blue Shield,,,,N,Y,33278.87,11433.85
New York City,Manhattan,7002053,001463,NYU Langone Hospitals,70 or Older,106,M,White,Not Span/Hispanic,4,Emergency,Home w/ Home Health Services,2017,003,Bacterial infection; unspecified site,054,OT VASC CATH; NOT HEART,724,Other infectious & parasitic diseases,18,"Infectious and Parasitic Diseases, Systemic or Unspecified Sites",1,Minor,Moderate,Medical,Medicare,,,,N,Y,63160.44,21057.74
New York City,Manhattan,7002053,001463,NYU Langone Hospitals,50 to 69,100,M,Black/African American,Not Span/Hispanic,1,Emergency,Home or Self Care,2017,003,Bacterial infection; unspecified site,000,NO PROC,724,Other infectious & parasitic diseases,18,"Infectious and Parasitic Diseases, Systemic or Unspecified Sites",2,Moderate,Minor,Medical,Blue Cross/Blue Shield,,,,N,Y,15321.06,5657.64
New York City,Manhattan,7002053,001463,NYU Langone Hospitals,0 to 17,100,F,Other Race,Unknown,1,Emergency,Home or Self Care,2017,224,Other perinatal conditions,004,DIAGNOSTIC SPINAL TAP,724,Other infectious & parasitic diseases,18,"Infectious and Parasitic Diseases, Systemic or Unspecified Sites",1,Minor,Minor,Medical,Private Health Insurance,,,03100,N,Y,17483.00,4748.01
New York City,Manhattan,7002053,001463,NYU Langone Hospitals,50 to 69,105,M,White,Not Span/Hispanic,4,Emergency,Home or Self Care,2017,008,Other infections; including parasitic,193,DX ULTRASOUND HEART,724,Other infectious & parasitic diseases,18,"Infectious and Parasitic Diseases, Systemic or Unspecified Sites",2,Moderate,Minor,Medical,Medicare,,,,N,Y,66412.95,22497.32
New York City,Manhattan,7002053,001463,NYU Langone Hospitals,30 to 49,112,M,Black/African American,Not Span/Hispanic,10,Emergency,Home or Self Care,2017,008,Other infections; including parasitic,000,NO PROC,724,Other infectious & parasitic diseases,18,"Infectious and Parasitic Diseases, Systemic or Unspecified Sites",4,Extreme,Major,Medical,Private Health Insurance,,,,N,Y,99869.63,39396.62
New York City,Manhattan,7002053,001463,NYU Langone Hospitals,30 to 49,112,M,Black/African American,Not Span/Hispanic,5,Emergency,Home or Self Care,2017,003,Bacterial infection; unspecified site,054,OT VASC CATH; NOT HEART,724,Other infectious & parasitic diseases,18,"Infectious and Parasitic Diseases, Systemic or Unspecified Sites",3,Major,Moderate,Medical,Medicaid,,,,N,Y,77668.87,21303.65
New York City,Manhattan,7002053,001463,NYU Langone Hospitals,0 to 17,112,M,White,Not Span/Hispanic,3,Emergency,Home or Self Care,2017,224,Other perinatal conditions,004,DIAGNOSTIC SPINAL TAP,724,Other infectious & parasitic diseases,18,"Infectious and Parasitic Diseases, Systemic or Unspecified Sites",2,Moderate,Minor,Medical,Medicaid,,,03400,N,Y,26035.79,7077.09
New York City,Manhattan,7002053,001463,NYU Langone Hospitals,30 to 49,112,M,Other Race,Unknown,1,Emergency,Home or Self Care,2017,008,Other infections; including parasitic,000,NO PROC,724,Other infectious & parasitic diseases,18,"Infectious and Parasitic Diseases, Systemic or Unspecified Sites",3,Major,Major,Medical,Private Health Insurance,,,,N,Y,15139.88,5674.64
New York City,Manhattan,7002053,001463,NYU Langone Hospitals,70 or Older,100,F,White,Not Span/Hispanic,3,Emergency,Home w/ Home Health Services,2017,008,Other infections; including parasitic,000,NO PROC,724,Other infectious & parasitic diseases,18,"Infectious and Parasitic Diseases, Systemic or Unspecified Sites",3,Major,Moderate,Medical,Medicare,,,,N,Y,30513.58,13021.15
New York City,Manhattan,7002053,001463,NYU Langone Hospitals,18 to 29,OOS,M,White,Not Span/Hispanic,4,Emergency,Home or Self Care,2017,009,Sexually transmitted infections (not HIV or hepatitis),004,DIAGNOSTIC SPINAL TAP,724,Other infectious & parasitic diseases,18,"Infectious and Parasitic Diseases, Systemic or Unspecified Sites",1,Minor,Minor,Medical,Private Health Insurance,,,,N,Y,32861.21,12964.79
New York City,Manhattan,7002053,001463,NYU Langone Hospitals,18 to 29,112,F,White,Not Span/Hispanic,2,Emergency,Home or Self Care,2017,003,Bacterial infection; unspecified site,004,DIAGNOSTIC SPINAL TAP,724,Other infectious & parasitic diseases,18,"Infectious and Parasitic Diseases, Systemic or Unspecified Sites",1,Minor,Minor,Medical,Private Health Insurance,,,,N,Y,34572.15,11393.93
New York City,Manhattan,7002053,001463,NYU Langone Hospitals,70 or Older,103,F,White,Not Span/Hispanic,1,Emergency,Home or Self Care,2017,008,Other infections; including parasitic,231,OTHER THERAPEUTIC PRCS,724,Other infectious & parasitic diseases,18,"Infectious and Parasitic Diseases, Systemic or Unspecified Sites",3,Major,Major,Medical,Medicare,,,,N,Y,22155.81,7039.56
New York City,Manhattan,7002053,001463,NYU Langone Hospitals,30 to 49,100,M,White,Not Span/Hispanic,3,Emergency,Home or Self Care,2017,009,Sexually transmitted infections (not HIV or hepatitis),004,DIAGNOSTIC SPINAL TAP,724,Other infectious & parasitic diseases,18,"Infectious and Parasitic Diseases, Systemic or Unspecified Sites",2,Moderate,Moderate,Medical,Private Health Insurance,,,,N,Y,52672.27,15088.50
New York City,Manhattan,7002053,001463,NYU Langone Hospitals,30 to 49,100,F,Black/African American,Not Span/Hispanic,4,Emergency,Home or Self Care,2017,135,Intestinal infection,000,NO PROC,724,Other infectious & parasitic diseases,18,"Infectious and Parasitic Diseases, Systemic or Unspecified Sites",1,Minor,Minor,Medical,Blue Cross/Blue Shield,,,,N,Y,48191.63,17216.66
New York City,Manhattan,7002053,001463,NYU Langone Hospitals,70 or Older,100,F,White,Not Span/Hispanic,8,Emergency,Home w/ Home Health Services,2017,003,Bacterial infection; unspecified site,000,NO PROC,724,Other infectious & parasitic diseases,18,"Infectious and Parasitic Diseases, Systemic or Unspecified Sites",4,Extreme,Major,Medical,Medicare,,,,N,Y,79111.09,32336.95
New York City,Manhattan,7002053,001463,NYU Langone Hospitals,70 or Older,112,M,White,Not Span/Hispanic,8,Emergency,Skilled Nursing Home,2017,003,Bacterial infection; unspecified site,193,DX ULTRASOUND HEART,724,Other infectious & parasitic diseases,18,"Infectious and Parasitic Diseases, Systemic or Unspecified Sites",2,Moderate,Moderate,Medical,Medicare,,,,N,Y,95270.53,34517.22
New York City,Manhattan,7002053,001463,NYU Langone Hospitals,0 to 17,113,F,Other Race,Not Span/Hispanic,14,Emergency,Home w/ Home Health Services,2017,003,Bacterial infection; unspecified site,223,ENTERAL/PARENTERAL NUTR,724,Other infectious & parasitic diseases,18,"Infectious and Parasitic Diseases, Systemic or Unspecified Sites",1,Minor,Minor,Medical,Medicaid,,,,N,Y,102464.82,30693.38
New York City,Manhattan,7002053,001463,NYU Langone Hospitals,70 or Older,100,M,White,Not Span/Hispanic,6,Emergency,Home w/ Home Health Services,2017,003,Bacterial infection; unspecified site,054,OT VASC CATH; NOT HEART,724,Other infectious & parasitic diseases,18,"Infectious and Parasitic Diseases, Systemic or Unspecified Sites",2,Moderate,Major,Medical,Medicare,,,,N,Y,123786.69,35090.07
New York City,Manhattan,7002053,001463,NYU Langone Hospitals,0 to 17,112,M,Other Race,Unknown,4,Urgent,Home or Self Care,2017,003,Bacterial infection; unspecified site,199,ELECTROENCEPHALOGRAM,724,Other infectious & parasitic diseases,18,"Infectious and Parasitic Diseases, Systemic or Unspecified Sites",1,Minor,Minor,Medical,Medicaid,,,,N,N,63724.16,10253.34
New York City,Manhattan,7002053,001463,NYU Langone Hospitals,0 to 17,100,M,White,Not Span/Hispanic,1,Emergency,Home or Self Care,2017,201,Infective arthritis and osteomyelitis (except that caused by tuberculosis or sexually transmitted disease),159,OT DX PRCS ON MUSC/SKEL,724,Other infectious & parasitic diseases,18,"Infectious and Parasitic Diseases, Systemic or Unspecified Sites",1,Minor,Minor,Medical,Private Health Insurance,,,,N,Y,32274.33,5975.28
New York City,Manhattan,7002053,001463,NYU Langone Hospitals,70 or Older,113,F,Other Race,Unknown,2,Emergency,Home w/ Home Health Services,2017,003,Bacterial infection; unspecified site,000,NO PROC,724,Other infectious & parasitic diseases,18,"Infectious and Parasitic Diseases, Systemic or Unspecified Sites",3,Major,Major,Medical,Private Health Insurance,,,,N,Y,26237.72,9848.97
New York City,Manhattan,7002053,001463,NYU Langone Hospitals,0 to 17,112,M,Other Race,Not Span/Hispanic,11,Emergency,Home or Self Care,2017,008,Other infections; including parasitic,222,BLOOD TRANSFUSION,724,Other infectious & parasitic diseases,18,"Infectious and Parasitic Diseases, Systemic or Unspecified Sites",4,Extreme,Major,Medical,Private Health Insurance,,,,N,Y,121341.65,32474.53
New York City,Manhattan,7002053,001463,NYU Langone Hospitals,0 to 17,112,M,White,Unknown,3,Emergency,Home or Self Care,2017,224,Other perinatal conditions,231,OTHER THERAPEUTIC PRCS,724,Other infectious & parasitic diseases,18,"Infectious and Parasitic Diseases, Systemic or Unspecified Sites",3,Major,Minor,Medical,Medicaid,,,03800,N,Y,28020.42,8776.41
New York City,Manhattan,7002053,001463,NYU Langone Hospitals,50 to 69,OOS,M,White,Not Span/Hispanic,6,Elective,Home w/ Home Health Services,2017,003,Bacterial infection; unspecified site,054,OT VASC CATH; NOT HEART,724,Other infectious & parasitic diseases,18,"Infectious and Parasitic Diseases, Systemic or Unspecified Sites",3,Major,Moderate,Medical,Medicare,,,,N,N,77925.80,27633.09
New York City,Manhattan,7002053,001463,NYU Langone Hospitals,70 or Older,100,M,White,Not Span/Hispanic,7,Emergency,Skilled Nursing Home,2017,003,Bacterial infection; unspecified site,000,NO PROC,724,Other infectious & parasitic diseases,18,"Infectious and Parasitic Diseases, Systemic or Unspecified Sites",3,Major,Major,Medical,Medicare,,,,N,Y,110660.34,32206.55
New York City,Manhattan,7002053,001463,NYU Langone Hospitals,70 or Older,100,M,White,Not Span/Hispanic,3,Emergency,Skilled Nursing Home,2017,003,Bacterial infection; unspecified site,000,NO PROC,724,Other infectious & parasitic diseases,18,"Infectious and Parasitic Diseases, Systemic or Unspecified Sites",1,Minor,Moderate,Medical,Medicare,,,,N,Y,25622.49,12178.79
New York City,Manhattan,7002053,001463,NYU Langone Hospitals,50 to 69,113,M,Other Race,Not Span/Hispanic,3,Emergency,Home or Self Care,2017,135,Intestinal infection,231,OTHER THERAPEUTIC PRCS,724,Other infectious & parasitic diseases,18,"Infectious and Parasitic Diseases, Systemic or Unspecified Sites",2,Moderate,Minor,Medical,Private Health Insurance,,,,N,Y,78023.84,24034.28
New York City,Manhattan,7002053,001463,NYU Langone Hospitals,70 or Older,100,M,Black/African American,Not Span/Hispanic,13,Emergency,Skilled Nursing Home,2017,004,Mycoses,058,HEMODIALYSIS,724,Other infectious & parasitic diseases,18,"Infectious and Parasitic Diseases, Systemic or Unspecified Sites",3,Major,Major,Medical,Medicare,,,,N,Y,152397.83,63671.21
New York City,Manhattan,7002053,001463,NYU Langone Hospitals,0 to 17,112,M,White,Not Span/Hispanic,1,Emergency,Home or Self Care,2017,201,Infective arthritis and osteomyelitis (except that caused by tuberculosis or sexually transmitted disease),000,NO PROC,724,Other infectious & parasitic diseases,18,"Infectious and Parasitic Diseases, Systemic or Unspecified Sites",2,Moderate,Minor,Medical,Private Health Insurance,,,,N,Y,16908.13,4616.06
New York City,Manhattan,7002053,001463,NYU Langone Hospitals,18 to 29,112,F,Other Race,Not Span/Hispanic,1,Emergency,Home or Self Care,2017,003,Bacterial infection; unspecified site,155,ARTHROCENTESIS,724,Other infectious & parasitic diseases,18,"Infectious and Parasitic Diseases, Systemic or Unspecified Sites",1,Minor,Minor,Medical,Medicaid,,,,N,Y,52404.77,14207.50
New York City,Manhattan,7002053,001463,NYU Langone Hospitals,70 or Older,112,M,White,Not Span/Hispanic,8,Emergency,Skilled Nursing Home,2017,003,Bacterial infection; unspecified site,193,DX ULTRASOUND HEART,724,Other infectious & parasitic diseases,18,"Infectious and Parasitic Diseases, Systemic or Unspecified Sites",4,Extreme,Extreme,Medical,Medicare,,,,N,Y,112458.40,41301.08
New York City,Manhattan,7002053,001463,NYU Langone Hospitals,70 or Older,112,F,White,Not Span/Hispanic,1,Emergency,Home w/ Home Health Services,2017,003,Bacterial infection; unspecified site,000,NO PROC,724,Other infectious & parasitic diseases,18,"Infectious and Parasitic Diseases, Systemic or Unspecified Sites",1,Minor,Moderate,Medical,Medicare,,,,N,Y,62868.39,17207.06
New York City,Manhattan,7002053,001463,NYU Langone Hospitals,30 to 49,112,M,Other Race,Unknown,1,Emergency,Home or Self Care,2017,003,Bacterial infection; unspecified site,231,OTHER THERAPEUTIC PRCS,724,Other infectious & parasitic diseases,18,"Infectious and Parasitic Diseases, Systemic or Unspecified Sites",1,Minor,Minor,Medical,Medicaid,,,,N,Y,16264.33,6143.33
New York City,Manhattan,7002053,001463,NYU Langone Hospitals,0 to 17,112,M,White,Unknown,2,Emergency,Home or Self Care,2017,224,Other perinatal conditions,004,DIAGNOSTIC SPINAL TAP,724,Other infectious & parasitic diseases,18,"Infectious and Parasitic Diseases, Systemic or Unspecified Sites",1,Minor,Minor,Medical,Medicaid,,,03900,N,Y,30814.67,7969.04
New York City,Manhattan,7002053,001463,NYU Langone Hospitals,70 or Older,OOS,F,White,Not Span/Hispanic,5,Emergency,Home w/ Home Health Services,2017,003,Bacterial infection; unspecified site,228,PROPHYLACTIC VAC/INOCUL,724,Other infectious & parasitic diseases,18,"Infectious and Parasitic Diseases, Systemic or Unspecified Sites",3,Major,Major,Medical,Medicare,,,,N,Y,58829.18,22615.88
New York City,Manhattan,7002053,001463,NYU Langone Hospitals,0 to 17,104,F,Black/African American,Not Span/Hispanic,1,Emergency,Home or Self Care,2017,003,Bacterial infection; unspecified site,222,BLOOD TRANSFUSION,724,Other infectious & parasitic diseases,18,"Infectious and Parasitic Diseases, Systemic or Unspecified Sites",3,Major,Major,Medical,Blue Cross/Blue Shield,,,,N,Y,21069.60,5449.61
