Hospital Service Area,Hospital County,Operating Certificate Number,Permanent Facility Id,Facility Name,Age Group,Zip Code - 3 digits,Gender,Race,Ethnicity,Length of Stay,Type of Admission,Patient Disposition,Discharge Year,CCS Diagnosis Code,CCS Diagnosis Description,CCS Procedure Code,CCS Procedure Description,APR DRG Code,APR DRG Description,APR MDC Code,APR MDC Description,APR Severity of Illness Code,APR Severity of Illness Description,APR Risk of Mortality,APR Medical Surgical Description,Payment Typology 1,Payment Typology 2,Payment Typology 3,Birth Weight,Abortion Edit Indicator,Emergency Department Indicator,Total Charges,Total Costs
New York City,Kings,7002053,001304,NYU Langone Hospital-Brooklyn,18 to 29,112,F,Other Race,Not Span/Hispanic,3,Emergency,Home or Self Care,2019,DIG001,INTESTINAL INFECTION,,,724,OTHER INFECTIOUS & PARASITIC DISEASES,18,INFECTIOUS AND PARASITIC DISEASES (SYSTEMIC OR UNSPECIFIED SITES),2,Moderate,Minor,Medical,Private Health Insurance,,,,,true,31763.15,11183.65
New York City,Kings,7002053,001304,NYU Langone Hospital-Brooklyn,18 to 29,112,M,White,Not Span/Hispanic,3,Emergency,Home or Self Care,2019,INF009,"PARASITIC, OTHER SPECIFIED AND UNSPECIFIED INFECTIONS",ADM015,ADMINISTRATION OF ANTIBIOTICS,724,OTHER INFECTIOUS & PARASITIC DISEASES,18,INFECTIOUS AND PARASITIC DISEASES (SYSTEMIC OR UNSPECIFIED SITES),2,Moderate,Minor,Medical,Private Health Insurance,,,,,true,37372.34,11789.78
New York City,Kings,7002053,001304,NYU Langone Hospital-Brooklyn,50 to 69,112,M,White,Not Span/Hispanic,3,Emergency,Skilled Nursing Home,2019,INF009,"PARASITIC, OTHER SPECIFIED AND UNSPECIFIED INFECTIONS",,,724,OTHER INFECTIOUS & PARASITIC DISEASES,18,INFECTIOUS AND PARASITIC DISEASES (SYSTEMIC OR UNSPECIFIED SITES),2,Moderate,Minor,Medical,Medicare,Blue Cross/Blue Shield,,,,true,49568.62,18929.27
New York City,Kings,7002053,001304,NYU Langone Hospital-Brooklyn,50 to 69,112,F,White,Not Span/Hispanic,1,Emergency,Home or Self Care,2019,SYM017,ABNORMAL FINDINGS WITHOUT DIAGNOSIS,,,724,OTHER INFECTIOUS & PARASITIC DISEASES,18,INFECTIOUS AND PARASITIC DISEASES (SYSTEMIC OR UNSPECIFIED SITES),1,Minor,Moderate,Medical,Medicare,Medicare,,,,true,61246.52,17828.34
New York City,Kings,7002053,001304,NYU Langone Hospital-Brooklyn,0 to 17,112,F,Other Race,Not Span/Hispanic,4,Emergency,Home or Self Care,2019,SYM017,ABNORMAL FINDINGS WITHOUT DIAGNOSIS,CNS002,LUMBAR PUNCTURE,724,OTHER INFECTIOUS & PARASITIC DISEASES,18,INFECTIOUS AND PARASITIC DISEASES (SYSTEMIC OR UNSPECIFIED SITES),1,Minor,Minor,Medical,Medicaid,,,,,true,39897.19,12132.87
New York City,Kings,7002053,001304,NYU Langone Hospital-Brooklyn,50 to 69,112,F,Other Race,Not Span/Hispanic,5,Emergency,Left Against Medical Advice,2019,SYM017,ABNORMAL FINDINGS WITHOUT DIAGNOSIS,IMG008,ULTRASONOGRAPHY,724,OTHER INFECTIOUS & PARASITIC DISEASES,18,INFECTIOUS AND PARASITIC DISEASES (SYSTEMIC OR UNSPECIFIED SITES),3,Major,Moderate,Medical,Medicare,Medicaid,,,,true,99022.82,24059.67
New York City,Kings,7002053,001304,NYU Langone Hospital-Brooklyn,50 to 69,112,M,Other Race,Spanish/Hispanic,2,Emergency,Home or Self Care,2019,INF009,"PARASITIC, OTHER SPECIFIED AND UNSPECIFIED INFECTIONS",,,724,OTHER INFECTIOUS & PARASITIC DISEASES,18,INFECTIOUS AND PARASITIC DISEASES (SYSTEMIC OR UNSPECIFIED SITES),2,Moderate,Minor,Medical,Medicaid,,,,,true,37814.37,12705.28
New York City,Kings,7002053,001304,NYU Langone Hospital-Brooklyn,30 to 49,112,F,Other Race,Not Span/Hispanic,8,Emergency,Home w/ Home Health Services,2019,SYM017,ABNORMAL FINDINGS WITHOUT DIAGNOSIS,IMG008,ULTRASONOGRAPHY,724,OTHER INFECTIOUS & PARASITIC DISEASES,18,INFECTIOUS AND PARASITIC DISEASES (SYSTEMIC OR UNSPECIFIED SITES),2,Moderate,Moderate,Medical,Medicare,Medicaid,,,,true,72496.63,27968.03
New York City,Kings,7002053,001304,NYU Langone Hospital-Brooklyn,70 or Older,112,M,White,Not Span/Hispanic,5,Emergency,Inpatient Rehabilitation Facility,2019,INF009,"PARASITIC, OTHER SPECIFIED AND UNSPECIFIED INFECTIONS",,,724,OTHER INFECTIOUS & PARASITIC DISEASES,18,INFECTIOUS AND PARASITIC DISEASES (SYSTEMIC OR UNSPECIFIED SITES),2,Moderate,Moderate,Medical,Medicare,,,,,true,68629.66,23070.88
New York City,Kings,7002053,001304,NYU Langone Hospital-Brooklyn,0 to 17,112,F,White,Not Span/Hispanic,3,Emergency,Home or Self Care,2019,PNL009,PERINATAL INFECTIONS,,,724,OTHER INFECTIOUS & PARASITIC DISEASES,18,INFECTIOUS AND PARASITIC DISEASES (SYSTEMIC OR UNSPECIFIED SITES),2,Moderate,Minor,Medical,Medicaid,,,02600,,true,26955.23,8931.93
New York City,Kings,7002053,001304,NYU Langone Hospital-Brooklyn,30 to 49,103,M,Other Race,Unknown,1,Emergency,Home or Self Care,2019,INF009,"PARASITIC, OTHER SPECIFIED AND UNSPECIFIED INFECTIONS",,,724,OTHER INFECTIOUS & PARASITIC DISEASES,18,INFECTIOUS AND PARASITIC DISEASES (SYSTEMIC OR UNSPECIFIED SITES),2,Moderate,Minor,Medical,Private Health Insurance,,,,,true,18541.5,4735.5
New York City,Kings,7002053,001304,NYU Langone Hospital-Brooklyn,0 to 17,112,F,Other Race,Unknown,7,Elective,Home or Self Care,2019,PNL009,PERINATAL INFECTIONS,CAR029,"CARDIOVASCULAR DEVICE PROCEDURES, NEC",724,OTHER INFECTIOUS & PARASITIC DISEASES,18,INFECTIOUS AND PARASITIC DISEASES (SYSTEMIC OR UNSPECIFIED SITES),2,Moderate,Minor,Medical,Medicaid,,,02000,,false,87562.17,36557.99
New York City,Kings,7002053,001304,NYU Langone Hospital-Brooklyn,70 or Older,112,M,White,Not Span/Hispanic,24,Emergency,Skilled Nursing Home,2019,SYM017,ABNORMAL FINDINGS WITHOUT DIAGNOSIS,CAR024,VENOUS AND ARTERIAL CATHETER PLACEMENT,724,OTHER INFECTIOUS & PARASITIC DISEASES,18,INFECTIOUS AND PARASITIC DISEASES (SYSTEMIC OR UNSPECIFIED SITES),4,Extreme,Major,Medical,Medicaid,,,,,true,191021.88,79486.92
New York City,Kings,7002053,001304,NYU Langone Hospital-Brooklyn,70 or Older,112,M,White,Not Span/Hispanic,3,Emergency,Home w/ Home Health Services,2019,SYM017,ABNORMAL FINDINGS WITHOUT DIAGNOSIS,ADM015,ADMINISTRATION OF ANTIBIOTICS,724,OTHER INFECTIOUS & PARASITIC DISEASES,18,INFECTIOUS AND PARASITIC DISEASES (SYSTEMIC OR UNSPECIFIED SITES),3,Major,Major,Medical,Medicare,Medicaid,,,,true,72794.56,21659.37
New York City,Kings,7002053,001304,NYU Langone Hospital-Brooklyn,50 to 69,112,F,White,Not Span/Hispanic,3,Emergency,Home w/ Home Health Services,2019,SYM017,ABNORMAL FINDINGS WITHOUT DIAGNOSIS,,,724,OTHER INFECTIOUS & PARASITIC DISEASES,18,INFECTIOUS AND PARASITIC DISEASES (SYSTEMIC OR UNSPECIFIED SITES),2,Moderate,Moderate,Medical,Medicare,Private Health Insurance,,,,true,44599.11,11447.5
New York City,Kings,7002053,001304,NYU Langone Hospital-Brooklyn,0 to 17,112,F,White,Spanish/Hispanic,4,Emergency,Home or Self Care,2019,INF003,BACTERIAL INFECTIONS,,,724,OTHER INFECTIOUS & PARASITIC DISEASES,18,INFECTIOUS AND PARASITIC DISEASES (SYSTEMIC OR UNSPECIFIED SITES),3,Major,Minor,Medical,Medicaid,,,,,true,54320.77,14559.03
New York City,Kings,7002053,001304,NYU Langone Hospital-Brooklyn,0 to 17,112,M,Other Race,Not Span/Hispanic,1,Emergency,Home or Self Care,2019,PNL009,PERINATAL INFECTIONS,,,724,OTHER INFECTIOUS & PARASITIC DISEASES,18,INFECTIOUS AND PARASITIC DISEASES (SYSTEMIC OR UNSPECIFIED SITES),1,Minor,Minor,Medical,Private Health Insurance,,,,,true,14889.3,3941.72
New York City,Kings,7002053,001304,NYU Langone Hospital-Brooklyn,0 to 17,112,F,Other Race,Not Span/Hispanic,1,Emergency,Home or Self Care,2019,PNL009,PERINATAL INFECTIONS,,,724,OTHER INFECTIOUS & PARASITIC DISEASES,18,INFECTIOUS AND PARASITIC DISEASES (SYSTEMIC OR UNSPECIFIED SITES),1,Minor,Minor,Medical,Medicaid,,,04300,,true,18140.47,4253.01
New York City,Kings,7002053,001304,NYU Langone Hospital-Brooklyn,30 to 49,,M,Black/African American,Not Span/Hispanic,4,Emergency,Home or Self Care,2019,INF006,HIV INFECTION,,,724,OTHER INFECTIOUS & PARASITIC DISEASES,18,INFECTIOUS AND PARASITIC DISEASES (SYSTEMIC OR UNSPECIFIED SITES),3,Major,Moderate,Medical,Blue Cross/Blue Shield,,,,,true,57518.44,16405.58
New York City,Kings,7002053,001304,NYU Langone Hospital-Brooklyn,50 to 69,112,F,White,Spanish/Hispanic,1,Emergency,Home or Self Care,2019,SYM017,ABNORMAL FINDINGS WITHOUT DIAGNOSIS,,,724,OTHER INFECTIOUS & PARASITIC DISEASES,18,INFECTIOUS AND PARASITIC DISEASES (SYSTEMIC OR UNSPECIFIED SITES),1,Minor,Minor,Medical,Medicare,Medicaid,,,,true,51751.27,16770.19
New York City,Kings,7002053,001304,NYU Langone Hospital-Brooklyn,50 to 69,112,F,White,Not Span/Hispanic,3,Emergency,Home or Self Care,2019,INF003,BACTERIAL INFECTIONS,,,724,OTHER INFECTIOUS & PARASITIC DISEASES,18,INFECTIOUS AND PARASITIC DISEASES (SYSTEMIC OR UNSPECIFIED SITES),2,Moderate,Minor,Medical,Medicaid,,,,,true,41204.26,12907.17
New York City,Kings,7002053,001304,NYU Langone Hospital-Brooklyn,70 or Older,112,M,White,Not Span/Hispanic,4,Emergency,Home w/ Home Health Services,2019,SYM017,ABNORMAL FINDINGS WITHOUT DIAGNOSIS,ADM015,ADMINISTRATION OF ANTIBIOTICS,724,OTHER INFECTIOUS & PARASITIC DISEASES,18,INFECTIOUS AND PARASITIC DISEASES (SYSTEMIC OR UNSPECIFIED SITES),3,Major,Major,Medical,Medicare,,,,,true,66603.34,17460.68
New York City,Kings,7002053,001304,NYU Langone Hospital-Brooklyn,18 to 29,112,F,Black/African American,Not Span/Hispanic,2,Emergency,Home or Self Care,2019,INF009,"PARASITIC, OTHER SPECIFIED AND UNSPECIFIED INFECTIONS",ADM015,ADMINISTRATION OF ANTIBIOTICS,724,OTHER INFECTIOUS & PARASITIC DISEASES,18,INFECTIOUS AND PARASITIC DISEASES (SYSTEMIC OR UNSPECIFIED SITES),2,Moderate,Minor,Medical,Medicaid,,,,,true,52698.18,12279.26
New York City,Kings,7002053,001304,NYU Langone Hospital-Brooklyn,0 to 17,112,M,White,Spanish/Hispanic,2,Emergency,Home or Self Care,2019,PNL009,PERINATAL INFECTIONS,CNS002,LUMBAR PUNCTURE,724,OTHER INFECTIOUS & PARASITIC DISEASES,18,INFECTIOUS AND PARASITIC DISEASES (SYSTEMIC OR UNSPECIFIED SITES),2,Moderate,Minor,Medical,Medicaid,,,03200,,true,21822.24,6327.6
New York City,Kings,7002053,001304,NYU Langone Hospital-Brooklyn,0 to 17,112,F,White,Spanish/Hispanic,2,Emergency,Home or Self Care,2019,PNL009,PERINATAL INFECTIONS,OTR004,ISOLATION PROCEDURES,724,OTHER INFECTIOUS & PARASITIC DISEASES,18,INFECTIOUS AND PARASITIC DISEASES (SYSTEMIC OR UNSPECIFIED SITES),2,Moderate,Minor,Medical,Medicaid,,,03200,,true,19208.77,6297.58
