Hospital Service Area,Hospital County,Operating Certificate Number,Permanent Facility Id,Facility Name,Age Group,Zip Code - 3 digits,Gender,Race,Ethnicity,Length of Stay,Type of Admission,Patient Disposition,Discharge Year,CCS Diagnosis Code,CCS Diagnosis Description,CCS Procedure Code,CCS Procedure Description,APR DRG Code,APR DRG Description,APR MDC Code,APR MDC Description,APR Severity of Illness Code,APR Severity of Illness Description,APR Risk of Mortality,APR Medical Surgical Description,Payment Typology 1,Payment Typology 2,Payment Typology 3,Birth Weight,Abortion Edit Indicator,Emergency Department Indicator,Total Charges,Total Costs
New York City,Manhattan,7002053,001463,NYU Langone Hospitals,50 to 69,112,M,White,Not Span/Hispanic,17,Emergency,Home w/ Home Health Services,2019,SYM017,ABNORMAL FINDINGS WITHOUT DIAGNOSIS,GIS016,GI SYSTEM ENDOSCOPIC THERAPEUTIC PROCEDURES,724,OTHER INFECTIOUS & PARASITIC DISEASES,18,INFECTIOUS AND PARASITIC DISEASES (SYSTEMIC OR UNSPECIFIED SITES),4,Extreme,Extreme,Medical,Medicaid,,,,,true,280283.97,75780.74
New York City,Manhattan,7002053,001463,NYU Langone Hospitals,30 to 49,115,F,Other Race,Not Span/Hispanic,6,Emergency,Home or Self Care,2019,INF001,TUBERCULOSIS,OTR004,ISOLATION PROCEDURES,724,OTHER INFECTIOUS & PARASITIC DISEASES,18,INFECTIOUS AND PARASITIC DISEASES (SYSTEMIC OR UNSPECIFIED SITES),1,Minor,Minor,Medical,Medicaid,,,,,true,45649.92,21112.26
New York City,Manhattan,7002053,001463,NYU Langone Hospitals,70 or Older,100,F,Other Race,Not Span/Hispanic,6,Emergency,Home or Self Care,2019,SYM017,ABNORMAL FINDINGS WITHOUT DIAGNOSIS,,,724,OTHER INFECTIOUS & PARASITIC DISEASES,18,INFECTIOUS AND PARASITIC DISEASES (SYSTEMIC OR UNSPECIFIED SITES),1,Minor,Minor,Medical,Medicare,Medicare,,,,true,125266.87,34748.51
New York City,Manhattan,7002053,001463,NYU Langone Hospitals,70 or Older,100,F,White,Not Span/Hispanic,2,Emergency,Home or Self Care,2019,SYM017,ABNORMAL FINDINGS WITHOUT DIAGNOSIS,,,724,OTHER INFECTIOUS & PARASITIC DISEASES,18,INFECTIOUS AND PARASITIC DISEASES (SYSTEMIC OR UNSPECIFIED SITES),1,Minor,Moderate,Medical,Private Health Insurance,Medicare,,,,true,22988.86,7670.16
New York City,Manhattan,7002053,001463,NYU Langone Hospitals,50 to 69,100,M,Black/African American,Not Span/Hispanic,4,Emergency,Inpatient Rehabilitation Facility,2019,SYM017,ABNORMAL FINDINGS WITHOUT DIAGNOSIS,CAR024,VENOUS AND ARTERIAL CATHETER PLACEMENT,724,OTHER INFECTIOUS & PARASITIC DISEASES,18,INFECTIOUS AND PARASITIC DISEASES (SYSTEMIC OR UNSPECIFIED SITES),3,Major,Major,Medical,Medicare,Medicaid,,,,true,86072.02,25983.85
New York City,Manhattan,7002053,001463,NYU Langone Hospitals,30 to 49,112,F,White,Not Span/Hispanic,1,Emergency,Home or Self Care,2019,SYM017,ABNORMAL FINDINGS WITHOUT DIAGNOSIS,,,724,OTHER INFECTIOUS & PARASITIC DISEASES,18,INFECTIOUS AND PARASITIC DISEASES (SYSTEMIC OR UNSPECIFIED SITES),1,Minor,Moderate,Medical,Private Health Insurance,,,,,true,12114.69,4098.72
New York City,Manhattan,7002053,001463,NYU Langone Hospitals,30 to 49,104,M,Black/African American,Not Span/Hispanic,2,Emergency,Home or Self Care,2019,SYM017,ABNORMAL FINDINGS WITHOUT DIAGNOSIS,,,724,OTHER INFECTIOUS & PARASITIC DISEASES,18,INFECTIOUS AND PARASITIC DISEASES (SYSTEMIC OR UNSPECIFIED SITES),2,Moderate,Moderate,Medical,Medicare,Medicaid,,,,false,66703.59,10079.15
New York City,Manhattan,7002053,001463,NYU Langone Hospitals,0 to 17,100,M,White,Not Span/Hispanic,1,Emergency,Home or Self Care,2019,MUS001,INFECTIVE ARTHRITIS,MST001,ARTHROCENTESIS,724,OTHER INFECTIOUS & PARASITIC DISEASES,18,INFECTIOUS AND PARASITIC DISEASES (SYSTEMIC OR UNSPECIFIED SITES),1,Minor,Minor,Medical,Blue Cross/Blue Shield,,,,,true,15446.38,4556.45
New York City,Manhattan,7002053,001463,NYU Langone Hospitals,70 or Older,100,F,White,Not Span/Hispanic,5,Emergency,Home or Self Care,2019,INF003,BACTERIAL INFECTIONS,,,724,OTHER INFECTIOUS & PARASITIC DISEASES,18,INFECTIOUS AND PARASITIC DISEASES (SYSTEMIC OR UNSPECIFIED SITES),4,Extreme,Extreme,Medical,Medicaid,,,,,true,53056.36,19286.73
New York City,Manhattan,7002053,001463,NYU Langone Hospitals,0 to 17,103,M,Other Race,Spanish/Hispanic,5,Urgent,Home or Self Care,2019,INF004,FUNGAL INFECTIONS,HEP001,LIVER BIOPSY,724,OTHER INFECTIOUS & PARASITIC DISEASES,18,INFECTIOUS AND PARASITIC DISEASES (SYSTEMIC OR UNSPECIFIED SITES),3,Major,Moderate,Medical,Private Health Insurance,Medicaid,,,,false,81515.81,16310.51
New York City,Manhattan,7002053,001463,NYU Langone Hospitals,18 to 29,100,F,White,Not Span/Hispanic,3,Emergency,Home or Self Care,2019,SYM017,ABNORMAL FINDINGS WITHOUT DIAGNOSIS,,,724,OTHER INFECTIOUS & PARASITIC DISEASES,18,INFECTIOUS AND PARASITIC DISEASES (SYSTEMIC OR UNSPECIFIED SITES),1,Minor,Minor,Medical,Private Health Insurance,,,,,true,34860.92,11880.76
New York City,Manhattan,7002053,001463,NYU Langone Hospitals,70 or Older,112,M,White,Not Span/Hispanic,1,Emergency,Home or Self Care,2019,SYM017,ABNORMAL FINDINGS WITHOUT DIAGNOSIS,CNS002,LUMBAR PUNCTURE,724,OTHER INFECTIOUS & PARASITIC DISEASES,18,INFECTIOUS AND PARASITIC DISEASES (SYSTEMIC OR UNSPECIFIED SITES),3,Major,Major,Medical,Medicare,Medicare,,,,true,51603.59,8410.55
New York City,Manhattan,7002053,001463,NYU Langone Hospitals,18 to 29,100,M,Other Race,Unknown,2,Emergency,Home or Self Care,2019,INF009,"PARASITIC, OTHER SPECIFIED AND UNSPECIFIED INFECTIONS",ADM021,"ADMINISTRATION OF THERAPEUTIC SUBSTANCES, NEC",724,OTHER INFECTIOUS & PARASITIC DISEASES,18,INFECTIOUS AND PARASITIC DISEASES (SYSTEMIC OR UNSPECIFIED SITES),1,Minor,Minor,Medical,Private Health Insurance,,,,,false,24571.75,7172.88
New York City,Manhattan,7002053,001463,NYU Langone Hospitals,30 to 49,112,F,Other Race,Not Span/Hispanic,1,Emergency,Home or Self Care,2019,INF004,FUNGAL INFECTIONS,,,724,OTHER INFECTIOUS & PARASITIC DISEASES,18,INFECTIOUS AND PARASITIC DISEASES (SYSTEMIC OR UNSPECIFIED SITES),2,Moderate,Minor,Medical,Blue Cross/Blue Shield,Blue Cross/Blue Shield,,,,true,24228.51,4931.19
New York City,Manhattan,7002053,001463,NYU Langone Hospitals,30 to 49,112,M,White,Not Span/Hispanic,10,Emergency,Home or Self Care,2019,SYM017,ABNORMAL FINDINGS WITHOUT DIAGNOSIS,SKB001,SKIN BIOPSY AND DIAGNOSTIC DRAINAGE,724,OTHER INFECTIOUS & PARASITIC DISEASES,18,INFECTIOUS AND PARASITIC DISEASES (SYSTEMIC OR UNSPECIFIED SITES),1,Minor,Minor,Medical,Private Health Insurance,,,,,false,101162.72,35460.87
New York City,Manhattan,7002053,001463,NYU Langone Hospitals,70 or Older,113,M,White,Not Span/Hispanic,1,Emergency,Home w/ Home Health Services,2019,SYM017,ABNORMAL FINDINGS WITHOUT DIAGNOSIS,,,724,OTHER INFECTIOUS & PARASITIC DISEASES,18,INFECTIOUS AND PARASITIC DISEASES (SYSTEMIC OR UNSPECIFIED SITES),1,Minor,Moderate,Medical,Medicare,Medicare,,,,true,33486.25,11988.83
New York City,Manhattan,7002053,001463,NYU Langone Hospitals,50 to 69,113,M,White,Not Span/Hispanic,4,Emergency,Home or Self Care,2019,SYM017,ABNORMAL FINDINGS WITHOUT DIAGNOSIS,CAR024,VENOUS AND ARTERIAL CATHETER PLACEMENT,724,OTHER INFECTIOUS & PARASITIC DISEASES,18,INFECTIOUS AND PARASITIC DISEASES (SYSTEMIC OR UNSPECIFIED SITES),1,Minor,Moderate,Medical,Private Health Insurance,Medicare,,,,true,43563.17,15559.6
New York City,Manhattan,7002053,001463,NYU Langone Hospitals,50 to 69,112,F,White,Not Span/Hispanic,1,Emergency,Home or Self Care,2019,INF009,"PARASITIC, OTHER SPECIFIED AND UNSPECIFIED INFECTIONS",ADM001,TRANSFUSION OF BLOOD AND BLOOD PRODUCTS,724,OTHER INFECTIOUS & PARASITIC DISEASES,18,INFECTIOUS AND PARASITIC DISEASES (SYSTEMIC OR UNSPECIFIED SITES),2,Moderate,Minor,Medical,Medicare,Private Health Insurance,,,,true,44377.34,13923.06
New York City,Manhattan,7002053,001463,NYU Langone Hospitals,30 to 49,112,M,White,Not Span/Hispanic,5,Emergency,Home or Self Care,2019,INF003,BACTERIAL INFECTIONS,,,724,OTHER INFECTIOUS & PARASITIC DISEASES,18,INFECTIOUS AND PARASITIC DISEASES (SYSTEMIC OR UNSPECIFIED SITES),2,Moderate,Moderate,Medical,Blue Cross/Blue Shield,,,,,true,92354.78,25653.98
New York City,Manhattan,7002053,001463,NYU Langone Hospitals,50 to 69,112,M,White,Not Span/Hispanic,3,Emergency,Home or Self Care,2019,INF009,"PARASITIC, OTHER SPECIFIED AND UNSPECIFIED INFECTIONS",,,724,OTHER INFECTIOUS & PARASITIC DISEASES,18,INFECTIOUS AND PARASITIC DISEASES (SYSTEMIC OR UNSPECIFIED SITES),2,Moderate,Moderate,Medical,Private Health Insurance,,,,,true,38112.6,12177.82
New York City,Manhattan,7002053,001463,NYU Langone Hospitals,50 to 69,104,M,Black/African American,Not Span/Hispanic,3,Emergency,Home or Self Care,2019,INF009,"PARASITIC, OTHER SPECIFIED AND UNSPECIFIED INFECTIONS",,,724,OTHER INFECTIOUS & PARASITIC DISEASES,18,INFECTIOUS AND PARASITIC DISEASES (SYSTEMIC OR UNSPECIFIED SITES),2,Moderate,Minor,Medical,Private Health Insurance,,,,,true,30017.26,11121.9
New York City,Manhattan,7002053,001463,NYU Langone Hospitals,50 to 69,100,F,Other Race,Not Span/Hispanic,1,Emergency,Home or Self Care,2019,INF009,"PARASITIC, OTHER SPECIFIED AND UNSPECIFIED INFECTIONS",,,724,OTHER INFECTIOUS & PARASITIC DISEASES,18,INFECTIOUS AND PARASITIC DISEASES (SYSTEMIC OR UNSPECIFIED SITES),3,Major,Moderate,Medical,Blue Cross/Blue Shield,,,,,true,28026.16,9915.34
New York City,Manhattan,7002053,001463,NYU Langone Hospitals,30 to 49,100,F,White,Not Span/Hispanic,2,Emergency,Home or Self Care,2019,RSP016,OTHER SPECIFIED AND UNSPECIFIED LOWER RESPIRATORY DISEASE,,,724,OTHER INFECTIOUS & PARASITIC DISEASES,18,INFECTIOUS AND PARASITIC DISEASES (SYSTEMIC OR UNSPECIFIED SITES),3,Major,Moderate,Medical,Private Health Insurance,,,,,true,28179.17,8524.79
New York City,Manhattan,7002053,001463,NYU Langone Hospitals,50 to 69,113,M,Other Race,Not Span/Hispanic,5,Emergency,Home or Self Care,2019,SYM017,ABNORMAL FINDINGS WITHOUT DIAGNOSIS,,,724,OTHER INFECTIOUS & PARASITIC DISEASES,18,INFECTIOUS AND PARASITIC DISEASES (SYSTEMIC OR UNSPECIFIED SITES),4,Extreme,Moderate,Medical,Private Health Insurance,,,,,true,66054.32,20203.4
New York City,Manhattan,7002053,001463,NYU Langone Hospitals,30 to 49,111,M,White,Not Span/Hispanic,6,Emergency,Home or Self Care,2019,INF010,SEXUALLY TRANSMITTED INFECTIONS (EXCLUDING HIV AND HEPATITIS),CNS002,LUMBAR PUNCTURE,724,OTHER INFECTIOUS & PARASITIC DISEASES,18,INFECTIOUS AND PARASITIC DISEASES (SYSTEMIC OR UNSPECIFIED SITES),1,Minor,Minor,Medical,Private Health Insurance,,,,,true,111800.91,25822.72
New York City,Manhattan,7002053,001463,NYU Langone Hospitals,18 to 29,100,F,White,Not Span/Hispanic,6,Emergency,Home w/ Home Health Services,2019,SYM017,ABNORMAL FINDINGS WITHOUT DIAGNOSIS,CAR024,VENOUS AND ARTERIAL CATHETER PLACEMENT,724,OTHER INFECTIOUS & PARASITIC DISEASES,18,INFECTIOUS AND PARASITIC DISEASES (SYSTEMIC OR UNSPECIFIED SITES),1,Minor,Minor,Medical,Private Health Insurance,,,,,true,118074.4,27016.21
New York City,Manhattan,7002053,001463,NYU Langone Hospitals,70 or Older,115,M,White,Not Span/Hispanic,3,Emergency,Home w/ Home Health Services,2019,SYM017,ABNORMAL FINDINGS WITHOUT DIAGNOSIS,,,724,OTHER INFECTIOUS & PARASITIC DISEASES,18,INFECTIOUS AND PARASITIC DISEASES (SYSTEMIC OR UNSPECIFIED SITES),2,Moderate,Major,Medical,Medicare,Blue Cross/Blue Shield,Blue Cross/Blue Shield,,,true,31753.26,11761.49
New York City,Manhattan,7002053,001463,NYU Langone Hospitals,0 to 17,100,M,White,Not Span/Hispanic,6,Emergency,Home or Self Care,2019,SYM017,ABNORMAL FINDINGS WITHOUT DIAGNOSIS,CNS002,LUMBAR PUNCTURE,724,OTHER INFECTIOUS & PARASITIC DISEASES,18,INFECTIOUS AND PARASITIC DISEASES (SYSTEMIC OR UNSPECIFIED SITES),1,Minor,Minor,Medical,Private Health Insurance,,,,,true,55033.67,17748.93
New York City,Manhattan,7002053,001463,NYU Langone Hospitals,0 to 17,112,M,White,Not Span/Hispanic,2,Emergency,Home or Self Care,2019,SYM017,ABNORMAL FINDINGS WITHOUT DIAGNOSIS,,,724,OTHER INFECTIOUS & PARASITIC DISEASES,18,INFECTIOUS AND PARASITIC DISEASES (SYSTEMIC OR UNSPECIFIED SITES),2,Moderate,Minor,Medical,Medicaid,,,,,true,20450.32,6460.16
New York City,Manhattan,7002053,001463,NYU Langone Hospitals,50 to 69,OOS,M,White,Not Span/Hispanic,4,Emergency,Home or Self Care,2019,SYM017,ABNORMAL FINDINGS WITHOUT DIAGNOSIS,ADM001,TRANSFUSION OF BLOOD AND BLOOD PRODUCTS,724,OTHER INFECTIOUS & PARASITIC DISEASES,18,INFECTIOUS AND PARASITIC DISEASES (SYSTEMIC OR UNSPECIFIED SITES),4,Extreme,Major,Medical,Private Health Insurance,,,,,true,56561.61,17132.42
New York City,Manhattan,7002053,001463,NYU Langone Hospitals,0 to 17,112,M,White,Not Span/Hispanic,2,Emergency,Home or Self Care,2019,PNL009,PERINATAL INFECTIONS,,,724,OTHER INFECTIOUS & PARASITIC DISEASES,18,INFECTIOUS AND PARASITIC DISEASES (SYSTEMIC OR UNSPECIFIED SITES),2,Moderate,Minor,Medical,Private Health Insurance,,,UNKN,,true,28869.14,7459.3
New York City,Manhattan,7002053,001463,NYU Langone Hospitals,50 to 69,113,F,Other Race,Spanish/Hispanic,5,Emergency,Home or Self Care,2019,INF003,BACTERIAL INFECTIONS,,,724,OTHER INFECTIOUS & PARASITIC DISEASES,18,INFECTIOUS AND PARASITIC DISEASES (SYSTEMIC OR UNSPECIFIED SITES),2,Moderate,Moderate,Medical,Private Health Insurance,Blue Cross/Blue Shield,,,,true,74063.1,23173.93
New York City,Manhattan,7002053,001463,NYU Langone Hospitals,50 to 69,100,F,White,Not Span/Hispanic,5,Emergency,Home or Self Care,2019,INF009,"PARASITIC, OTHER SPECIFIED AND UNSPECIFIED INFECTIONS",CNS002,LUMBAR PUNCTURE,724,OTHER INFECTIOUS & PARASITIC DISEASES,18,INFECTIOUS AND PARASITIC DISEASES (SYSTEMIC OR UNSPECIFIED SITES),1,Minor,Minor,Medical,Medicare,Medicare,,,,true,76201.77,20486.72
New York City,Manhattan,7002053,001463,NYU Langone Hospitals,70 or Older,112,M,White,Not Span/Hispanic,1,Emergency,Home or Self Care,2019,INF009,"PARASITIC, OTHER SPECIFIED AND UNSPECIFIED INFECTIONS",,,724,OTHER INFECTIOUS & PARASITIC DISEASES,18,INFECTIOUS AND PARASITIC DISEASES (SYSTEMIC OR UNSPECIFIED SITES),3,Major,Major,Medical,Medicare,Blue Cross/Blue Shield,,,,true,68861.65,15142.42
New York City,Manhattan,7002053,001463,NYU Langone Hospitals,0 to 17,100,M,White,Not Span/Hispanic,1,Emergency,Home or Self Care,2019,SYM017,ABNORMAL FINDINGS WITHOUT DIAGNOSIS,,,724,OTHER INFECTIOUS & PARASITIC DISEASES,18,INFECTIOUS AND PARASITIC DISEASES (SYSTEMIC OR UNSPECIFIED SITES),2,Moderate,Moderate,Medical,Medicaid,,,,,true,16835.65,4136.21
New York City,Manhattan,7002053,001463,NYU Langone Hospitals,70 or Older,115,M,White,Not Span/Hispanic,3,Emergency,Home w/ Home Health Services,2019,SYM017,ABNORMAL FINDINGS WITHOUT DIAGNOSIS,,,724,OTHER INFECTIOUS & PARASITIC DISEASES,18,INFECTIOUS AND PARASITIC DISEASES (SYSTEMIC OR UNSPECIFIED SITES),2,Moderate,Major,Medical,Medicare,Blue Cross/Blue Shield,Blue Cross/Blue Shield,,,true,34288.73,12106.77
New York City,Manhattan,7002053,001463,NYU Langone Hospitals,50 to 69,100,F,White,Spanish/Hispanic,3,Emergency,Home or Self Care,2019,SYM017,ABNORMAL FINDINGS WITHOUT DIAGNOSIS,,,724,OTHER INFECTIOUS & PARASITIC DISEASES,18,INFECTIOUS AND PARASITIC DISEASES (SYSTEMIC OR UNSPECIFIED SITES),1,Minor,Minor,Medical,Private Health Insurance,,,,,true,60569.89,15539.24
New York City,Manhattan,7002053,001463,NYU Langone Hospitals,0 to 17,112,F,Other Race,Unknown,3,Emergency,Home or Self Care,2019,INF009,"PARASITIC, OTHER SPECIFIED AND UNSPECIFIED INFECTIONS",,,724,OTHER INFECTIOUS & PARASITIC DISEASES,18,INFECTIOUS AND PARASITIC DISEASES (SYSTEMIC OR UNSPECIFIED SITES),2,Moderate,Minor,Medical,Private Health Insurance,,,,,true,28860.26,9298.47
New York City,Manhattan,7002053,001463,NYU Langone Hospitals,50 to 69,112,M,Multi-racial,Not Span/Hispanic,1,Emergency,Home or Self Care,2019,INF009,"PARASITIC, OTHER SPECIFIED AND UNSPECIFIED INFECTIONS",,,724,OTHER INFECTIOUS & PARASITIC DISEASES,18,INFECTIOUS AND PARASITIC DISEASES (SYSTEMIC OR UNSPECIFIED SITES),2,Moderate,Minor,Medical,Private Health Insurance,,,,,true,43917.25,13198.35
New York City,Manhattan,7002053,001463,NYU Langone Hospitals,30 to 49,112,F,Other Race,Not Span/Hispanic,2,Emergency,Home or Self Care,2019,INF009,"PARASITIC, OTHER SPECIFIED AND UNSPECIFIED INFECTIONS",,,724,OTHER INFECTIOUS & PARASITIC DISEASES,18,INFECTIOUS AND PARASITIC DISEASES (SYSTEMIC OR UNSPECIFIED SITES),3,Major,Major,Medical,Private Health Insurance,,,,,true,42348.7,12893.7
New York City,Manhattan,7002053,001463,NYU Langone Hospitals,18 to 29,112,F,White,Not Span/Hispanic,1,Emergency,Home or Self Care,2019,MUS001,INFECTIVE ARTHRITIS,MST001,ARTHROCENTESIS,724,OTHER INFECTIOUS & PARASITIC DISEASES,18,INFECTIOUS AND PARASITIC DISEASES (SYSTEMIC OR UNSPECIFIED SITES),1,Minor,Minor,Medical,Private Health Insurance,,,,,true,53350.3,8957.41
New York City,Manhattan,7002053,001463,NYU Langone Hospitals,70 or Older,100,M,White,Not Span/Hispanic,4,Emergency,Home w/ Home Health Services,2019,INF009,"PARASITIC, OTHER SPECIFIED AND UNSPECIFIED INFECTIONS",IMG008,ULTRASONOGRAPHY,724,OTHER INFECTIOUS & PARASITIC DISEASES,18,INFECTIOUS AND PARASITIC DISEASES (SYSTEMIC OR UNSPECIFIED SITES),3,Major,Major,Medical,Medicare,,,,,true,55295.6,16906.71
New York City,Manhattan,7002053,001463,NYU Langone Hospitals,30 to 49,100,M,Other Race,Spanish/Hispanic,3,Emergency,Home or Self Care,2019,INF009,"PARASITIC, OTHER SPECIFIED AND UNSPECIFIED INFECTIONS",,,724,OTHER INFECTIOUS & PARASITIC DISEASES,18,INFECTIOUS AND PARASITIC DISEASES (SYSTEMIC OR UNSPECIFIED SITES),2,Moderate,Minor,Medical,Private Health Insurance,,,,,true,62369.43,15475.74
New York City,Manhattan,7002053,001463,NYU Langone Hospitals,50 to 69,104,M,Black/African American,Not Span/Hispanic,1,Emergency,Home or Self Care,2019,INF009,"PARASITIC, OTHER SPECIFIED AND UNSPECIFIED INFECTIONS",,,724,OTHER INFECTIOUS & PARASITIC DISEASES,18,INFECTIOUS AND PARASITIC DISEASES (SYSTEMIC OR UNSPECIFIED SITES),2,Moderate,Minor,Medical,Blue Cross/Blue Shield,,,,,true,15473.78,4496.1
New York City,Manhattan,7002053,001463,NYU Langone Hospitals,50 to 69,105,M,White,Not Span/Hispanic,5,Emergency,Home w/ Home Health Services,2019,INF010,SEXUALLY TRANSMITTED INFECTIONS (EXCLUDING HIV AND HEPATITIS),CNS002,LUMBAR PUNCTURE,724,OTHER INFECTIOUS & PARASITIC DISEASES,18,INFECTIOUS AND PARASITIC DISEASES (SYSTEMIC OR UNSPECIFIED SITES),2,Moderate,Minor,Medical,Medicare,Blue Cross/Blue Shield,,,,true,96937.01,24403.6
New York City,Manhattan,7002053,001463,NYU Langone Hospitals,70 or Older,104,F,Other Race,Not Span/Hispanic,2,Emergency,Home w/ Home Health Services,2019,SYM017,ABNORMAL FINDINGS WITHOUT DIAGNOSIS,,,724,OTHER INFECTIOUS & PARASITIC DISEASES,18,INFECTIOUS AND PARASITIC DISEASES (SYSTEMIC OR UNSPECIFIED SITES),1,Minor,Moderate,Medical,Private Health Insurance,Medicare,,,,true,26343.72,7962.95
New York City,Manhattan,7002053,001463,NYU Langone Hospitals,70 or Older,112,M,White,Not Span/Hispanic,8,Emergency,Home or Self Care,2019,SYM017,ABNORMAL FINDINGS WITHOUT DIAGNOSIS,,,724,OTHER INFECTIOUS & PARASITIC DISEASES,18,INFECTIOUS AND PARASITIC DISEASES (SYSTEMIC OR UNSPECIFIED SITES),3,Major,Moderate,Medical,Medicare,Medicaid,,,,true,77805.05,31473.27
New York City,Manhattan,7002053,001463,NYU Langone Hospitals,0 to 17,100,F,Other Race,Spanish/Hispanic,4,Emergency,Home or Self Care,2019,NVS001,MENINGITIS,CNS002,LUMBAR PUNCTURE,724,OTHER INFECTIOUS & PARASITIC DISEASES,18,INFECTIOUS AND PARASITIC DISEASES (SYSTEMIC OR UNSPECIFIED SITES),4,Extreme,Moderate,Medical,Medicaid,,,,,true,44400.35,12996.03
New York City,Manhattan,7002053,001463,NYU Langone Hospitals,70 or Older,100,M,White,Not Span/Hispanic,4,Emergency,Home or Self Care,2019,SYM017,ABNORMAL FINDINGS WITHOUT DIAGNOSIS,,,724,OTHER INFECTIOUS & PARASITIC DISEASES,18,INFECTIOUS AND PARASITIC DISEASES (SYSTEMIC OR UNSPECIFIED SITES),3,Major,Major,Medical,Medicare,Blue Cross/Blue Shield,,,,true,54134.76,16819.85
New York City,Manhattan,7002053,001463,NYU Langone Hospitals,0 to 17,143,F,Multi-racial,Not Span/Hispanic,6,Urgent,Home or Self Care,2019,SYM017,ABNORMAL FINDINGS WITHOUT DIAGNOSIS,,,724,OTHER INFECTIOUS & PARASITIC DISEASES,18,INFECTIOUS AND PARASITIC DISEASES (SYSTEMIC OR UNSPECIFIED SITES),3,Major,Moderate,Medical,Medicaid,,,,,false,72127.02,17774.26
New York City,Manhattan,7002053,001463,NYU Langone Hospitals,18 to 29,OOS,F,White,Not Span/Hispanic,1,Emergency,Home or Self Care,2019,INF009,"PARASITIC, OTHER SPECIFIED AND UNSPECIFIED INFECTIONS",,,724,OTHER INFECTIOUS & PARASITIC DISEASES,18,INFECTIOUS AND PARASITIC DISEASES (SYSTEMIC OR UNSPECIFIED SITES),2,Moderate,Minor,Medical,Blue Cross/Blue Shield,,,,,true,39295.77,11210.96
New York City,Manhattan,7002053,001463,NYU Langone Hospitals,70 or Older,112,M,White,Not Span/Hispanic,5,Emergency,Home w/ Home Health Services,2019,SYM017,ABNORMAL FINDINGS WITHOUT DIAGNOSIS,CAR024,VENOUS AND ARTERIAL CATHETER PLACEMENT,724,OTHER INFECTIOUS & PARASITIC DISEASES,18,INFECTIOUS AND PARASITIC DISEASES (SYSTEMIC OR UNSPECIFIED SITES),1,Minor,Moderate,Medical,Medicare,Private Health Insurance,,,,true,74672.16,20151.86
New York City,Manhattan,7002053,001463,NYU Langone Hospitals,50 to 69,100,M,White,Not Span/Hispanic,6,Emergency,Home w/ Home Health Services,2019,RSP016,OTHER SPECIFIED AND UNSPECIFIED LOWER RESPIRATORY DISEASE,RES001,BRONCHOSCOPY (DIAGNOSTIC),724,OTHER INFECTIOUS & PARASITIC DISEASES,18,INFECTIOUS AND PARASITIC DISEASES (SYSTEMIC OR UNSPECIFIED SITES),3,Major,Moderate,Medical,Medicare,Medicare,,,,false,89097.9,23639.15
New York City,Manhattan,7002053,001463,NYU Langone Hospitals,70 or Older,100,M,Other Race,Spanish/Hispanic,15,Emergency,Skilled Nursing Home,2019,SYM017,ABNORMAL FINDINGS WITHOUT DIAGNOSIS,ADM001,TRANSFUSION OF BLOOD AND BLOOD PRODUCTS,724,OTHER INFECTIOUS & PARASITIC DISEASES,18,INFECTIOUS AND PARASITIC DISEASES (SYSTEMIC OR UNSPECIFIED SITES),4,Extreme,Extreme,Medical,Medicare,Medicaid,,,,true,219829.76,65190.85
New York City,Manhattan,7002053,001463,NYU Langone Hospitals,70 or Older,111,M,White,Not Span/Hispanic,5,Emergency,Home w/ Home Health Services,2019,SYM017,ABNORMAL FINDINGS WITHOUT DIAGNOSIS,,,724,OTHER INFECTIOUS & PARASITIC DISEASES,18,INFECTIOUS AND PARASITIC DISEASES (SYSTEMIC OR UNSPECIFIED SITES),2,Moderate,Moderate,Medical,Medicare,Private Health Insurance,,,,false,75454.42,20144.35
New York City,Manhattan,7002053,001463,NYU Langone Hospitals,0 to 17,112,F,White,Not Span/Hispanic,3,Emergency,Home or Self Care,2019,SYM017,ABNORMAL FINDINGS WITHOUT DIAGNOSIS,OTR004,ISOLATION PROCEDURES,724,OTHER INFECTIOUS & PARASITIC DISEASES,18,INFECTIOUS AND PARASITIC DISEASES (SYSTEMIC OR UNSPECIFIED SITES),1,Minor,Minor,Medical,Private Health Insurance,,,,,true,40050.23,11563.63
New York City,Manhattan,7002053,001463,NYU Langone Hospitals,70 or Older,OOS,M,White,Not Span/Hispanic,1,Emergency,Home or Self Care,2019,RSP016,OTHER SPECIFIED AND UNSPECIFIED LOWER RESPIRATORY DISEASE,,,724,OTHER INFECTIOUS & PARASITIC DISEASES,18,INFECTIOUS AND PARASITIC DISEASES (SYSTEMIC OR UNSPECIFIED SITES),3,Major,Major,Medical,Medicare,Medicare,,,,true,14970.21,4568.86
New York City,Manhattan,7002053,001463,NYU Langone Hospitals,30 to 49,100,M,Black/African American,Not Span/Hispanic,4,Emergency,Home w/ Home Health Services,2019,SYM017,ABNORMAL FINDINGS WITHOUT DIAGNOSIS,IMG008,ULTRASONOGRAPHY,724,OTHER INFECTIOUS & PARASITIC DISEASES,18,INFECTIOUS AND PARASITIC DISEASES (SYSTEMIC OR UNSPECIFIED SITES),2,Moderate,Moderate,Medical,Private Health Insurance,,,,,true,70425.61,20442.45
New York City,Manhattan,7002053,001463,NYU Langone Hospitals,70 or Older,OOS,M,White,Not Span/Hispanic,2,Emergency,Home or Self Care,2019,INF004,FUNGAL INFECTIONS,,,724,OTHER INFECTIOUS & PARASITIC DISEASES,18,INFECTIOUS AND PARASITIC DISEASES (SYSTEMIC OR UNSPECIFIED SITES),4,Extreme,Major,Medical,Medicare,Medicare,,,,false,25358.52,7826.68
New York City,Manhattan,7002053,001463,NYU Langone Hospitals,18 to 29,100,F,White,Not Span/Hispanic,3,Emergency,Home or Self Care,2019,SYM017,ABNORMAL FINDINGS WITHOUT DIAGNOSIS,,,724,OTHER INFECTIOUS & PARASITIC DISEASES,18,INFECTIOUS AND PARASITIC DISEASES (SYSTEMIC OR UNSPECIFIED SITES),1,Minor,Moderate,Medical,Medicaid,,,,,true,27675.7,11064.48