Hospital Service Area,Hospital County,Operating Certificate Number,Permanent Facility Id,Facility Name,Age Group,Zip Code - 3 digits,Gender,Race,Ethnicity,Length of Stay,Type of Admission,Patient Disposition,Discharge Year,CCS Diagnosis Code,CCS Diagnosis Description,CCS Procedure Code,CCS Procedure Description,APR DRG Code,APR DRG Description,APR MDC Code,APR MDC Description,APR Severity of Illness Code,APR Severity of Illness Description,APR Risk of Mortality,APR Medical Surgical Description,Payment Typology 1,Payment Typology 2,Payment Typology 3,Birth Weight,Abortion Edit Indicator,Emergency Department Indicator,Total Charges,Total Costs
New York City,Bronx,7000006,001169,Montefiore Medical Center - Henry & Lucy Moses Div,18 to 29,104,M,Black/African American,Not Span/Hispanic,2,Emergency,Home or Self Care,2020,INF010,SEXUALLY TRANSMITTED INFECTIONS (EXCLUDING HIV AND HEPATITIS),,,724,OTHER INFECTIOUS & PARASITIC DISEASES,18,INFECTIOUS AND PARASITIC DISEASES (SYSTEMIC OR UNSPECIFIED SITES),1,Minor,Minor,Medical,Medicaid,,,,,N,27464,5902.37
New York City,Bronx,7000006,001169,Montefiore Medical Center - Henry & Lucy Moses Div,0 to 17,104,F,Other Race,Not Span/Hispanic,8,Emergency,Home or Self Care,2020,PNL009,PERINATAL INFECTIONS,ESA003,MECHANICAL VENTILATION,724,OTHER INFECTIOUS & PARASITIC DISEASES,18,INFECTIOUS AND PARASITIC DISEASES (SYSTEMIC OR UNSPECIFIED SITES),3,Major,Major,Medical,Medicaid,,,04600,,Y,147971.45,29222.2
New York City,Bronx,7000006,001169,Montefiore Medical Center - Henry & Lucy Moses Div,30 to 49,104,M,Other Race,Spanish/Hispanic,1,Emergency,Home or Self Care,2020,SYM017,ABNORMAL FINDINGS WITHOUT DIAGNOSIS,ADM015,ADMINISTRATION OF ANTIBIOTICS,724,OTHER INFECTIOUS & PARASITIC DISEASES,18,INFECTIOUS AND PARASITIC DISEASES (SYSTEMIC OR UNSPECIFIED SITES),1,Minor,Moderate,Medical,Medicare,Medicaid,,,,Y,21427.34,3324.91
New York City,Bronx,7000006,001169,Montefiore Medical Center - Henry & Lucy Moses Div,0 to 17,104,M,Other Race,Spanish/Hispanic,2,Emergency,Home or Self Care,2020,PNL009,PERINATAL INFECTIONS,CNS002,LUMBAR PUNCTURE,724,OTHER INFECTIOUS & PARASITIC DISEASES,18,INFECTIOUS AND PARASITIC DISEASES (SYSTEMIC OR UNSPECIFIED SITES),1,Minor,Minor,Medical,Medicaid,,,03300,,Y,33375.8,7151.16
New York City,Manhattan,7002032,001469,Mount Sinai Morningside,70 or Older,100,F,Other Race,Not Span/Hispanic,3,Emergency,Home w/ Home Health Services,2020,SYM017,ABNORMAL FINDINGS WITHOUT DIAGNOSIS,IMG008,ULTRASONOGRAPHY,724,OTHER INFECTIOUS & PARASITIC DISEASES,18,INFECTIOUS AND PARASITIC DISEASES (SYSTEMIC OR UNSPECIFIED SITES),2,Moderate,Moderate,Medical,Medicare,Medicare,Medicaid,,,Y,37930.75,8441.57
New York City,Manhattan,7002032,001466,Mount Sinai West,30 to 49,100,M,Black/African American,Not Span/Hispanic,2,Emergency,Home or Self Care,2020,INF009,"PARASITIC, OTHER SPECIFIED AND UNSPECIFIED INFECTIONS",ADM021,"ADMINISTRATION OF THERAPEUTIC SUBSTANCES, NEC",724,OTHER INFECTIOUS & PARASITIC DISEASES,18,INFECTIOUS AND PARASITIC DISEASES (SYSTEMIC OR UNSPECIFIED SITES),2,Moderate,Moderate,Medical,Medicaid,Self-Pay,,,,Y,27844.26,6031.18
New York City,Manhattan,7002024,001456,Mount Sinai Hospital,30 to 49,100,F,Other Race,Spanish/Hispanic,2,Emergency,Home or Self Care,2020,SYM017,ABNORMAL FINDINGS WITHOUT DIAGNOSIS,MAM015,"MEASUREMENT AND MONITORING, NEC",724,OTHER INFECTIOUS & PARASITIC DISEASES,18,INFECTIOUS AND PARASITIC DISEASES (SYSTEMIC OR UNSPECIFIED SITES),2,Moderate,Minor,Medical,Medicaid,Self-Pay,,,,Y,21991.54,5817.33
New York City,Bronx,7000006,003058,Montefiore Med Center - Jack D Weiler Hosp of A Einstein College Div,70 or Older,104,M,White,Spanish/Hispanic,9,Emergency,Home w/ Home Health Services,2020,SYM017,ABNORMAL FINDINGS WITHOUT DIAGNOSIS,ADM015,ADMINISTRATION OF ANTIBIOTICS,724,OTHER INFECTIOUS & PARASITIC DISEASES,18,INFECTIOUS AND PARASITIC DISEASES (SYSTEMIC OR UNSPECIFIED SITES),2,Moderate,Moderate,Medical,Medicare,Medicaid,,,,Y,91189.2,17816.02
New York City,Bronx,7000006,001169,Montefiore Medical Center - Henry & Lucy Moses Div,50 to 69,104,M,Other Race,Unknown,2,Emergency,Home or Self Care,2020,SYM017,ABNORMAL FINDINGS WITHOUT DIAGNOSIS,,,724,OTHER INFECTIOUS & PARASITIC DISEASES,18,INFECTIOUS AND PARASITIC DISEASES (SYSTEMIC OR UNSPECIFIED SITES),1,Minor,Minor,Medical,Private Health Insurance,,,,,Y,28178.04,4965.11
New York City,Bronx,7000006,001169,Montefiore Medical Center - Henry & Lucy Moses Div,0 to 17,104,F,Other Race,Spanish/Hispanic,5,Emergency,Home or Self Care,2020,PNL009,PERINATAL INFECTIONS,CNS002,LUMBAR PUNCTURE,724,OTHER INFECTIOUS & PARASITIC DISEASES,18,INFECTIOUS AND PARASITIC DISEASES (SYSTEMIC OR UNSPECIFIED SITES),2,Moderate,Minor,Medical,Medicaid,,,03000,,Y,61296.59,15658.59
New York City,Manhattan,7002054,003975,New York Presbyterian Hospital - Allen Hospital,50 to 69,104,M,Multi-racial,Not Span/Hispanic,3,Emergency,Home or Self Care,2020,SYM017,ABNORMAL FINDINGS WITHOUT DIAGNOSIS,IMG008,ULTRASONOGRAPHY,724,OTHER INFECTIOUS & PARASITIC DISEASES,18,INFECTIOUS AND PARASITIC DISEASES (SYSTEMIC OR UNSPECIFIED SITES),1,Minor,Minor,Medical,Medicaid,Medicaid,Self-Pay,,,Y,38900.72,8198.9
New York City,Manhattan,7002054,001464,New York-Presbyterian Hospital - Columbia Presbyterian Center,0 to 17,104,M,White,Spanish/Hispanic,12,Emergency,Home or Self Care,2020,PNL009,PERINATAL INFECTIONS,ESA004,NON-INVASIVE VENTILATION,724,OTHER INFECTIOUS & PARASITIC DISEASES,18,INFECTIOUS AND PARASITIC DISEASES (SYSTEMIC OR UNSPECIFIED SITES),3,Major,Moderate,Medical,Medicaid,Medicaid,Self-Pay,03400,,Y,197433.17,68075.38
New York City,Manhattan,7002054,001464,New York-Presbyterian Hospital - Columbia Presbyterian Center,0 to 17,104,M,Multi-racial,Not Span/Hispanic,2,Emergency,Home or Self Care,2020,INF003,BACTERIAL INFECTIONS,ADM015,ADMINISTRATION OF ANTIBIOTICS,724,OTHER INFECTIOUS & PARASITIC DISEASES,18,INFECTIOUS AND PARASITIC DISEASES (SYSTEMIC OR UNSPECIFIED SITES),1,Minor,Minor,Medical,Medicaid,Medicaid,Self-Pay,,,Y,27262.93,5707.49
New York City,Manhattan,7002054,001464,New York-Presbyterian Hospital - Columbia Presbyterian Center,50 to 69,104,F,Other Race,Not Span/Hispanic,1,Emergency,Home or Self Care,2020,SYM017,ABNORMAL FINDINGS WITHOUT DIAGNOSIS,,,724,OTHER INFECTIOUS & PARASITIC DISEASES,18,INFECTIOUS AND PARASITIC DISEASES (SYSTEMIC OR UNSPECIFIED SITES),1,Minor,Minor,Medical,Medicare,Medicare,Medicaid,,,Y,17639.23,3766.14
New York City,Manhattan,7002054,001464,New York-Presbyterian Hospital - Columbia Presbyterian Center,0 to 17,100,F,Multi-racial,Not Span/Hispanic,1,Emergency,Home or Self Care,2020,PNL009,PERINATAL INFECTIONS,ADM021,"ADMINISTRATION OF THERAPEUTIC SUBSTANCES, NEC",724,OTHER INFECTIOUS & PARASITIC DISEASES,18,INFECTIOUS AND PARASITIC DISEASES (SYSTEMIC OR UNSPECIFIED SITES),2,Moderate,Minor,Medical,Medicaid,Self-Pay,,04300,,Y,13114.42,2924.28
New York City,Manhattan,7002054,001464,New York-Presbyterian Hospital - Columbia Presbyterian Center,0 to 17,100,M,White,Not Span/Hispanic,2,Emergency,Home or Self Care,2020,PNL009,PERINATAL INFECTIONS,,,724,OTHER INFECTIOUS & PARASITIC DISEASES,18,INFECTIOUS AND PARASITIC DISEASES (SYSTEMIC OR UNSPECIFIED SITES),2,Moderate,Minor,Medical,Private Health Insurance,Self-Pay,,03900,,Y,23323.01,5106.24
New York City,Manhattan,7002054,001464,New York-Presbyterian Hospital - Columbia Presbyterian Center,0 to 17,104,M,Multi-racial,Not Span/Hispanic,1,Emergency,Home or Self Care,2020,SYM017,ABNORMAL FINDINGS WITHOUT DIAGNOSIS,ADM015,ADMINISTRATION OF ANTIBIOTICS,724,OTHER INFECTIOUS & PARASITIC DISEASES,18,INFECTIOUS AND PARASITIC DISEASES (SYSTEMIC OR UNSPECIFIED SITES),1,Minor,Moderate,Medical,Medicaid,Medicaid,Self-Pay,,,Y,14610.69,3404.86
New York City,Manhattan,7002054,001464,New York-Presbyterian Hospital - Columbia Presbyterian Center,70 or Older,100,F,Multi-racial,Multi-ethnic,9,Emergency,Home w/ Home Health Services,2020,SYM017,ABNORMAL FINDINGS WITHOUT DIAGNOSIS,CAR024,VENOUS AND ARTERIAL CATHETER PLACEMENT,724,OTHER INFECTIOUS & PARASITIC DISEASES,18,INFECTIOUS AND PARASITIC DISEASES (SYSTEMIC OR UNSPECIFIED SITES),1,Minor,Major,Medical,Medicare,Medicaid,Self-Pay,,,Y,113024.15,24935.08
New York City,Manhattan,7002054,001464,New York-Presbyterian Hospital - Columbia Presbyterian Center,30 to 49,100,M,Other Race,Spanish/Hispanic,1,Emergency,Home or Self Care,2020,SYM017,ABNORMAL FINDINGS WITHOUT DIAGNOSIS,,,724,OTHER INFECTIOUS & PARASITIC DISEASES,18,INFECTIOUS AND PARASITIC DISEASES (SYSTEMIC OR UNSPECIFIED SITES),1,Minor,Minor,Medical,Medicaid,Medicaid,Self-Pay,,,Y,17589.67,3933.63
New York City,Queens,7003010,001637,New York - Presbyterian/Queens,0 to 17,114,F,Other Race,Not Span/Hispanic,6,Emergency,Home or Self Care,2020,SYM017,ABNORMAL FINDINGS WITHOUT DIAGNOSIS,CAR024,VENOUS AND ARTERIAL CATHETER PLACEMENT,724,OTHER INFECTIOUS & PARASITIC DISEASES,18,INFECTIOUS AND PARASITIC DISEASES (SYSTEMIC OR UNSPECIFIED SITES),1,Minor,Minor,Medical,Private Health Insurance,Self-Pay,,,,N,49853.17,11939.92
New York City,Queens,7003010,001637,New York - Presbyterian/Queens,0 to 17,,M,Multi-racial,Spanish/Hispanic,2,Emergency,Home or Self Care,2020,EAR001,OTITIS MEDIA,ADM021,"ADMINISTRATION OF THERAPEUTIC SUBSTANCES, NEC",724,OTHER INFECTIOUS & PARASITIC DISEASES,18,INFECTIOUS AND PARASITIC DISEASES (SYSTEMIC OR UNSPECIFIED SITES),1,Minor,Minor,Medical,"Managed Care, Unspecified",Medicaid,Self-Pay,,,Y,18055.77,4472.81
New York City,Queens,7003010,001637,New York - Presbyterian/Queens,0 to 17,113,M,White,Not Span/Hispanic,5,Emergency,Home or Self Care,2020,PNL009,PERINATAL INFECTIONS,ADM021,"ADMINISTRATION OF THERAPEUTIC SUBSTANCES, NEC",724,OTHER INFECTIOUS & PARASITIC DISEASES,18,INFECTIOUS AND PARASITIC DISEASES (SYSTEMIC OR UNSPECIFIED SITES),2,Moderate,Minor,Medical,"Managed Care, Unspecified",Medicaid,Self-Pay,04100,,Y,34987.17,8810.61
New York City,Kings,7002053,001304,NYU Langone Hospital-Brooklyn,0 to 17,112,M,Other Race,Not Span/Hispanic,1,Emergency,Home or Self Care,2020,PNL009,PERINATAL INFECTIONS,ADM021,"ADMINISTRATION OF THERAPEUTIC SUBSTANCES, NEC",724,OTHER INFECTIOUS & PARASITIC DISEASES,18,INFECTIOUS AND PARASITIC DISEASES (SYSTEMIC OR UNSPECIFIED SITES),2,Moderate,Minor,Medical,Medicaid,,,03400,,Y,14177.36,3213.3
New York City,Manhattan,7002053,001463,NYU Langone Hospitals,18 to 29,100,M,Other Race,Not Span/Hispanic,1,Emergency,Home or Self Care,2020,SYM017,ABNORMAL FINDINGS WITHOUT DIAGNOSIS,,,724,OTHER INFECTIOUS & PARASITIC DISEASES,18,INFECTIOUS AND PARASITIC DISEASES (SYSTEMIC OR UNSPECIFIED SITES),1,Minor,Minor,Medical,Private Health Insurance,,,,,Y,30901.84,10130.51
New York City,Manhattan,7002054,001437,New York-Presbyterian/Lower Manhattan Hospital,18 to 29,100,M,White,Not Span/Hispanic,1,Emergency,Left Against Medical Advice,2020,SYM017,ABNORMAL FINDINGS WITHOUT DIAGNOSIS,ADM015,ADMINISTRATION OF ANTIBIOTICS,724,OTHER INFECTIOUS & PARASITIC DISEASES,18,INFECTIOUS AND PARASITIC DISEASES (SYSTEMIC OR UNSPECIFIED SITES),1,Minor,Minor,Medical,Medicaid,Self-Pay,,,,Y,18773.65,4143.76
New York City,Manhattan,7002054,001437,New York-Presbyterian/Lower Manhattan Hospital,30 to 49,113,M,White,Not Span/Hispanic,4,Emergency,Home or Self Care,2020,DIG001,INTESTINAL INFECTION,ADM017,ADMINISTRATION OF NUTRITIONAL AND ELECTROLYTIC SUBSTANCES,724,OTHER INFECTIOUS & PARASITIC DISEASES,18,INFECTIOUS AND PARASITIC DISEASES (SYSTEMIC OR UNSPECIFIED SITES),2,Moderate,Minor,Medical,Private Health Insurance,Self-Pay,,,,Y,53080.74,11083.76
New York City,Manhattan,7002054,001458,New York-Presbyterian Hospital - New York Weill Cornell Center,0 to 17,111,F,White,Not Span/Hispanic,3,Emergency,Home or Self Care,2020,PNL009,PERINATAL INFECTIONS,,,724,OTHER INFECTIOUS & PARASITIC DISEASES,18,INFECTIOUS AND PARASITIC DISEASES (SYSTEMIC OR UNSPECIFIED SITES),2,Moderate,Minor,Medical,Private Health Insurance,Self-Pay,,03400,,Y,52906.25,25745.71
New York City,Manhattan,7002054,001458,New York-Presbyterian Hospital - New York Weill Cornell Center,0 to 17,100,M,Multi-racial,Not Span/Hispanic,4,Emergency,Home or Self Care,2020,PNL009,PERINATAL INFECTIONS,ADM021,"ADMINISTRATION OF THERAPEUTIC SUBSTANCES, NEC",724,OTHER INFECTIOUS & PARASITIC DISEASES,18,INFECTIOUS AND PARASITIC DISEASES (SYSTEMIC OR UNSPECIFIED SITES),2,Moderate,Minor,Medical,Private Health Insurance,Self-Pay,,03300,,Y,82020.53,40027.43
New York City,Manhattan,7002054,001458,New York-Presbyterian Hospital - New York Weill Cornell Center,0 to 17,100,M,Multi-racial,Not Span/Hispanic,1,Emergency,Home or Self Care,2020,PNL009,PERINATAL INFECTIONS,ADM021,"ADMINISTRATION OF THERAPEUTIC SUBSTANCES, NEC",724,OTHER INFECTIOUS & PARASITIC DISEASES,18,INFECTIOUS AND PARASITIC DISEASES (SYSTEMIC OR UNSPECIFIED SITES),2,Moderate,Minor,Medical,Private Health Insurance,Self-Pay,,03700,,Y,18272.34,3864.1
New York City,Manhattan,7002054,001458,New York-Presbyterian Hospital - New York Weill Cornell Center,70 or Older,111,M,White,Not Span/Hispanic,4,Emergency,Home w/ Home Health Services,2020,SYM017,ABNORMAL FINDINGS WITHOUT DIAGNOSIS,ADM017,ADMINISTRATION OF NUTRITIONAL AND ELECTROLYTIC SUBSTANCES,724,OTHER INFECTIOUS & PARASITIC DISEASES,18,INFECTIOUS AND PARASITIC DISEASES (SYSTEMIC OR UNSPECIFIED SITES),1,Minor,Minor,Medical,Medicare,Private Health Insurance,Self-Pay,,,Y,60037.35,12491.4
New York City,Manhattan,7002054,001458,New York-Presbyterian Hospital - New York Weill Cornell Center,30 to 49,111,M,Black/African American,Not Span/Hispanic,1,Emergency,Home or Self Care,2020,SYM017,ABNORMAL FINDINGS WITHOUT DIAGNOSIS,,,724,OTHER INFECTIOUS & PARASITIC DISEASES,18,INFECTIOUS AND PARASITIC DISEASES (SYSTEMIC OR UNSPECIFIED SITES),1,Minor,Minor,Medical,"Managed Care, Unspecified",Medicaid,Self-Pay,,,Y,19744.69,4323.62
New York City,Manhattan,7002054,001458,New York-Presbyterian Hospital - New York Weill Cornell Center,0 to 17,100,F,White,Not Span/Hispanic,2,Emergency,Home or Self Care,2020,PNL009,PERINATAL INFECTIONS,CNS002,LUMBAR PUNCTURE,724,OTHER INFECTIOUS & PARASITIC DISEASES,18,INFECTIOUS AND PARASITIC DISEASES (SYSTEMIC OR UNSPECIFIED SITES),2,Moderate,Moderate,Medical,Private Health Insurance,Self-Pay,,03100,,Y,30362.74,6234.17
New York City,Manhattan,7002054,001458,New York-Presbyterian Hospital - New York Weill Cornell Center,70 or Older,OOS,M,Black/African American,Not Span/Hispanic,2,Emergency,Home or Self Care,2020,SYM017,ABNORMAL FINDINGS WITHOUT DIAGNOSIS,ADM017,ADMINISTRATION OF NUTRITIONAL AND ELECTROLYTIC SUBSTANCES,724,OTHER INFECTIOUS & PARASITIC DISEASES,18,INFECTIOUS AND PARASITIC DISEASES (SYSTEMIC OR UNSPECIFIED SITES),3,Major,Major,Medical,Medicare,Private Health Insurance,Self-Pay,,,Y,30321.66,6916.05
New York City,Manhattan,7002054,001458,New York-Presbyterian Hospital - New York Weill Cornell Center,0 to 17,100,M,White,Not Span/Hispanic,1,Emergency,Home or Self Care,2020,PNL009,PERINATAL INFECTIONS,ADM015,ADMINISTRATION OF ANTIBIOTICS,724,OTHER INFECTIOUS & PARASITIC DISEASES,18,INFECTIOUS AND PARASITIC DISEASES (SYSTEMIC OR UNSPECIFIED SITES),1,Minor,Minor,Medical,Private Health Insurance,,,04200,,Y,21365.54,4559.39
New York City,Kings,7001021,001306,New York - Presbyterian Brooklyn Methodist Hospital,18 to 29,114,M,Black/African American,Not Span/Hispanic,5,Emergency,Home or Self Care,2020,INF009,"PARASITIC, OTHER SPECIFIED AND UNSPECIFIED INFECTIONS",,,724,OTHER INFECTIOUS & PARASITIC DISEASES,18,INFECTIOUS AND PARASITIC DISEASES (SYSTEMIC OR UNSPECIFIED SITES),2,Moderate,Moderate,Medical,"Managed Care, Unspecified",Medicaid,Self-Pay,,,Y,49657.66,23717.37
New York City,Kings,7001021,001306,New York - Presbyterian Brooklyn Methodist Hospital,0 to 17,112,F,White,Spanish/Hispanic,1,Emergency,Home or Self Care,2020,PNL009,PERINATAL INFECTIONS,,,724,OTHER INFECTIOUS & PARASITIC DISEASES,18,INFECTIOUS AND PARASITIC DISEASES (SYSTEMIC OR UNSPECIFIED SITES),1,Minor,Minor,Medical,"Managed Care, Unspecified",Medicaid,Self-Pay,03400,,Y,7297.8,3592.94
New York City,Kings,7001021,001306,New York - Presbyterian Brooklyn Methodist Hospital,70 or Older,112,F,Black/African American,Not Span/Hispanic,7,Emergency,Skilled Nursing Home,2020,SYM017,ABNORMAL FINDINGS WITHOUT DIAGNOSIS,ESA004,NON-INVASIVE VENTILATION,724,OTHER INFECTIOUS & PARASITIC DISEASES,18,INFECTIOUS AND PARASITIC DISEASES (SYSTEMIC OR UNSPECIFIED SITES),2,Moderate,Major,Medical,Medicare,Private Health Insurance,Self-Pay,,,Y,57457.16,17637.35
New York City,Manhattan,7002054,001458,New York-Presbyterian Hospital - New York Weill Cornell Center,0 to 17,100,F,Multi-racial,Not Span/Hispanic,2,Emergency,Home or Self Care,2020,PNL009,PERINATAL INFECTIONS,,,724,OTHER INFECTIOUS & PARASITIC DISEASES,18,INFECTIOUS AND PARASITIC DISEASES (SYSTEMIC OR UNSPECIFIED SITES),2,Moderate,Minor,Medical,Blue Cross/Blue Shield,Self-Pay,,03800,,Y,26682.98,8333.42
New York City,Manhattan,7002054,001458,New York-Presbyterian Hospital - New York Weill Cornell Center,70 or Older,100,M,Multi-racial,Not Span/Hispanic,7,Emergency,Home w/ Home Health Services,2020,SYM017,ABNORMAL FINDINGS WITHOUT DIAGNOSIS,IMG008,ULTRASONOGRAPHY,724,OTHER INFECTIOUS & PARASITIC DISEASES,18,INFECTIOUS AND PARASITIC DISEASES (SYSTEMIC OR UNSPECIFIED SITES),4,Extreme,Major,Medical,Medicare,Medicare,Self-Pay,,,Y,116795.75,24740.41
New York City,Manhattan,7002054,001458,New York-Presbyterian Hospital - New York Weill Cornell Center,0 to 17,100,M,White,Not Span/Hispanic,8,Emergency,Home or Self Care,2020,PNL009,PERINATAL INFECTIONS,ADM021,"ADMINISTRATION OF THERAPEUTIC SUBSTANCES, NEC",724,OTHER INFECTIOUS & PARASITIC DISEASES,18,INFECTIOUS AND PARASITIC DISEASES (SYSTEMIC OR UNSPECIFIED SITES),3,Major,Moderate,Medical,Blue Cross/Blue Shield,Self-Pay,,03100,,Y,163805.41,74153.06
New York City,Manhattan,7002024,001456,Mount Sinai Hospital,18 to 29,OOS,F,Other Race,Spanish/Hispanic,2,Emergency,Home or Self Care,2020,DIG001,INTESTINAL INFECTION,,,724,OTHER INFECTIOUS & PARASITIC DISEASES,18,INFECTIOUS AND PARASITIC DISEASES (SYSTEMIC OR UNSPECIFIED SITES),2,Moderate,Minor,Medical,Private Health Insurance,Self-Pay,,,,Y,24490.51,6136.64
New York City,Bronx,7000006,001169,Montefiore Medical Center - Henry & Lucy Moses Div,50 to 69,104,M,Black/African American,Not Span/Hispanic,2,Emergency,Home or Self Care,2020,INF009,"PARASITIC, OTHER SPECIFIED AND UNSPECIFIED INFECTIONS",,,724,OTHER INFECTIOUS & PARASITIC DISEASES,18,INFECTIOUS AND PARASITIC DISEASES (SYSTEMIC OR UNSPECIFIED SITES),2,Moderate,Minor,Medical,Medicaid,,,,,Y,33064.96,5333.57
New York City,Bronx,7000006,003058,Montefiore Med Center - Jack D Weiler Hosp of A Einstein College Div,70 or Older,104,M,Black/African American,Not Span/Hispanic,12,Emergency,Inpatient Rehabilitation Facility,2020,INF010,SEXUALLY TRANSMITTED INFECTIONS (EXCLUDING HIV AND HEPATITIS),IMG007,COMPUTERIZED TOMOGRAPHY (CT) WITHOUT CONTRAST,724,OTHER INFECTIOUS & PARASITIC DISEASES,18,INFECTIOUS AND PARASITIC DISEASES (SYSTEMIC OR UNSPECIFIED SITES),1,Minor,Minor,Medical,Medicare,,,,,Y,107614.61,20607.5
New York City,Bronx,7000006,001169,Montefiore Medical Center - Henry & Lucy Moses Div,0 to 17,104,M,Other Race,Unknown,1,Emergency,Home or Self Care,2020,PNL009,PERINATAL INFECTIONS,,,724,OTHER INFECTIOUS & PARASITIC DISEASES,18,INFECTIOUS AND PARASITIC DISEASES (SYSTEMIC OR UNSPECIFIED SITES),2,Moderate,Minor,Medical,Medicaid,,,03000,,Y,14290,3449.61
Capital/Adirond,Otsego,3824000,000746,Mary Imogene Bassett Hospital,50 to 69,138,M,White,Not Span/Hispanic,3,Urgent,Home or Self Care,2020,INF009,"PARASITIC, OTHER SPECIFIED AND UNSPECIFIED INFECTIONS",,,724,OTHER INFECTIOUS & PARASITIC DISEASES,18,INFECTIOUS AND PARASITIC DISEASES (SYSTEMIC OR UNSPECIFIED SITES),2,Moderate,Moderate,Medical,Blue Cross/Blue Shield,,,,,N,6860.24,4092.45
Capital/Adirond,Otsego,3824000,000746,Mary Imogene Bassett Hospital,70 or Older,121,M,White,Not Span/Hispanic,7,Urgent,Home or Self Care,2020,INF009,"PARASITIC, OTHER SPECIFIED AND UNSPECIFIED INFECTIONS",,,724,OTHER INFECTIOUS & PARASITIC DISEASES,18,INFECTIOUS AND PARASITIC DISEASES (SYSTEMIC OR UNSPECIFIED SITES),3,Major,Major,Medical,Medicare,Blue Cross/Blue Shield,Private Health Insurance,,,N,24714.67,11186.97
New York City,Bronx,7000006,003058,Montefiore Med Center - Jack D Weiler Hosp of A Einstein College Div,50 to 69,104,M,Other Race,Unknown,4,Emergency,Home w/ Home Health Services,2020,SYM017,ABNORMAL FINDINGS WITHOUT DIAGNOSIS,CAR024,VENOUS AND ARTERIAL CATHETER PLACEMENT,724,OTHER INFECTIOUS & PARASITIC DISEASES,18,INFECTIOUS AND PARASITIC DISEASES (SYSTEMIC OR UNSPECIFIED SITES),1,Minor,Minor,Medical,Medicaid,,,,,Y,59552.82,10718.83
New York City,Bronx,7000006,001169,Montefiore Medical Center - Henry & Lucy Moses Div,0 to 17,104,M,Other Race,Spanish/Hispanic,1,Emergency,Home or Self Care,2020,PNL009,PERINATAL INFECTIONS,,,724,OTHER INFECTIOUS & PARASITIC DISEASES,18,INFECTIOUS AND PARASITIC DISEASES (SYSTEMIC OR UNSPECIFIED SITES),2,Moderate,Minor,Medical,Medicaid,,,03000,,Y,15278,3740.66
New York City,Bronx,7000006,001169,Montefiore Medical Center - Henry & Lucy Moses Div,0 to 17,104,F,Other Race,Unknown,1,Emergency,Home or Self Care,2020,PNL009,PERINATAL INFECTIONS,ADM021,"ADMINISTRATION OF THERAPEUTIC SUBSTANCES, NEC",724,OTHER INFECTIOUS & PARASITIC DISEASES,18,INFECTIOUS AND PARASITIC DISEASES (SYSTEMIC OR UNSPECIFIED SITES),2,Moderate,Minor,Medical,Medicaid,,,03200,,Y,25205.02,4110.66
New York City,Bronx,7000006,001169,Montefiore Medical Center - Henry & Lucy Moses Div,0 to 17,104,M,Other Race,Spanish/Hispanic,2,Emergency,Home or Self Care,2020,PNL009,PERINATAL INFECTIONS,CNS002,LUMBAR PUNCTURE,724,OTHER INFECTIOUS & PARASITIC DISEASES,18,INFECTIOUS AND PARASITIC DISEASES (SYSTEMIC OR UNSPECIFIED SITES),1,Minor,Minor,Medical,Medicaid,,,03000,,Y,37290.63,8003.45
New York City,Manhattan,7002053,001463,NYU Langone Hospitals,0 to 17,112,M,White,Not Span/Hispanic,4,Emergency,Home or Self Care,2020,PNL009,PERINATAL INFECTIONS,ADM021,"ADMINISTRATION OF THERAPEUTIC SUBSTANCES, NEC",724,OTHER INFECTIOUS & PARASITIC DISEASES,18,INFECTIOUS AND PARASITIC DISEASES (SYSTEMIC OR UNSPECIFIED SITES),3,Major,Moderate,Medical,Private Health Insurance,,,02200,,Y,61517.99,18590.07
New York City,Bronx,7000006,001169,Montefiore Medical Center - Henry & Lucy Moses Div,0 to 17,104,F,Other Race,Not Span/Hispanic,5,Emergency,Home or Self Care,2020,INF003,BACTERIAL INFECTIONS,,,724,OTHER INFECTIOUS & PARASITIC DISEASES,18,INFECTIOUS AND PARASITIC DISEASES (SYSTEMIC OR UNSPECIFIED SITES),2,Moderate,Minor,Medical,Medicaid,,,,,Y,77042.85,16182.16
New York City,Bronx,7000006,001169,Montefiore Medical Center - Henry & Lucy Moses Div,0 to 17,104,F,Black/African American,Not Span/Hispanic,2,Emergency,Home or Self Care,2020,PNL009,PERINATAL INFECTIONS,,,724,OTHER INFECTIOUS & PARASITIC DISEASES,18,INFECTIOUS AND PARASITIC DISEASES (SYSTEMIC OR UNSPECIFIED SITES),2,Moderate,Minor,Medical,Medicaid,,,03000,,Y,37499.82,7622.56
New York City,Manhattan,7002053,001463,NYU Langone Hospitals,70 or Older,112,F,White,Not Span/Hispanic,1,Emergency,Home or Self Care,2020,INF003,BACTERIAL INFECTIONS,,,724,OTHER INFECTIOUS & PARASITIC DISEASES,18,INFECTIOUS AND PARASITIC DISEASES (SYSTEMIC OR UNSPECIFIED SITES),2,Moderate,Moderate,Medical,Medicare,Medicare,,,,Y,21550.62,5005.73
New York City,Bronx,7000006,001169,Montefiore Medical Center - Henry & Lucy Moses Div,0 to 17,104,M,Other Race,Not Span/Hispanic,2,Emergency,Home or Self Care,2020,INF003,BACTERIAL INFECTIONS,,,724,OTHER INFECTIOUS & PARASITIC DISEASES,18,INFECTIOUS AND PARASITIC DISEASES (SYSTEMIC OR UNSPECIFIED SITES),1,Minor,Minor,Medical,Medicaid,,,,,Y,38003.65,7721.56