Hospital Service Area,Hospital County,Operating Certificate Number,Permanent Facility Id,Facility Name,Age Group,Zip Code - 3 digits,Gender,Race,Ethnicity,Length of Stay,Type of Admission,Patient Disposition,Discharge Year,CCS Diagnosis Code,CCS Diagnosis Description,CCS Procedure Code,CCS Procedure Description,APR DRG Code,APR DRG Description,APR MDC Code,APR MDC Description,APR Severity of Illness Code,APR Severity of Illness Description,APR Risk of Mortality,APR Medical Surgical Description,Payment Typology 1,Payment Typology 2,Payment Typology 3,Birth Weight,Abortion Edit Indicator,Emergency Department Indicator,Total Charges,Total Costs
Long Island,Nassau,2908000,000511,NYU Langone Hospital-Long Island,0 to 17,114,F,Black/African American,Not Span/Hispanic,2,Emergency,Home or Self Care,2020,PNL009,PERINATAL INFECTIONS,CNS002,LUMBAR PUNCTURE,724,OTHER INFECTIOUS & PARASITIC DISEASES,18,INFECTIOUS AND PARASITIC DISEASES (SYSTEMIC OR UNSPECIFIED SITES),2,Moderate,Minor,Medical,Medicaid,,,02900,,Y,25495.46,5779.51
Long Island,Nassau,2908000,000511,NYU Langone Hospital-Long Island,70 or Older,117,M,White,Not Span/Hispanic,8,Emergency,Skilled Nursing Home,2020,SYM017,ABNORMAL FINDINGS WITHOUT DIAGNOSIS,IMG008,ULTRASONOGRAPHY,724,OTHER INFECTIOUS & PARASITIC DISEASES,18,INFECTIOUS AND PARASITIC DISEASES (SYSTEMIC OR UNSPECIFIED SITES),3,Major,Major,Medical,Medicare,Medicare,,,,N,92886.07,29556.37
Long Island,Nassau,2908000,000511,NYU Langone Hospital-Long Island,0 to 17,117,M,White,Not Span/Hispanic,2,Emergency,Home or Self Care,2020,PNL009,PERINATAL INFECTIONS,CNS002,LUMBAR PUNCTURE,724,OTHER INFECTIOUS & PARASITIC DISEASES,18,INFECTIOUS AND PARASITIC DISEASES (SYSTEMIC OR UNSPECIFIED SITES),1,Minor,Minor,Medical,Blue Cross/Blue Shield,,,03500,,Y,24308.07,5489.49
Long Island,Nassau,2908000,000511,NYU Langone Hospital-Long Island,50 to 69,115,M,White,Not Span/Hispanic,2,Emergency,Home or Self Care,2020,INF003,BACTERIAL INFECTIONS,RHB003,SPEECH THERAPY EVALUATION,724,OTHER INFECTIOUS & PARASITIC DISEASES,18,INFECTIOUS AND PARASITIC DISEASES (SYSTEMIC OR UNSPECIFIED SITES),2,Moderate,Minor,Medical,Private Health Insurance,,,,,Y,38394.03,8777.67
Long Island,Nassau,2908000,000511,NYU Langone Hospital-Long Island,70 or Older,117,F,White,Not Span/Hispanic,4,Emergency,Hospice - Home,2020,SYM017,ABNORMAL FINDINGS WITHOUT DIAGNOSIS,,,724,OTHER INFECTIOUS & PARASITIC DISEASES,18,INFECTIOUS AND PARASITIC DISEASES (SYSTEMIC OR UNSPECIFIED SITES),2,Moderate,Major,Medical,Medicare,Medicaid,,,,Y,71455.53,17042.38
Long Island,Nassau,2908000,000511,NYU Langone Hospital-Long Island,0 to 17,115,M,White,Spanish/Hispanic,1,Emergency,Home or Self Care,2020,PNL009,PERINATAL INFECTIONS,,,724,OTHER INFECTIOUS & PARASITIC DISEASES,18,INFECTIOUS AND PARASITIC DISEASES (SYSTEMIC OR UNSPECIFIED SITES),1,Minor,Minor,Medical,Medicaid,,,04000,,Y,16108.52,3327.74
Long Island,Nassau,2908000,000511,NYU Langone Hospital-Long Island,30 to 49,115,M,Black/African American,Not Span/Hispanic,8,Emergency,Left Against Medical Advice,2020,SYM017,ABNORMAL FINDINGS WITHOUT DIAGNOSIS,OTR004,ISOLATION PROCEDURES,724,OTHER INFECTIOUS & PARASITIC DISEASES,18,INFECTIOUS AND PARASITIC DISEASES (SYSTEMIC OR UNSPECIFIED SITES),1,Minor,Moderate,Medical,Medicaid,,,,,Y,99251.21,28675.22
Long Island,Nassau,2908000,000511,NYU Langone Hospital-Long Island,70 or Older,119,F,White,Not Span/Hispanic,3,Emergency,Home or Self Care,2020,INF009,"PARASITIC, OTHER SPECIFIED AND UNSPECIFIED INFECTIONS",,,724,OTHER INFECTIOUS & PARASITIC DISEASES,18,INFECTIOUS AND PARASITIC DISEASES (SYSTEMIC OR UNSPECIFIED SITES),2,Moderate,Moderate,Medical,Medicare,,,,,Y,57590.68,13127.05
Long Island,Nassau,2908000,000511,NYU Langone Hospital-Long Island,18 to 29,115,M,White,Not Span/Hispanic,3,Emergency,Home w/ Home Health Services,2020,INF009,"PARASITIC, OTHER SPECIFIED AND UNSPECIFIED INFECTIONS",CNS002,LUMBAR PUNCTURE,724,OTHER INFECTIOUS & PARASITIC DISEASES,18,INFECTIOUS AND PARASITIC DISEASES (SYSTEMIC OR UNSPECIFIED SITES),1,Minor,Minor,Medical,Blue Cross/Blue Shield,,,,,Y,104970.86,20543.43
Long Island,Nassau,2908000,000511,NYU Langone Hospital-Long Island,0 to 17,115,F,Other Race,Not Span/Hispanic,2,Emergency,Home or Self Care,2020,INF009,"PARASITIC, OTHER SPECIFIED AND UNSPECIFIED INFECTIONS",,,724,OTHER INFECTIOUS & PARASITIC DISEASES,18,INFECTIOUS AND PARASITIC DISEASES (SYSTEMIC OR UNSPECIFIED SITES),1,Minor,Minor,Medical,Blue Cross/Blue Shield,,,,,Y,41797.48,8723.72
Long Island,Nassau,2908000,000511,NYU Langone Hospital-Long Island,50 to 69,118,M,White,Not Span/Hispanic,5,Emergency,Home or Self Care,2020,SYM017,ABNORMAL FINDINGS WITHOUT DIAGNOSIS,IMG008,ULTRASONOGRAPHY,724,OTHER INFECTIOUS & PARASITIC DISEASES,18,INFECTIOUS AND PARASITIC DISEASES (SYSTEMIC OR UNSPECIFIED SITES),1,Minor,Moderate,Medical,Private Health Insurance,,,,,Y,99782.64,28727.73
Long Island,Nassau,2908000,000511,NYU Langone Hospital-Long Island,50 to 69,117,M,White,Not Span/Hispanic,7,Emergency,Home or Self Care,2020,INF009,"PARASITIC, OTHER SPECIFIED AND UNSPECIFIED INFECTIONS",ADM010,VACCINATIONS,724,OTHER INFECTIOUS & PARASITIC DISEASES,18,INFECTIOUS AND PARASITIC DISEASES (SYSTEMIC OR UNSPECIFIED SITES),3,Major,Moderate,Medical,Medicare,Medicare,,,,Y,120855.13,37727.92
